hbase-builds mailing list archives

Site index · List index
Message view « Date » · « Thread »
Top « Date » · « Thread »
From Apache Jenkins Server <jenk...@builds.apache.org>
Subject Build failed in Jenkins: HBase-1.4 » JDK_1_7,Hadoop&&!H13 #898
Date Mon, 04 Sep 2017 06:54:27 GMT
See <https://builds.apache.org/job/HBase-1.4/jdk=JDK_1_7,label=Hadoop&&!H13/898/display/redirect?page=changes>

Changes:

[jerryjch] HBASE-18740 Upgrade Zookeeper version to 3.4.10

------------------------------------------
[...truncated 2.49 MB...]
Tests run: 1, Failures: 0, Errors: 0, Skipped: 0, Time elapsed: 1.173 sec - in org.apache.hadoop.hbase.zookeeper.TestZKTableStateManager
Running org.apache.hadoop.hbase.zookeeper.lock.TestZKInterProcessReadWriteLock
Running org.apache.hadoop.hbase.zookeeper.TestZKMulti
Tests run: 12, Failures: 0, Errors: 0, Skipped: 0, Time elapsed: 3.834 sec - in org.apache.hadoop.hbase.zookeeper.TestZKMulti
Running org.apache.hadoop.hbase.zookeeper.TestHQuorumPeer
Tests run: 4, Failures: 0, Errors: 0, Skipped: 0, Time elapsed: 1.08 sec - in org.apache.hadoop.hbase.zookeeper.TestHQuorumPeer
Running org.apache.hadoop.hbase.TestIOFencing
Tests run: 6, Failures: 0, Errors: 0, Skipped: 0, Time elapsed: 25.031 sec - in org.apache.hadoop.hbase.zookeeper.lock.TestZKInterProcessReadWriteLock
Running org.apache.hadoop.hbase.constraint.TestConstraint
Tests run: 33, Failures: 0, Errors: 0, Skipped: 0, Time elapsed: 91.984 sec - in org.apache.hadoop.hbase.wal.TestWALSplit
Running org.apache.hadoop.hbase.TestMovedRegionsCleaner
Tests run: 1, Failures: 0, Errors: 0, Skipped: 0, Time elapsed: 10.455 sec - in org.apache.hadoop.hbase.TestMovedRegionsCleaner
Running org.apache.hadoop.hbase.backup.TestHFileArchiving
Tests run: 33, Failures: 0, Errors: 0, Skipped: 0, Time elapsed: 90.177 sec - in org.apache.hadoop.hbase.wal.TestWALSplitCompressed
Tests run: 5, Failures: 0, Errors: 0, Skipped: 0, Time elapsed: 37.966 sec - in org.apache.hadoop.hbase.constraint.TestConstraint
Running org.apache.hadoop.hbase.backup.example.TestZooKeeperTableArchiveClient
Tests run: 3, Failures: 0, Errors: 0, Skipped: 0, Time elapsed: 4.406 sec - in org.apache.hadoop.hbase.backup.example.TestZooKeeperTableArchiveClient
Running org.apache.hadoop.hbase.tool.TestCanaryTool
Running org.apache.hadoop.hbase.TestHColumnDescriptorDefaultVersions
Tests run: 2, Failures: 0, Errors: 0, Skipped: 0, Time elapsed: 86.384 sec - in org.apache.hadoop.hbase.TestIOFencing
Running org.apache.hadoop.hbase.ipc.TestProtoBufRpc
Tests run: 1, Failures: 0, Errors: 0, Skipped: 0, Time elapsed: 2.28 sec - in org.apache.hadoop.hbase.ipc.TestProtoBufRpc
Tests run: 3, Failures: 0, Errors: 0, Skipped: 0, Time elapsed: 233.723 sec - in org.apache.hadoop.hbase.io.encoding.TestChangingEncoding
Running org.apache.hadoop.hbase.ipc.TestRpcServerSlowConnectionSetup
Running org.apache.hadoop.hbase.ipc.TestRpcClientLeaks
Tests run: 1, Failures: 0, Errors: 0, Skipped: 0, Time elapsed: 6.957 sec - in org.apache.hadoop.hbase.ipc.TestRpcServerSlowConnectionSetup
Running org.apache.hadoop.hbase.ipc.TestHBaseClient
Tests run: 1, Failures: 0, Errors: 0, Skipped: 0, Time elapsed: 0.465 sec - in org.apache.hadoop.hbase.ipc.TestHBaseClient
Tests run: 1, Failures: 0, Errors: 0, Skipped: 0, Time elapsed: 11.163 sec - in org.apache.hadoop.hbase.ipc.TestRpcClientLeaks
Tests run: 4, Failures: 0, Errors: 0, Skipped: 0, Time elapsed: 42.45 sec - in org.apache.hadoop.hbase.TestHColumnDescriptorDefaultVersions
Running org.apache.hadoop.hbase.TestNamespace
Tests run: 5, Failures: 0, Errors: 0, Skipped: 0, Time elapsed: 66.973 sec - in org.apache.hadoop.hbase.backup.TestHFileArchiving
Tests run: 7, Failures: 0, Errors: 0, Skipped: 0, Time elapsed: 102.818 sec - in org.apache.hadoop.hbase.tool.TestCanaryTool
Tests run: 8, Failures: 0, Errors: 0, Skipped: 0, Time elapsed: 63.564 sec - in org.apache.hadoop.hbase.TestNamespace

Results :

Tests in error: 
org.apache.hadoop.hbase.master.TestAssignmentListener.testAssignmentListener(org.apache.hadoop.hbase.master.TestAssignmentListener)
  Run 1: TestAssignmentListener.testAssignmentListener:228 » TestTimedOut test timed ou...
  Run 2: TestAssignmentListener.testAssignmentListener:228 » TestTimedOut test timed ou...
  Run 3: TestAssignmentListener.testAssignmentListener:228 » TestTimedOut test timed ou...

org.apache.hadoop.hbase.security.access.TestAccessController3.org.apache.hadoop.hbase.security.access.TestAccessController3
  Run 1: TestAccessController3.setupBeforeClass:190->setUpTableAndUserPermissions:211->SecureTestUtil.createTable:721->SecureTestUtil.createTable:737
» RetriesExhausted
  Run 2: TestAccessController3.tearDownAfterClass:200->cleanUp:263->SecureTestUtil.deleteTable:748->SecureTestUtil.deleteTable:765
» NullPointer

Flaked tests: 
org.apache.hadoop.hbase.replication.TestReplicationSmallTests.testDisableEnable(org.apache.hadoop.hbase.replication.TestReplicationSmallTests)
  Run 1: TestReplicationSmallTests.testDisableEnable:326 Replication wasn't disabled
  Run 2: PASS

org.apache.hadoop.hbase.replication.TestReplicationSmallTests.testSimplePutDelete(org.apache.hadoop.hbase.replication.TestReplicationSmallTests)
  Run 1: TestReplicationSmallTests.testSimplePutDelete:226 Waited too much time for put replication
  Run 2: PASS

org.apache.hadoop.hbase.replication.TestReplicationSmallTests.testVersionMismatchHBase14905(org.apache.hadoop.hbase.replication.TestReplicationSmallTests)
  Run 1: TestReplicationSmallTests.testVersionMismatchHBase14905:708 Waited too much time
for normal batch replication
  Run 2: PASS

org.apache.hadoop.hbase.replication.regionserver.TestRegionReplicaReplicationEndpoint.testRegionReplicaReplicationForFlushAndCompaction(org.apache.hadoop.hbase.replication.regionserver.TestRegionReplicaReplicationEndpoint)
  Run 1: TestRegionReplicaReplicationEndpoint.testRegionReplicaReplicationForFlushAndCompaction:306
» RetriesExhausted
  Run 2: TestRegionReplicaReplicationEndpoint.testRegionReplicaReplicationForFlushAndCompaction:306
» RetriesExhausted
  Run 3: PASS

org.apache.hadoop.hbase.replication.regionserver.TestRegionReplicaReplicationEndpoint.testRegionReplicaReplicationIgnoresDisabledTables(org.apache.hadoop.hbase.replication.regionserver.TestRegionReplicaReplicationEndpoint)
  Run 1: TestRegionReplicaReplicationEndpoint.testRegionReplicaReplicationIgnoresDisabledTables:332->testRegionReplicaReplicationIgnoresDisabledTables:351
» RetriesExhausted
  Run 2: TestRegionReplicaReplicationEndpoint.testRegionReplicaReplicationIgnoresDisabledTables:332->testRegionReplicaReplicationIgnoresDisabledTables:351
» RetriesExhausted
  Run 3: PASS

org.apache.hadoop.hbase.replication.regionserver.TestRegionReplicaReplicationEndpoint.testRegionReplicaReplicationIgnoresDroppedTables(org.apache.hadoop.hbase.replication.regionserver.TestRegionReplicaReplicationEndpoint)
  Run 1: TestRegionReplicaReplicationEndpoint.testRegionReplicaReplicationIgnoresDroppedTables:337->testRegionReplicaReplicationIgnoresDisabledTables:350
» RetriesExhausted
  Run 2: TestRegionReplicaReplicationEndpoint.testRegionReplicaReplicationIgnoresDroppedTables:337->testRegionReplicaReplicationIgnoresDisabledTables:350
» RetriesExhausted
  Run 3: PASS

org.apache.hadoop.hbase.replication.regionserver.TestRegionReplicaReplicationEndpoint.testRegionReplicaReplicationPeerIsCreated(org.apache.hadoop.hbase.replication.regionserver.TestRegionReplicaReplicationEndpoint)
  Run 1: TestRegionReplicaReplicationEndpoint.testRegionReplicaReplicationPeerIsCreated:121
» RetriesExhausted
  Run 2: TestRegionReplicaReplicationEndpoint.testRegionReplicaReplicationPeerIsCreated:121
» RetriesExhausted
  Run 3: PASS

org.apache.hadoop.hbase.replication.regionserver.TestRegionReplicaReplicationEndpoint.testRegionReplicaReplicationPeerIsCreatedForModifyTable(org.apache.hadoop.hbase.replication.regionserver.TestRegionReplicaReplicationEndpoint)
  Run 1: TestRegionReplicaReplicationEndpoint.testRegionReplicaReplicationPeerIsCreatedForModifyTable:152
» RetriesExhausted
  Run 2: TestRegionReplicaReplicationEndpoint.testRegionReplicaReplicationPeerIsCreatedForModifyTable:152
» RetriesExhausted
  Run 3: PASS

org.apache.hadoop.hbase.replication.regionserver.TestRegionReplicaReplicationEndpoint.testRegionReplicaReplicationWith10Replicas(org.apache.hadoop.hbase.replication.regionserver.TestRegionReplicaReplicationEndpoint)
  Run 1: TestRegionReplicaReplicationEndpoint.testRegionReplicaReplicationWith10Replicas:261->testRegionReplicaReplication:180
» RetriesExhausted
  Run 2: TestRegionReplicaReplicationEndpoint.testRegionReplicaReplicationWith10Replicas:261->testRegionReplicaReplication:180
» RetriesExhausted
  Run 3: PASS

org.apache.hadoop.hbase.replication.regionserver.TestRegionReplicaReplicationEndpoint.testRegionReplicaReplicationWith2Replicas(org.apache.hadoop.hbase.replication.regionserver.TestRegionReplicaReplicationEndpoint)
  Run 1: TestRegionReplicaReplicationEndpoint.testRegionReplicaReplicationWith2Replicas:251->testRegionReplicaReplication:180
» RetriesExhausted
  Run 2: TestRegionReplicaReplicationEndpoint.testRegionReplicaReplicationWith2Replicas:251->testRegionReplicaReplication:180
» RetriesExhausted
  Run 3: PASS

org.apache.hadoop.hbase.replication.regionserver.TestRegionReplicaReplicationEndpoint.testRegionReplicaReplicationWith3Replicas(org.apache.hadoop.hbase.replication.regionserver.TestRegionReplicaReplicationEndpoint)
  Run 1: TestRegionReplicaReplicationEndpoint.testRegionReplicaReplicationWith3Replicas:256->testRegionReplicaReplication:180
» RetriesExhausted
  Run 2: TestRegionReplicaReplicationEndpoint.testRegionReplicaReplicationWith3Replicas:256->testRegionReplicaReplication:180
» RetriesExhausted
  Run 3: PASS

org.apache.hadoop.hbase.replication.regionserver.TestRegionReplicaReplicationEndpoint.testRegionReplicaWithoutMemstoreReplication(org.apache.hadoop.hbase.replication.regionserver.TestRegionReplicaReplicationEndpoint)
  Run 1: TestRegionReplicaReplicationEndpoint.testRegionReplicaWithoutMemstoreReplication:271
» RetriesExhausted
  Run 2: TestRegionReplicaReplicationEndpoint.testRegionReplicaWithoutMemstoreReplication:271
» RetriesExhausted
  Run 3: PASS


Tests run: 2853, Failures: 0, Errors: 2, Skipped: 57, Flakes: 12

[INFO] ------------------------------------------------------------------------
[INFO] Reactor Summary:
[INFO] 
[INFO] Apache HBase ...................................... SUCCESS [1:47.419s]
[INFO] Apache HBase - Checkstyle ......................... SUCCESS [15.929s]
[INFO] Apache HBase - Resource Bundle .................... SUCCESS [0.285s]
[INFO] Apache HBase - Annotations ........................ SUCCESS [1.462s]
[INFO] Apache HBase - Protocol ........................... SUCCESS [17.191s]
[INFO] Apache HBase - Common ............................. SUCCESS [2:44.561s]
[INFO] Apache HBase - Procedure .......................... SUCCESS [3:32.213s]
[INFO] Apache HBase - Metrics API ........................ SUCCESS [1.428s]
[INFO] Apache HBase - Hadoop Compatibility ............... SUCCESS [11.720s]
[INFO] Apache HBase - Metrics Implementation ............. SUCCESS [5.515s]
[INFO] Apache HBase - Hadoop Two Compatibility ........... SUCCESS [20.897s]
[INFO] Apache HBase - Client ............................. SUCCESS [1:45.748s]
[INFO] Apache HBase - Prefix Tree ........................ SUCCESS [9.829s]
[INFO] Apache HBase - Server ............................. FAILURE [1:52:16.578s]
[INFO] Apache HBase - Testing Util ....................... SKIPPED
[INFO] Apache HBase - Thrift ............................. SKIPPED
[INFO] Apache HBase - Rest ............................... SKIPPED
[INFO] Apache HBase - Shell .............................. SKIPPED
[INFO] Apache HBase - Integration Tests .................. SKIPPED
[INFO] Apache HBase - Examples ........................... SKIPPED
[INFO] Apache HBase - External Block Cache ............... SKIPPED
[INFO] Apache HBase - Assembly ........................... SKIPPED
[INFO] Apache HBase - Shaded ............................. SKIPPED
[INFO] Apache HBase - Shaded - Client .................... SKIPPED
[INFO] Apache HBase - Shaded - Server .................... SKIPPED
[INFO] Apache HBase Shaded Packaging Invariants .......... SKIPPED
[INFO] Apache HBase - Archetypes ......................... SKIPPED
[INFO] Apache HBase - Exemplar for hbase-client archetype  SKIPPED
[INFO] Apache HBase - Exemplar for hbase-shaded-client archetype  SKIPPED
[INFO] Apache HBase - Archetype builder .................. SKIPPED
[INFO] ------------------------------------------------------------------------
[INFO] BUILD FAILURE
[INFO] ------------------------------------------------------------------------
[INFO] Total time: 2:04:04.262s
[INFO] Finished at: Mon Sep 04 06:45:26 UTC 2017
[INFO] Final Memory: 103M/1492M
[INFO] ------------------------------------------------------------------------
[ERROR] Failed to execute goal org.apache.maven.plugins:maven-surefire-plugin:2.18.1:test
(secondPartTestsExecution) on project hbase-server: ExecutionException: java.lang.RuntimeException:
There was an error in the forked process
[ERROR] java.lang.ArrayIndexOutOfBoundsException: 1
[ERROR] at org.apache.maven.surefire.common.junit4.JUnit4ProviderUtil.generateFailingTests(JUnit4ProviderUtil.java:64)
[ERROR] at org.apache.maven.surefire.junitcore.JUnitCoreProvider.invoke(JUnitCoreProvider.java:151)
[ERROR] at org.apache.maven.surefire.booter.ForkedBooter.invokeProviderInSameClassLoader(ForkedBooter.java:203)
[ERROR] at org.apache.maven.surefire.booter.ForkedBooter.runSuitesInProcess(ForkedBooter.java:155)
[ERROR] at org.apache.maven.surefire.booter.ForkedBooter.main(ForkedBooter.java:103)
[ERROR] -> [Help 1]
[ERROR] 
[ERROR] To see the full stack trace of the errors, re-run Maven with the -e switch.
[ERROR] Re-run Maven using the -X switch to enable full debug logging.
[ERROR] 
[ERROR] For more information about the errors and possible solutions, please read the following
articles:
[ERROR] [Help 1] http://cwiki.apache.org/confluence/display/MAVEN/MojoFailureException
[ERROR] 
[ERROR] After correcting the problems, you can resume the build with the command
[ERROR]   mvn <goals> -rf :hbase-server
Build step 'Invoke top-level Maven targets' marked build as failure
Performing Post build task...
Match found for :.* : True
Logical operation result is TRUE
Running script  : # Post-build task script. TODO: Check this in and have all builds reference
check-in.
pwd && ls
# NOTE!!!! The below code has been copied and pasted from ./dev-tools/run-test.sh
# Do not change here without syncing there and vice-versa.
ZOMBIE_TESTS_COUNT=`jps -v | grep surefirebooter | grep -e '-Dhbase.test' | wc -l`
if [[ $ZOMBIE_TESTS_COUNT != 0 ]] ; then
 echo "Suspicious java process found - waiting 30s to see if there are just slow to stop"
 sleep 30
 ZOMBIE_TESTS_COUNT=`jps -v | grep surefirebooter | grep -e '-Dhbase.test' | wc -l`
 if [[ $ZOMBIE_TESTS_COUNT != 0 ]] ; then
   echo " {color:red}There appear to be $ZOMBIE_TESTS_COUNT zombie tests{color}, they should
have been killed by surefire but survived"
   jps -v | grep surefirebooter | grep -e '-Dhbase.test'
   jps -v | grep surefirebooter | grep -e '-Dhbase.test' | cut -d ' ' -f 1 | xargs -n 1 jstack
   # Exit with error
   exit 1
 else
   echo "We're ok: there is no zombie test, but some tests took some time to stop"
 fi
else
  echo "We're ok: there is no zombie test"
fi
Setting JDK_1_7_LATEST__HOME=/home/jenkins/tools/java/latest1.7
Setting JDK_1_8_LATEST__HOME=/home/jenkins/tools/java/latest1.8
[19ccb43d] $ /bin/bash -xe /tmp/jenkins7316837795257255339.sh
+ pwd
<https://builds.apache.org/job/HBase-1.4/jdk=JDK_1_7,label=Hadoop&&!H13/ws/>
+ ls
bin
CHANGES.txt
conf
dev-support
extra_env_var
hbase-annotations
hbase-archetypes
hbase-assembly
hbase-checkstyle
hbase-client
hbase-common
hbase-examples
hbase-external-blockcache
hbase-hadoop2-compat
hbase-hadoop-compat
hbase-it
hbase-metrics
hbase-metrics-api
hbase-native-client
hbase-prefix-tree
hbase-procedure
hbase-protocol
hbase-resource-bundle
hbase-rest
hbase-server
hbase-shaded
hbase-shell
hbase-testing-util
hbase-thrift
LICENSE.txt
NOTICE.txt
pom.xml
README.txt
src
target
++ jps -v
++ grep surefirebooter
++ grep -e -Dhbase.test
++ wc -l
+ ZOMBIE_TESTS_COUNT=0
+ [[ 0 != 0 ]]
+ echo 'We'\''re ok: there is no zombie test'
We're ok: there is no zombie test
POST BUILD TASK : SUCCESS
END OF POST BUILD TASK : 0
Archiving artifacts
Setting JDK_1_7_LATEST__HOME=/home/jenkins/tools/java/latest1.7
Setting JDK_1_8_LATEST__HOME=/home/jenkins/tools/java/latest1.8
Recording test results
Setting JDK_1_7_LATEST__HOME=/home/jenkins/tools/java/latest1.7
Setting JDK_1_8_LATEST__HOME=/home/jenkins/tools/java/latest1.8
Setting JDK_1_7_LATEST__HOME=/home/jenkins/tools/java/latest1.7
Setting JDK_1_8_LATEST__HOME=/home/jenkins/tools/java/latest1.8

Mime
View raw message