hbase-builds mailing list archives

Site index · List index
Message view « Date » · « Thread »
Top « Date » · « Thread »
From Apache Jenkins Server <jenk...@builds.apache.org>
Subject Build failed in Jenkins: HBase-1.4 » JDK_1_8,Hadoop&&!H13 #895
Date Thu, 31 Aug 2017 00:56:50 GMT
See <https://builds.apache.org/job/HBase-1.4/jdk=JDK_1_8,label=Hadoop&&!H13/895/display/redirect?page=changes>

Changes:

[busbey] HBASE-18675 Making {max,min}SessionTimeout configurable for

------------------------------------------
[...truncated 2.48 MB...]
Tests run: 1, Failures: 0, Errors: 0, Skipped: 0, Time elapsed: 9.293 sec - in org.apache.hadoop.hbase.filter.TestScanRowPrefix
Tests run: 1, Failures: 0, Errors: 0, Skipped: 0, Time elapsed: 6.617 sec - in org.apache.hadoop.hbase.filter.TestFilterWithScanLimits
Running org.apache.hadoop.hbase.filter.TestFuzzyRowFilterEndToEnd
Running org.apache.hadoop.hbase.filter.TestFilterWrapper
Tests run: 1, Failures: 0, Errors: 0, Skipped: 0, Time elapsed: 5.566 sec - in org.apache.hadoop.hbase.filter.TestFilterWrapper
Tests run: 24, Failures: 0, Errors: 0, Skipped: 0, Time elapsed: 99.705 sec - in org.apache.hadoop.hbase.io.encoding.TestEncodedSeekers
Running org.apache.hadoop.hbase.filter.TestFilterListOrOperatorWithBlkCnt
Running org.apache.hadoop.hbase.filter.TestColumnRangeFilter
Tests run: 1, Failures: 0, Errors: 0, Skipped: 0, Time elapsed: 13.106 sec - in org.apache.hadoop.hbase.filter.TestFilterListOrOperatorWithBlkCnt
Tests run: 1, Failures: 0, Errors: 0, Skipped: 0, Time elapsed: 11.948 sec - in org.apache.hadoop.hbase.filter.TestColumnRangeFilter
Running org.apache.hadoop.hbase.filter.TestFuzzyRowAndColumnRangeFilter
Running org.apache.hadoop.hbase.filter.TestMultiRowRangeFilter
Tests run: 3, Failures: 0, Errors: 0, Skipped: 0, Time elapsed: 157.513 sec - in org.apache.hadoop.hbase.io.encoding.TestChangingEncoding
Tests run: 1, Failures: 0, Errors: 0, Skipped: 0, Time elapsed: 6.994 sec - in org.apache.hadoop.hbase.filter.TestFuzzyRowAndColumnRangeFilter
Tests run: 21, Failures: 0, Errors: 0, Skipped: 0, Time elapsed: 24.039 sec - in org.apache.hadoop.hbase.filter.TestMultiRowRangeFilter
Tests run: 4, Failures: 0, Errors: 0, Skipped: 0, Time elapsed: 198.422 sec - in org.apache.hadoop.hbase.filter.TestFuzzyRowFilterEndToEnd
Tests run: 10, Failures: 0, Errors: 2, Skipped: 0, Time elapsed: 714.911 sec <<<
FAILURE! - in org.apache.hadoop.hbase.mapreduce.TestTableSnapshotInputFormat
testRestoreSnapshotDoesNotCreateBackRefLinks(org.apache.hadoop.hbase.mapreduce.TestTableSnapshotInputFormat)
 Time elapsed: 600.041 sec  <<< ERROR!
org.junit.runners.model.TestTimedOutException: test timed out after 10 minutes
	at java.lang.Object.wait(Native Method)
	at org.apache.hadoop.hbase.client.RpcRetryingCaller.callWithRetries(RpcRetryingCaller.java:186)
	at org.apache.hadoop.hbase.client.HBaseAdmin.executeCallable(HBaseAdmin.java:4444)
	at org.apache.hadoop.hbase.client.HBaseAdmin.executeCallable(HBaseAdmin.java:4436)
	at org.apache.hadoop.hbase.client.HBaseAdmin.deleteSnapshot(HBaseAdmin.java:4316)
	at org.apache.hadoop.hbase.mapreduce.TableSnapshotInputFormatTestBase.testRestoreSnapshotDoesNotCreateBackRefLinks(TableSnapshotInputFormatTestBase.java:153)
	at sun.reflect.NativeMethodAccessorImpl.invoke0(Native Method)
	at sun.reflect.NativeMethodAccessorImpl.invoke(NativeMethodAccessorImpl.java:62)
	at sun.reflect.DelegatingMethodAccessorImpl.invoke(DelegatingMethodAccessorImpl.java:43)
	at java.lang.reflect.Method.invoke(Method.java:498)
	at org.junit.runners.model.FrameworkMethod$1.runReflectiveCall(FrameworkMethod.java:50)
	at org.junit.internal.runners.model.ReflectiveCallable.run(ReflectiveCallable.java:12)
	at org.junit.runners.model.FrameworkMethod.invokeExplosively(FrameworkMethod.java:47)
	at org.junit.internal.runners.statements.InvokeMethod.evaluate(InvokeMethod.java:17)
	at org.junit.internal.runners.statements.RunAfters.evaluate(RunAfters.java:27)
	at org.junit.internal.runners.statements.FailOnTimeout$CallableStatement.call(FailOnTimeout.java:298)
	at org.junit.internal.runners.statements.FailOnTimeout$CallableStatement.call(FailOnTimeout.java:292)
	at java.util.concurrent.FutureTask.run(FutureTask.java:266)
	at java.lang.Thread.run(Thread.java:748)

testRestoreSnapshotDoesNotCreateBackRefLinks(org.apache.hadoop.hbase.mapreduce.TestTableSnapshotInputFormat)
 Time elapsed: 600.041 sec  <<< ERROR!
java.lang.Exception: Appears to be stuck in thread NIOServerCxn.Factory:0.0.0.0/0.0.0.0:57801
	at sun.nio.ch.EPollArrayWrapper.epollWait(Native Method)
	at sun.nio.ch.EPollArrayWrapper.poll(EPollArrayWrapper.java:269)
	at sun.nio.ch.EPollSelectorImpl.doSelect(EPollSelectorImpl.java:93)
	at sun.nio.ch.SelectorImpl.lockAndDoSelect(SelectorImpl.java:86)
	at sun.nio.ch.SelectorImpl.select(SelectorImpl.java:97)
	at org.apache.zookeeper.server.NIOServerCnxnFactory.run(NIOServerCnxnFactory.java:178)
	at java.lang.Thread.run(Thread.java:748)

Tests run: 1, Failures: 0, Errors: 0, Skipped: 0, Time elapsed: 726.004 sec - in org.apache.hadoop.hbase.mapreduce.TestTableSnapshotInputFormat

Results :

Tests in error: 
org.apache.hadoop.hbase.regionserver.TestRSKilledWhenInitializing.testRSTerminationAfterRegisteringToMasterBeforeCreatingEphemeralNode(org.apache.hadoop.hbase.regionserver.TestRSKilledWhenInitializing)
  Run 1: TestRSKilledWhenInitializing.testRSTerminationAfterRegisteringToMasterBeforeCreatingEphemeralNode:142
null
  Run 2: TestRSKilledWhenInitializing.testRSTerminationAfterRegisteringToMasterBeforeCreatingEphemeralNode:115
» TestTimedOut
  Run 3: TestRSKilledWhenInitializing.testRSTerminationAfterRegisteringToMasterBeforeCreatingEphemeralNode
» 
  Run 4: TestRSKilledWhenInitializing.testRSTerminationAfterRegisteringToMasterBeforeCreatingEphemeralNode:115
» TestTimedOut
  Run 5: TestRSKilledWhenInitializing.testRSTerminationAfterRegisteringToMasterBeforeCreatingEphemeralNode
» 

Flaked tests: 
org.apache.hadoop.hbase.TestZooKeeper.testMasterZKSessionRecoveryFailure(org.apache.hadoop.hbase.TestZooKeeper)
  Run 1: TestZooKeeper.testMasterZKSessionRecoveryFailure:243->testSanity:258->Object.wait:-2
» TestTimedOut
  Run 2: PASS

org.apache.hadoop.hbase.client.TestClientScannerRPCTimeout.testScannerNextRPCTimesout(org.apache.hadoop.hbase.client.TestClientScannerRPCTimeout)
  Run 1: TestClientScannerRPCTimeout.testScannerNextRPCTimesout:87 » TableExists testSc...
  Run 2: TestClientScannerRPCTimeout.testScannerNextRPCTimesout:87 » TableExists testSc...
  Run 3: PASS

org.apache.hadoop.hbase.mapred.TestTableSnapshotInputFormat.testWithMapReduceMultiRegion(org.apache.hadoop.hbase.mapred.TestTableSnapshotInputFormat)
  Run 1: TestTableSnapshotInputFormat.testWithMapReduceMultiRegion:140->TableSnapshotInputFormatTestBase.testWithMapReduce:168->testWithMapReduceImpl:224->doTestWithMapReduce:234->TableSnapshotInputFormatTestBase.createTableAndSnapshot:206
» RetriesExhausted
  Run 2: PASS

org.apache.hadoop.hbase.mapreduce.TestTableSnapshotInputFormat.testRestoreSnapshotDoesNotCreateBackRefLinks(org.apache.hadoop.hbase.mapreduce.TestTableSnapshotInputFormat)
  Run 1: TestTableSnapshotInputFormat>TableSnapshotInputFormatTestBase.testRestoreSnapshotDoesNotCreateBackRefLinks:153->Object.wait:-2
» TestTimedOut
  Run 2: TestTableSnapshotInputFormat.testRestoreSnapshotDoesNotCreateBackRefLinks »  A...
  Run 3: PASS

org.apache.hadoop.hbase.master.TestMasterFailover.testMetaInTransitionWhenMasterFailover(org.apache.hadoop.hbase.master.TestMasterFailover)
  Run 1: TestMasterFailover.testMetaInTransitionWhenMasterFailover:1380 » NullPointer
  Run 2: PASS

org.apache.hadoop.hbase.util.TestHBaseFsck.testHbckReportReplicaLingeringSplitParent(org.apache.hadoop.hbase.util.TestHBaseFsck)
  Run 1: TestHBaseFsck.testHbckReportReplicaLingeringSplitParent:230 expected:<[]> but
was:<[NOT_DEPLOYED, NOT_DEPLOYED, HOLE_IN_REGION_CHAIN]>
  Run 2: PASS


Tests run: 2853, Failures: 0, Errors: 1, Skipped: 57, Flakes: 6

[INFO] ------------------------------------------------------------------------
[INFO] Reactor Summary:
[INFO] 
[INFO] Apache HBase ...................................... SUCCESS [1:44.946s]
[INFO] Apache HBase - Checkstyle ......................... SUCCESS [15.322s]
[INFO] Apache HBase - Resource Bundle .................... SUCCESS [0.194s]
[INFO] Apache HBase - Annotations ........................ SUCCESS [1.202s]
[INFO] Apache HBase - Protocol ........................... SUCCESS [16.282s]
[INFO] Apache HBase - Common ............................. SUCCESS [2:36.835s]
[INFO] Apache HBase - Procedure .......................... SUCCESS [3:38.158s]
[INFO] Apache HBase - Metrics API ........................ SUCCESS [1.143s]
[INFO] Apache HBase - Hadoop Compatibility ............... SUCCESS [11.299s]
[INFO] Apache HBase - Metrics Implementation ............. SUCCESS [5.217s]
[INFO] Apache HBase - Hadoop Two Compatibility ........... SUCCESS [19.688s]
[INFO] Apache HBase - Client ............................. SUCCESS [1:43.989s]
[INFO] Apache HBase - Prefix Tree ........................ SUCCESS [9.353s]
[INFO] Apache HBase - Server ............................. FAILURE [1:45:18.450s]
[INFO] Apache HBase - Testing Util ....................... SKIPPED
[INFO] Apache HBase - Thrift ............................. SKIPPED
[INFO] Apache HBase - Rest ............................... SKIPPED
[INFO] Apache HBase - Shell .............................. SKIPPED
[INFO] Apache HBase - Integration Tests .................. SKIPPED
[INFO] Apache HBase - Examples ........................... SKIPPED
[INFO] Apache HBase - External Block Cache ............... SKIPPED
[INFO] Apache HBase - Assembly ........................... SKIPPED
[INFO] Apache HBase - Shaded ............................. SKIPPED
[INFO] Apache HBase - Shaded - Client .................... SKIPPED
[INFO] Apache HBase - Shaded - Server .................... SKIPPED
[INFO] Apache HBase Shaded Packaging Invariants .......... SKIPPED
[INFO] Apache HBase - Archetypes ......................... SKIPPED
[INFO] Apache HBase - Exemplar for hbase-client archetype  SKIPPED
[INFO] Apache HBase - Exemplar for hbase-shaded-client archetype  SKIPPED
[INFO] Apache HBase - Archetype builder .................. SKIPPED
[INFO] ------------------------------------------------------------------------
[INFO] BUILD FAILURE
[INFO] ------------------------------------------------------------------------
[INFO] Total time: 1:56:54.259s
[INFO] Finished at: Thu Aug 31 00:46:17 UTC 2017
[INFO] Final Memory: 104M/795M
[INFO] ------------------------------------------------------------------------
[ERROR] Failed to execute goal org.apache.maven.plugins:maven-surefire-plugin:2.18.1:test
(secondPartTestsExecution) on project hbase-server: There are test failures.
[ERROR] 
[ERROR] Please refer to <https://builds.apache.org/job/HBase-1.4/jdk=JDK_1_8,label=Hadoop&&!H13/ws/hbase-server/target/surefire-reports>
for the individual test results.
[ERROR] -> [Help 1]
[ERROR] 
[ERROR] To see the full stack trace of the errors, re-run Maven with the -e switch.
[ERROR] Re-run Maven using the -X switch to enable full debug logging.
[ERROR] 
[ERROR] For more information about the errors and possible solutions, please read the following
articles:
[ERROR] [Help 1] http://cwiki.apache.org/confluence/display/MAVEN/MojoFailureException
[ERROR] 
[ERROR] After correcting the problems, you can resume the build with the command
[ERROR]   mvn <goals> -rf :hbase-server
Build step 'Invoke top-level Maven targets' marked build as failure
Performing Post build task...
Match found for :.* : True
Logical operation result is TRUE
Running script  : # Post-build task script. TODO: Check this in and have all builds reference
check-in.
pwd && ls
# NOTE!!!! The below code has been copied and pasted from ./dev-tools/run-test.sh
# Do not change here without syncing there and vice-versa.
ZOMBIE_TESTS_COUNT=`jps -v | grep surefirebooter | grep -e '-Dhbase.test' | wc -l`
if [[ $ZOMBIE_TESTS_COUNT != 0 ]] ; then
 echo "Suspicious java process found - waiting 30s to see if there are just slow to stop"
 sleep 30
 ZOMBIE_TESTS_COUNT=`jps -v | grep surefirebooter | grep -e '-Dhbase.test' | wc -l`
 if [[ $ZOMBIE_TESTS_COUNT != 0 ]] ; then
   echo " {color:red}There appear to be $ZOMBIE_TESTS_COUNT zombie tests{color}, they should
have been killed by surefire but survived"
   jps -v | grep surefirebooter | grep -e '-Dhbase.test'
   jps -v | grep surefirebooter | grep -e '-Dhbase.test' | cut -d ' ' -f 1 | xargs -n 1 jstack
   # Exit with error
   exit 1
 else
   echo "We're ok: there is no zombie test, but some tests took some time to stop"
 fi
else
  echo "We're ok: there is no zombie test"
fi
Setting JDK_1_7_LATEST__HOME=/home/jenkins/tools/java/latest1.7
Setting JDK_1_8_LATEST__HOME=/home/jenkins/tools/java/latest1.8
[30b16b4c] $ /bin/bash -xe /tmp/jenkins8487300238848429289.sh
+ pwd
<https://builds.apache.org/job/HBase-1.4/jdk=JDK_1_8,label=Hadoop&&!H13/ws/>
+ ls
bin
CHANGES.txt
conf
dev-support
extra_env_var
hbase-annotations
hbase-archetypes
hbase-assembly
hbase-checkstyle
hbase-client
hbase-common
hbase-examples
hbase-external-blockcache
hbase-hadoop2-compat
hbase-hadoop-compat
hbase-it
hbase-metrics
hbase-metrics-api
hbase-native-client
hbase-prefix-tree
hbase-procedure
hbase-protocol
hbase-resource-bundle
hbase-rest
hbase-server
hbase-shaded
hbase-shell
hbase-testing-util
hbase-thrift
LICENSE.txt
NOTICE.txt
pom.xml
README.txt
src
target
++ jps -v
++ grep surefirebooter
++ wc -l
++ grep -e -Dhbase.test
+ ZOMBIE_TESTS_COUNT=0
+ [[ 0 != 0 ]]
+ echo 'We'\''re ok: there is no zombie test'
We're ok: there is no zombie test
POST BUILD TASK : SUCCESS
END OF POST BUILD TASK : 0
Archiving artifacts
Setting JDK_1_7_LATEST__HOME=/home/jenkins/tools/java/latest1.7
Setting JDK_1_8_LATEST__HOME=/home/jenkins/tools/java/latest1.8
Recording test results
Setting JDK_1_7_LATEST__HOME=/home/jenkins/tools/java/latest1.7
Setting JDK_1_8_LATEST__HOME=/home/jenkins/tools/java/latest1.8
ERROR: Step ‘Publish JUnit test result report’ aborted due to exception: 
java.lang.OutOfMemoryError: Java heap space
Caused: java.io.IOException: Remote call on H6 failed
	at hudson.remoting.Channel.call(Channel.java:838)
	at hudson.FilePath.act(FilePath.java:986)
Caused: java.io.IOException: remote file operation failed: <https://builds.apache.org/job/HBase-1.4/jdk=JDK_1_8,label=Hadoop&&!H13/ws/>
at hudson.remoting.Channel@4c3ad66e:H6
	at hudson.FilePath.act(FilePath.java:993)
	at hudson.FilePath.act(FilePath.java:975)
	at hudson.tasks.junit.JUnitParser.parseResult(JUnitParser.java:103)
	at hudson.tasks.junit.JUnitResultArchiver.parse(JUnitResultArchiver.java:128)
	at hudson.tasks.junit.JUnitResultArchiver.perform(JUnitResultArchiver.java:149)
	at hudson.tasks.BuildStepCompatibilityLayer.perform(BuildStepCompatibilityLayer.java:81)
	at hudson.tasks.BuildStepMonitor$1.perform(BuildStepMonitor.java:20)
	at hudson.model.AbstractBuild$AbstractBuildExecution.perform(AbstractBuild.java:735)
	at hudson.model.AbstractBuild$AbstractBuildExecution.performAllBuildSteps(AbstractBuild.java:676)
	at hudson.model.Build$BuildExecution.post2(Build.java:186)
	at hudson.model.AbstractBuild$AbstractBuildExecution.post(AbstractBuild.java:621)
	at hudson.model.Run.execute(Run.java:1760)
	at hudson.matrix.MatrixRun.run(MatrixRun.java:146)
	at hudson.model.ResourceController.execute(ResourceController.java:97)
	at hudson.model.Executor.run(Executor.java:405)
Setting JDK_1_7_LATEST__HOME=/home/jenkins/tools/java/latest1.7
Setting JDK_1_8_LATEST__HOME=/home/jenkins/tools/java/latest1.8

Mime
View raw message