hbase-builds mailing list archives

Site index · List index
Message view « Date » · « Thread »
Top « Date » · « Thread »
From Apache Jenkins Server <jenk...@builds.apache.org>
Subject Build failed in Jenkins: HBase-1.5 » JDK_1_7,Hadoop&&!H13 #17
Date Fri, 18 Aug 2017 21:18:19 GMT
See <https://builds.apache.org/job/HBase-1.5/jdk=JDK_1_7,label=Hadoop&&!H13/17/display/redirect?page=changes>

Changes:

[chia7712] HBASE-18572 Delete can't remove the cells which have no visibility label

[chia7712] HBASE-18471 The DeleteFamily cell is skipped when StoreScanner seeks to

------------------------------------------
[...truncated 2.26 MB...]
Tests run: 2, Failures: 0, Errors: 0, Skipped: 0, Time elapsed: 1.225 sec - in org.apache.hadoop.hbase.client.TestConnectionImplementation
Running org.apache.hadoop.hbase.client.TestRpcControllerFactory
Running org.apache.hadoop.hbase.client.TestSnapshotFromClient
Tests run: 2, Failures: 0, Errors: 0, Skipped: 0, Time elapsed: 7.901 sec - in org.apache.hadoop.hbase.client.TestRpcControllerFactory
Tests run: 8, Failures: 0, Errors: 0, Skipped: 0, Time elapsed: 30.058 sec - in org.apache.hadoop.hbase.client.TestScannersFromClientSide
Running org.apache.hadoop.hbase.client.TestFromClientSide
Running org.apache.hadoop.hbase.client.TestAdmin2
Tests run: 1, Failures: 0, Errors: 0, Skipped: 0, Time elapsed: 35.825 sec - in org.apache.hadoop.hbase.client.TestLeaseRenewal
Running org.apache.hadoop.hbase.client.TestSplitOrMergeStatus
Tests run: 9, Failures: 0, Errors: 0, Skipped: 0, Time elapsed: 74.232 sec - in org.apache.hadoop.hbase.coprocessor.TestMasterObserver
Running org.apache.hadoop.hbase.client.TestClientScannerRPCTimeout
Tests run: 1, Failures: 0, Errors: 0, Skipped: 0, Time elapsed: 11.959 sec - in org.apache.hadoop.hbase.client.TestClientScannerRPCTimeout
Tests run: 3, Failures: 0, Errors: 0, Skipped: 0, Time elapsed: 39.153 sec - in org.apache.hadoop.hbase.client.TestSplitOrMergeStatus
Running org.apache.hadoop.hbase.client.TestAlwaysSetScannerId
Tests run: 1, Failures: 0, Errors: 0, Skipped: 0, Time elapsed: 1.645 sec - in org.apache.hadoop.hbase.client.TestAlwaysSetScannerId
Running org.apache.hadoop.hbase.client.TestRestoreSnapshotFromClientWithRegionReplicas
Running org.apache.hadoop.hbase.client.TestAdmin1
Tests run: 9, Failures: 0, Errors: 0, Skipped: 0, Time elapsed: 96.054 sec - in org.apache.hadoop.hbase.client.TestSnapshotFromClient
Running org.apache.hadoop.hbase.client.TestFromClientSideWithCoprocessor
Tests run: 28, Failures: 0, Errors: 0, Skipped: 0, Time elapsed: 202.111 sec - in org.apache.hadoop.hbase.client.TestAdmin2
Running org.apache.hadoop.hbase.client.TestResultSizeEstimation
Tests run: 2, Failures: 0, Errors: 0, Skipped: 0, Time elapsed: 10.859 sec - in org.apache.hadoop.hbase.client.TestResultSizeEstimation
Running org.apache.hadoop.hbase.client.TestCloneSnapshotFromClientWithRegionReplicas
Tests run: 5, Failures: 0, Errors: 0, Skipped: 0, Time elapsed: 226.466 sec - in org.apache.hadoop.hbase.client.TestRestoreSnapshotFromClientWithRegionReplicas
Running org.apache.hadoop.hbase.client.TestFromClientSide3
Tests run: 84, Failures: 0, Errors: 0, Skipped: 4, Time elapsed: 366.02 sec - in org.apache.hadoop.hbase.client.TestFromClientSide
Tests run: 28, Failures: 0, Errors: 0, Skipped: 0, Time elapsed: 291.476 sec - in org.apache.hadoop.hbase.client.TestAdmin1
Running org.apache.hadoop.hbase.client.TestFastFail
Running org.apache.hadoop.hbase.client.TestHTablePool$TestHTableThreadLocalPool
Tests run: 2, Failures: 0, Errors: 0, Skipped: 1, Time elapsed: 7.953 sec - in org.apache.hadoop.hbase.client.TestFastFail
Tests run: 9, Failures: 0, Errors: 0, Skipped: 0, Time elapsed: 10.338 sec - in org.apache.hadoop.hbase.client.TestHTablePool$TestHTableThreadLocalPool
Running org.apache.hadoop.hbase.client.TestHTableMultiplexerFlushCache
Running org.apache.hadoop.hbase.client.TestSmallReversedScanner
Tests run: 2, Failures: 0, Errors: 0, Skipped: 0, Time elapsed: 1.929 sec - in org.apache.hadoop.hbase.client.TestSmallReversedScanner
Tests run: 2, Failures: 0, Errors: 0, Skipped: 0, Time elapsed: 18.126 sec - in org.apache.hadoop.hbase.client.TestHTableMultiplexerFlushCache
Running org.apache.hadoop.hbase.client.TestLimitedScanWithFilter
Tests run: 5, Failures: 0, Errors: 0, Skipped: 0, Time elapsed: 1.675 sec - in org.apache.hadoop.hbase.client.TestLimitedScanWithFilter
Running org.apache.hadoop.hbase.client.TestResultFromCoprocessor
Tests run: 2, Failures: 0, Errors: 0, Skipped: 0, Time elapsed: 1.318 sec - in org.apache.hadoop.hbase.client.TestResultFromCoprocessor
Running org.apache.hadoop.hbase.client.TestClientTimeouts
Running org.apache.hadoop.hbase.client.TestShortCircuitConnection
Tests run: 1, Failures: 0, Errors: 0, Skipped: 0, Time elapsed: 2.404 sec - in org.apache.hadoop.hbase.client.TestClientTimeouts
Tests run: 1, Failures: 0, Errors: 0, Skipped: 0, Time elapsed: 7.827 sec - in org.apache.hadoop.hbase.client.TestShortCircuitConnection
Tests run: 84, Failures: 0, Errors: 0, Skipped: 4, Time elapsed: 377.146 sec - in org.apache.hadoop.hbase.client.TestFromClientSideWithCoprocessor
Running org.apache.hadoop.hbase.client.TestClientPushback
Tests run: 2, Failures: 0, Errors: 0, Skipped: 0, Time elapsed: 1.474 sec - in org.apache.hadoop.hbase.client.TestClientPushback
Running org.apache.hadoop.hbase.client.TestMultipleTimestamps
Running org.apache.hadoop.hbase.client.TestHCM
Tests run: 12, Failures: 0, Errors: 0, Skipped: 0, Time elapsed: 175.389 sec - in org.apache.hadoop.hbase.client.TestFromClientSide3
Tests run: 5, Failures: 0, Errors: 0, Skipped: 0, Time elapsed: 253.005 sec - in org.apache.hadoop.hbase.client.TestCloneSnapshotFromClientWithRegionReplicas
Running org.apache.hadoop.hbase.client.TestScannerTimeout
Running org.apache.hadoop.hbase.client.TestMvccConsistentScanner
Tests run: 8, Failures: 0, Errors: 0, Skipped: 0, Time elapsed: 29.075 sec - in org.apache.hadoop.hbase.client.TestMultipleTimestamps
Tests run: 2, Failures: 0, Errors: 0, Skipped: 0, Time elapsed: 10.996 sec - in org.apache.hadoop.hbase.client.TestMvccConsistentScanner
Running org.apache.hadoop.hbase.client.TestSnapshotWithAcl
Tests run: 3, Failures: 0, Errors: 0, Skipped: 0, Time elapsed: 24.52 sec - in org.apache.hadoop.hbase.client.TestScannerTimeout
Running org.apache.hadoop.hbase.client.TestMetaWithReplicas
Running org.apache.hadoop.hbase.client.TestCheckAndMutate
Tests run: 1, Failures: 0, Errors: 0, Skipped: 0, Time elapsed: 9.306 sec - in org.apache.hadoop.hbase.client.TestCheckAndMutate
Running org.apache.hadoop.hbase.client.TestIncrementFromClientSideWithCoprocessor
Running org.apache.hadoop.hbase.client.TestSizeFailures
Tests run: 8, Failures: 0, Errors: 0, Skipped: 0, Time elapsed: 30.421 sec - in org.apache.hadoop.hbase.client.TestIncrementFromClientSideWithCoprocessor
Running org.apache.hadoop.hbase.client.TestPutWithDelete
Tests run: 1, Failures: 0, Errors: 0, Skipped: 0, Time elapsed: 70.536 sec - in org.apache.hadoop.hbase.client.TestSnapshotWithAcl
Tests run: 1, Failures: 0, Errors: 0, Skipped: 0, Time elapsed: 8.501 sec - in org.apache.hadoop.hbase.client.TestPutWithDelete
Tests run: 2, Failures: 0, Errors: 0, Skipped: 0, Time elapsed: 35.971 sec - in org.apache.hadoop.hbase.client.TestSizeFailures
Running org.apache.hadoop.hbase.client.TestCloneSnapshotFromClient
Running org.apache.hadoop.hbase.client.TestHTablePool$TestHTableReusablePool
Running org.apache.hadoop.hbase.client.TestMetaCache
Tests run: 2, Failures: 0, Errors: 0, Skipped: 0, Time elapsed: 2.748 sec - in org.apache.hadoop.hbase.client.TestMetaCache
Running org.apache.hadoop.hbase.client.TestHTablePool$TestHTableReusablePool
Tests run: 9, Failures: 0, Errors: 0, Skipped: 0, Time elapsed: 22.525 sec - in org.apache.hadoop.hbase.client.TestHTablePool$TestHTableReusablePool
Running org.apache.hadoop.hbase.client.TestHTablePool$TestHTableThreadLocalPool
Tests run: 9, Failures: 0, Errors: 0, Skipped: 0, Time elapsed: 11.53 sec - in org.apache.hadoop.hbase.client.TestHTablePool$TestHTableReusablePool
Tests run: 9, Failures: 0, Errors: 0, Skipped: 0, Time elapsed: 11.202 sec - in org.apache.hadoop.hbase.client.TestHTablePool$TestHTableThreadLocalPool
Running org.apache.hadoop.hbase.client.TestSnapshotMetadata
Running org.apache.hadoop.hbase.client.TestReplicaWithCluster
Tests run: 4, Failures: 0, Errors: 0, Skipped: 0, Time elapsed: 61.18 sec - in org.apache.hadoop.hbase.client.TestSnapshotMetadata
Tests run: 13, Failures: 0, Errors: 0, Skipped: 0, Time elapsed: 202.642 sec - in org.apache.hadoop.hbase.client.TestMetaWithReplicas
Running org.apache.hadoop.hbase.client.TestSnapshotFromClientWithRegionReplicas
Running org.apache.hadoop.hbase.client.TestUpdateConfiguration
Tests run: 4, Failures: 0, Errors: 0, Skipped: 0, Time elapsed: 2.04 sec - in org.apache.hadoop.hbase.client.TestUpdateConfiguration
Running org.apache.hadoop.hbase.client.TestMultiRespectsLimits

Results :

Failed tests: 
  TestStochasticLoadBalancer2.testRegionReplicasOnMidClusterHighReplication:78->BalancerTestBase.testWithCluster:426->BalancerTestBase.testWithCluster:454->BalancerTestBase.assertRegionReplicaPlacement:229
Two or more region replicas are hosted on the same host after balance
  TestVisibilityLabelsWithACL.setupBeforeClass:103 Waiting timed out after [10,000] msec
Tests in error: 
org.apache.hadoop.hbase.master.TestAssignmentListener.testAssignmentListener(org.apache.hadoop.hbase.master.TestAssignmentListener)
  Run 1: TestAssignmentListener.testAssignmentListener:228 » TestTimedOut test timed ou...
  Run 2: TestAssignmentListener.testAssignmentListener:228 » TestTimedOut test timed ou...
  Run 3: TestAssignmentListener.testAssignmentListener:228 » TestTimedOut test timed ou...

  TestScannerCursor.setUpBeforeClass:93->createTestTable:99 » TableExists TestSc...

Tests run: 2075, Failures: 2, Errors: 2, Skipped: 37

[INFO] ------------------------------------------------------------------------
[INFO] Reactor Summary:
[INFO] 
[INFO] Apache HBase ...................................... SUCCESS [1:46.229s]
[INFO] Apache HBase - Checkstyle ......................... SUCCESS [15.826s]
[INFO] Apache HBase - Resource Bundle .................... SUCCESS [0.269s]
[INFO] Apache HBase - Annotations ........................ SUCCESS [1.417s]
[INFO] Apache HBase - Protocol ........................... SUCCESS [17.199s]
[INFO] Apache HBase - Common ............................. SUCCESS [2:40.710s]
[INFO] Apache HBase - Procedure .......................... SUCCESS [3:31.636s]
[INFO] Apache HBase - Metrics API ........................ SUCCESS [1.534s]
[INFO] Apache HBase - Hadoop Compatibility ............... SUCCESS [12.418s]
[INFO] Apache HBase - Metrics Implementation ............. SUCCESS [5.688s]
[INFO] Apache HBase - Hadoop Two Compatibility ........... SUCCESS [20.821s]
[INFO] Apache HBase - Client ............................. SUCCESS [1:47.905s]
[INFO] Apache HBase - Prefix Tree ........................ SUCCESS [10.138s]
[INFO] Apache HBase - Server ............................. FAILURE [1:24:01.871s]
[INFO] Apache HBase - Testing Util ....................... SKIPPED
[INFO] Apache HBase - Thrift ............................. SKIPPED
[INFO] Apache HBase - Rest ............................... SKIPPED
[INFO] Apache HBase - Shell .............................. SKIPPED
[INFO] Apache HBase - Integration Tests .................. SKIPPED
[INFO] Apache HBase - Examples ........................... SKIPPED
[INFO] Apache HBase - External Block Cache ............... SKIPPED
[INFO] Apache HBase - Assembly ........................... SKIPPED
[INFO] Apache HBase - Shaded ............................. SKIPPED
[INFO] Apache HBase - Shaded - Client .................... SKIPPED
[INFO] Apache HBase - Shaded - Server .................... SKIPPED
[INFO] Apache HBase - Archetypes ......................... SKIPPED
[INFO] Apache HBase - Exemplar for hbase-client archetype  SKIPPED
[INFO] Apache HBase - Exemplar for hbase-shaded-client archetype  SKIPPED
[INFO] Apache HBase - Archetype builder .................. SKIPPED
[INFO] ------------------------------------------------------------------------
[INFO] BUILD FAILURE
[INFO] ------------------------------------------------------------------------
[INFO] Total time: 1:35:47.929s
[INFO] Finished at: Fri Aug 18 21:13:32 UTC 2017
[INFO] Final Memory: 435M/1444M
[INFO] ------------------------------------------------------------------------
[ERROR] Failed to execute goal org.apache.maven.plugins:maven-surefire-plugin:2.18.1:test
(secondPartTestsExecution) on project hbase-server: ExecutionException: java.lang.RuntimeException:
There was an error in the forked process
[ERROR] java.lang.ArrayIndexOutOfBoundsException: 1
[ERROR] at org.apache.maven.surefire.common.junit4.JUnit4ProviderUtil.generateFailingTests(JUnit4ProviderUtil.java:64)
[ERROR] at org.apache.maven.surefire.junitcore.JUnitCoreProvider.invoke(JUnitCoreProvider.java:151)
[ERROR] at org.apache.maven.surefire.booter.ForkedBooter.invokeProviderInSameClassLoader(ForkedBooter.java:203)
[ERROR] at org.apache.maven.surefire.booter.ForkedBooter.runSuitesInProcess(ForkedBooter.java:155)
[ERROR] at org.apache.maven.surefire.booter.ForkedBooter.main(ForkedBooter.java:103)
[ERROR] -> [Help 1]
[ERROR] 
[ERROR] To see the full stack trace of the errors, re-run Maven with the -e switch.
[ERROR] Re-run Maven using the -X switch to enable full debug logging.
[ERROR] 
[ERROR] For more information about the errors and possible solutions, please read the following
articles:
[ERROR] [Help 1] http://cwiki.apache.org/confluence/display/MAVEN/MojoFailureException
[ERROR] 
[ERROR] After correcting the problems, you can resume the build with the command
[ERROR]   mvn <goals> -rf :hbase-server
Build step 'Invoke top-level Maven targets' marked build as failure
Performing Post build task...
Match found for :.* : True
Logical operation result is TRUE
Running script  : # Post-build task script. TODO: Check this in and have all builds reference
check-in.
pwd && ls
# NOTE!!!! The below code has been copied and pasted from ./dev-tools/run-test.sh
# Do not change here without syncing there and vice-versa.
ZOMBIE_TESTS_COUNT=`jps -v | grep surefirebooter | grep -e '-Dhbase.test' | wc -l`
if [[ $ZOMBIE_TESTS_COUNT != 0 ]] ; then
 echo "Suspicious java process found - waiting 30s to see if there are just slow to stop"
 sleep 30
 ZOMBIE_TESTS_COUNT=`jps -v | grep surefirebooter | grep -e '-Dhbase.test' | wc -l`
 if [[ $ZOMBIE_TESTS_COUNT != 0 ]] ; then
   echo " {color:red}There appear to be $ZOMBIE_TESTS_COUNT zombie tests{color}, they should
have been killed by surefire but survived"
   jps -v | grep surefirebooter | grep -e '-Dhbase.test'
   jps -v | grep surefirebooter | grep -e '-Dhbase.test' | cut -d ' ' -f 1 | xargs -n 1 jstack
   # Exit with error
   exit 1
 else
   echo "We're ok: there is no zombie test, but some tests took some time to stop"
 fi
else
  echo "We're ok: there is no zombie test"
fi
Setting JDK_1_7_LATEST__HOME=/home/jenkins/tools/java/latest1.7
Setting JDK_1_8_LATEST__HOME=/home/jenkins/tools/java/latest1.8
[19ccb43d] $ /bin/bash -xe /tmp/jenkins484784308422730302.sh
+ pwd
<https://builds.apache.org/job/HBase-1.5/jdk=JDK_1_7,label=Hadoop&&!H13/ws/>
+ ls
bin
CHANGES.txt
conf
dev-support
extra_env_var
hbase-annotations
hbase-archetypes
hbase-assembly
hbase-checkstyle
hbase-client
hbase-common
hbase-examples
hbase-external-blockcache
hbase-hadoop2-compat
hbase-hadoop-compat
hbase-it
hbase-metrics
hbase-metrics-api
hbase-native-client
hbase-prefix-tree
hbase-procedure
hbase-protocol
hbase-resource-bundle
hbase-rest
hbase-server
hbase-shaded
hbase-shell
hbase-testing-util
hbase-thrift
LICENSE.txt
NOTICE.txt
pom.xml
README.txt
src
target
++ jps -v
++ grep surefirebooter
++ wc -l
++ grep -e -Dhbase.test
+ ZOMBIE_TESTS_COUNT=4
+ [[ 4 != 0 ]]
+ echo 'Suspicious java process found - waiting 30s to see if there are just slow to stop'
Suspicious java process found - waiting 30s to see if there are just slow to stop
+ sleep 30
++ jps -v
++ grep surefirebooter
++ grep -e -Dhbase.test
++ wc -l
+ ZOMBIE_TESTS_COUNT=0
+ [[ 0 != 0 ]]
+ echo 'We'\''re ok: there is no zombie test, but some tests took some time to stop'
We're ok: there is no zombie test, but some tests took some time to stop
POST BUILD TASK : SUCCESS
END OF POST BUILD TASK : 0
Archiving artifacts
Setting JDK_1_7_LATEST__HOME=/home/jenkins/tools/java/latest1.7
Setting JDK_1_8_LATEST__HOME=/home/jenkins/tools/java/latest1.8
[Fast Archiver] No prior successful build to compare, so performing full copy of artifacts
Recording test results
Setting JDK_1_7_LATEST__HOME=/home/jenkins/tools/java/latest1.7
Setting JDK_1_8_LATEST__HOME=/home/jenkins/tools/java/latest1.8
Setting JDK_1_7_LATEST__HOME=/home/jenkins/tools/java/latest1.7
Setting JDK_1_8_LATEST__HOME=/home/jenkins/tools/java/latest1.8

Mime
View raw message