hbase-builds mailing list archives

Site index · List index
Message view « Date » · « Thread »
Top « Date » · « Thread »
From Apache Jenkins Server <jenk...@builds.apache.org>
Subject Build failed in Jenkins: HBase-1.4 » JDK_1_8,Hadoop&&!H13 #861
Date Wed, 16 Aug 2017 07:59:36 GMT
See <https://builds.apache.org/job/HBase-1.4/jdk=JDK_1_8,label=Hadoop&&!H13/861/display/redirect?page=changes>

Changes:

[apurtell] HBASE-18437 Revoke access permissions of a user from a table does not

------------------------------------------
[...truncated 2.39 MB...]

Tests run: 1, Failures: 0, Errors: 0, Skipped: 0, Time elapsed: 2.576 sec - in org.apache.hadoop.hbase.master.balancer.TestDefaultLoadBalancer
Running org.apache.hadoop.hbase.master.TestGetLastFlushedSequenceId
Tests run: 1, Failures: 0, Errors: 0, Skipped: 0, Time elapsed: 13.09 sec - in org.apache.hadoop.hbase.master.TestGetInfoPort
Running org.apache.hadoop.hbase.master.TestSplitLogManager
Tests run: 1, Failures: 0, Errors: 0, Skipped: 0, Time elapsed: 23.236 sec - in org.apache.hadoop.hbase.master.TestGetLastFlushedSequenceId
Running org.apache.hadoop.hbase.master.TestRollingRestart
Tests run: 1, Failures: 0, Errors: 1, Skipped: 0, Time elapsed: 131.088 sec <<< FAILURE!
- in org.apache.hadoop.hbase.master.TestAssignmentListener
testAssignmentListener(org.apache.hadoop.hbase.master.TestAssignmentListener)  Time elapsed:
60.05 sec  <<< ERROR!
org.junit.runners.model.TestTimedOutException: test timed out after 60000 milliseconds
	at java.lang.Thread.sleep(Native Method)
	at org.apache.hadoop.hbase.master.TestAssignmentListener$DummyListener.awaitModifications(TestAssignmentListener.java:81)
	at org.apache.hadoop.hbase.master.TestAssignmentListener.testAssignmentListener(TestAssignmentListener.java:228)

Tests run: 1, Failures: 0, Errors: 0, Skipped: 0, Time elapsed: 51.409 sec - in org.apache.hadoop.hbase.master.TestRollingRestart
Running org.apache.hadoop.hbase.master.TestMasterPriorityRpc
Tests run: 3, Failures: 0, Errors: 0, Skipped: 0, Time elapsed: 2.119 sec - in org.apache.hadoop.hbase.master.TestMasterPriorityRpc
Running org.apache.hadoop.hbase.master.TestCatalogJanitorInMemoryStates
Tests run: 1, Failures: 0, Errors: 0, Skipped: 0, Time elapsed: 20.08 sec - in org.apache.hadoop.hbase.master.TestCatalogJanitorInMemoryStates
Running org.apache.hadoop.hbase.master.TestMasterFileSystem
Tests run: 2, Failures: 0, Errors: 0, Skipped: 0, Time elapsed: 1.307 sec - in org.apache.hadoop.hbase.master.TestMasterFileSystem
Tests run: 1, Failures: 0, Errors: 1, Skipped: 0, Time elapsed: 196.707 sec <<< FAILURE!
- in org.apache.hadoop.hbase.master.TestAssignmentListener
testAssignmentListener(org.apache.hadoop.hbase.master.TestAssignmentListener)  Time elapsed:
60.046 sec  <<< ERROR!
org.junit.runners.model.TestTimedOutException: test timed out after 60000 milliseconds
	at java.lang.Thread.sleep(Native Method)
	at org.apache.hadoop.hbase.master.TestAssignmentListener$DummyListener.awaitModifications(TestAssignmentListener.java:81)
	at org.apache.hadoop.hbase.master.TestAssignmentListener.testAssignmentListener(TestAssignmentListener.java:228)

Running org.apache.hadoop.hbase.master.TestMasterTransitions
Tests run: 3, Failures: 0, Errors: 0, Skipped: 3, Time elapsed: 0.001 sec - in org.apache.hadoop.hbase.master.TestMasterTransitions
Running org.apache.hadoop.hbase.master.TestMasterFileSystemWithWALDir
Tests run: 1, Failures: 0, Errors: 0, Skipped: 0, Time elapsed: 1.025 sec - in org.apache.hadoop.hbase.master.TestMasterFileSystemWithWALDir
Running org.apache.hadoop.hbase.master.TestDistributedLogSplitting
Running org.apache.hadoop.hbase.master.TestAssignmentManagerOnCluster
Tests run: 15, Failures: 0, Errors: 0, Skipped: 1, Time elapsed: 140.643 sec - in org.apache.hadoop.hbase.master.TestSplitLogManager
Running org.apache.hadoop.hbase.master.TestMasterBalanceThrottling
Tests run: 18, Failures: 0, Errors: 0, Skipped: 15, Time elapsed: 76.372 sec - in org.apache.hadoop.hbase.master.TestDistributedLogSplitting
Running org.apache.hadoop.hbase.master.TestMasterFailover
Tests run: 2, Failures: 0, Errors: 0, Skipped: 0, Time elapsed: 78.322 sec - in org.apache.hadoop.hbase.master.TestMasterBalanceThrottling
Running org.apache.hadoop.hbase.master.snapshot.TestSnapshotFileCache
Tests run: 4, Failures: 0, Errors: 0, Skipped: 0, Time elapsed: 31.442 sec - in org.apache.hadoop.hbase.master.snapshot.TestSnapshotFileCache
Running org.apache.hadoop.hbase.master.TestMasterMetrics
Tests run: 3, Failures: 0, Errors: 0, Skipped: 0, Time elapsed: 1.826 sec - in org.apache.hadoop.hbase.master.TestMasterMetrics
Tests run: 24, Failures: 0, Errors: 0, Skipped: 1, Time elapsed: 300.196 sec - in org.apache.hadoop.hbase.master.balancer.TestStochasticLoadBalancer
Running org.apache.hadoop.hbase.master.TestMasterFailoverBalancerPersistence
Running org.apache.hadoop.hbase.master.TestMaster
Tests run: 1, Failures: 0, Errors: 0, Skipped: 0, Time elapsed: 18.578 sec - in org.apache.hadoop.hbase.master.TestMasterFailoverBalancerPersistence
Running org.apache.hadoop.hbase.master.TestAssignmentManagerMetrics
Tests run: 4, Failures: 0, Errors: 0, Skipped: 0, Time elapsed: 28.178 sec - in org.apache.hadoop.hbase.master.TestMaster
Running org.apache.hadoop.hbase.master.TestMasterShutdown
Tests run: 21, Failures: 0, Errors: 0, Skipped: 0, Time elapsed: 189.775 sec - in org.apache.hadoop.hbase.master.TestAssignmentManagerOnCluster
Running org.apache.hadoop.hbase.master.TestMasterStatusServlet
Tests run: 4, Failures: 0, Errors: 0, Skipped: 0, Time elapsed: 1.674 sec - in org.apache.hadoop.hbase.master.TestMasterStatusServlet
Tests run: 1, Failures: 0, Errors: 0, Skipped: 0, Time elapsed: 15.776 sec - in org.apache.hadoop.hbase.master.TestAssignmentManagerMetrics
Running org.apache.hadoop.hbase.master.TestMasterOperationsForRegionReplicas
Running org.apache.hadoop.hbase.master.TestMasterMetricsWrapper
Tests run: 1, Failures: 0, Errors: 0, Skipped: 0, Time elapsed: 2.237 sec - in org.apache.hadoop.hbase.master.TestMasterMetricsWrapper
Running org.apache.hadoop.hbase.master.TestHMasterRPCException
Tests run: 1, Failures: 0, Errors: 0, Skipped: 0, Time elapsed: 4.785 sec - in org.apache.hadoop.hbase.master.TestHMasterRPCException
Tests run: 2, Failures: 0, Errors: 0, Skipped: 0, Time elapsed: 34.925 sec - in org.apache.hadoop.hbase.master.TestMasterShutdown
Running org.apache.hadoop.hbase.master.TestTableLockManager
Running org.apache.hadoop.hbase.master.TestActiveMasterManager
Tests run: 2, Failures: 0, Errors: 0, Skipped: 0, Time elapsed: 1.538 sec - in org.apache.hadoop.hbase.master.TestActiveMasterManager
Tests run: 7, Failures: 0, Errors: 0, Skipped: 0, Time elapsed: 160.992 sec - in org.apache.hadoop.hbase.master.TestMasterFailover
Tests run: 2, Failures: 0, Errors: 0, Skipped: 0, Time elapsed: 54.069 sec - in org.apache.hadoop.hbase.master.TestMasterOperationsForRegionReplicas
Tests run: 4, Failures: 0, Errors: 0, Skipped: 0, Time elapsed: 110.446 sec - in org.apache.hadoop.hbase.master.TestTableLockManager
Tests run: 4, Failures: 0, Errors: 0, Skipped: 0, Time elapsed: 523.155 sec - in org.apache.hadoop.hbase.master.balancer.TestStochasticLoadBalancer2

Results :

Tests in error: 
org.apache.hadoop.hbase.master.TestAssignmentListener.testAssignmentListener(org.apache.hadoop.hbase.master.TestAssignmentListener)
  Run 1: TestAssignmentListener.testAssignmentListener:228 » TestTimedOut test timed ou...
  Run 2: TestAssignmentListener.testAssignmentListener:228 » TestTimedOut test timed ou...
  Run 3: TestAssignmentListener.testAssignmentListener:228 » TestTimedOut test timed ou...

org.apache.hadoop.hbase.regionserver.TestRSKilledWhenInitializing.testRSTerminationAfterRegisteringToMasterBeforeCreatingEphemeralNode(org.apache.hadoop.hbase.regionserver.TestRSKilledWhenInitializing)
  Run 1: TestRSKilledWhenInitializing.testRSTerminationAfterRegisteringToMasterBeforeCreatingEphemeralNode:142
null
  Run 2: TestRSKilledWhenInitializing.testRSTerminationAfterRegisteringToMasterBeforeCreatingEphemeralNode:115
» TestTimedOut
  Run 3: TestRSKilledWhenInitializing.testRSTerminationAfterRegisteringToMasterBeforeCreatingEphemeralNode
» 
  Run 4: TestRSKilledWhenInitializing.testRSTerminationAfterRegisteringToMasterBeforeCreatingEphemeralNode:115
» TestTimedOut
  Run 5: TestRSKilledWhenInitializing.testRSTerminationAfterRegisteringToMasterBeforeCreatingEphemeralNode
» 

  TestScannerCursor.setUpBeforeClass:93->createTestTable:99 » TableExists TestSc...
org.apache.hadoop.hbase.security.access.TestAccessController3.org.apache.hadoop.hbase.security.access.TestAccessController3
  Run 1: TestAccessController3.setupBeforeClass:190->setUpTableAndUserPermissions:211->SecureTestUtil.createTable:721->SecureTestUtil.createTable:737
» RetriesExhausted
  Run 2: TestAccessController3.tearDownAfterClass:200->cleanUp:263->SecureTestUtil.deleteTable:748->SecureTestUtil.deleteTable:766
» NullPointer

Flaked tests: 
org.apache.hadoop.hbase.client.TestClientScannerRPCTimeout.testScannerNextRPCTimesout(org.apache.hadoop.hbase.client.TestClientScannerRPCTimeout)
  Run 1: TestClientScannerRPCTimeout.testScannerNextRPCTimesout:87 » TableExists testSc...
  Run 2: TestClientScannerRPCTimeout.testScannerNextRPCTimesout:87 » TableExists testSc...
  Run 3: PASS

org.apache.hadoop.hbase.mapred.TestTableSnapshotInputFormat.testWithMapReduceMultiRegion(org.apache.hadoop.hbase.mapred.TestTableSnapshotInputFormat)
  Run 1: TestTableSnapshotInputFormat.testWithMapReduceMultiRegion:140->TableSnapshotInputFormatTestBase.testWithMapReduce:168->testWithMapReduceImpl:224->doTestWithMapReduce:234->TableSnapshotInputFormatTestBase.createTableAndSnapshot:206
» RetriesExhausted
  Run 2: PASS

org.apache.hadoop.hbase.regionserver.TestCompactionInDeadRegionServer.test(org.apache.hadoop.hbase.regionserver.TestCompactionInDeadRegionServer)
  Run 1: TestCompactionInDeadRegionServer.test:132 Should fail as our wal file has already
been closed, and walDir has also been renamed
  Run 2: PASS

org.apache.hadoop.hbase.replication.TestMasterReplication.testCyclicReplication2(org.apache.hadoop.hbase.replication.TestMasterReplication)
  Run 1: TestMasterReplication.testCyclicReplication2:316->wait:703 Waited too much time
for replication. Row:row4. IsDeleteReplication:true
  Run 2: PASS


Tests run: 2835, Failures: 0, Errors: 4, Skipped: 57, Flakes: 4

[INFO] ------------------------------------------------------------------------
[INFO] Reactor Summary:
[INFO] 
[INFO] Apache HBase ...................................... SUCCESS [1:43.174s]
[INFO] Apache HBase - Checkstyle ......................... SUCCESS [14.994s]
[INFO] Apache HBase - Resource Bundle .................... SUCCESS [0.400s]
[INFO] Apache HBase - Annotations ........................ SUCCESS [1.524s]
[INFO] Apache HBase - Protocol ........................... SUCCESS [17.594s]
[INFO] Apache HBase - Common ............................. SUCCESS [2:35.919s]
[INFO] Apache HBase - Procedure .......................... SUCCESS [3:34.387s]
[INFO] Apache HBase - Metrics API ........................ SUCCESS [1.180s]
[INFO] Apache HBase - Hadoop Compatibility ............... SUCCESS [11.473s]
[INFO] Apache HBase - Metrics Implementation ............. SUCCESS [5.214s]
[INFO] Apache HBase - Hadoop Two Compatibility ........... SUCCESS [18.586s]
[INFO] Apache HBase - Client ............................. SUCCESS [1:39.505s]
[INFO] Apache HBase - Prefix Tree ........................ SUCCESS [8.241s]
[INFO] Apache HBase - Server ............................. FAILURE [2:00:08.251s]
[INFO] Apache HBase - Testing Util ....................... SKIPPED
[INFO] Apache HBase - Thrift ............................. SKIPPED
[INFO] Apache HBase - Rest ............................... SKIPPED
[INFO] Apache HBase - Shell .............................. SKIPPED
[INFO] Apache HBase - Integration Tests .................. SKIPPED
[INFO] Apache HBase - Examples ........................... SKIPPED
[INFO] Apache HBase - External Block Cache ............... SKIPPED
[INFO] Apache HBase - Assembly ........................... SKIPPED
[INFO] Apache HBase - Shaded ............................. SKIPPED
[INFO] Apache HBase - Shaded - Client .................... SKIPPED
[INFO] Apache HBase - Shaded - Server .................... SKIPPED
[INFO] Apache HBase - Archetypes ......................... SKIPPED
[INFO] Apache HBase - Exemplar for hbase-client archetype  SKIPPED
[INFO] Apache HBase - Exemplar for hbase-shaded-client archetype  SKIPPED
[INFO] Apache HBase - Archetype builder .................. SKIPPED
[INFO] ------------------------------------------------------------------------
[INFO] BUILD FAILURE
[INFO] ------------------------------------------------------------------------
[INFO] Total time: 2:11:32.424s
[INFO] Finished at: Wed Aug 16 07:46:50 UTC 2017
[INFO] Final Memory: 103M/1531M
[INFO] ------------------------------------------------------------------------
[ERROR] Failed to execute goal org.apache.maven.plugins:maven-surefire-plugin:2.18.1:test
(secondPartTestsExecution) on project hbase-server: ExecutionException: java.lang.RuntimeException:
There was an error in the forked process
[ERROR] java.lang.ArrayIndexOutOfBoundsException: 1
[ERROR] at org.apache.maven.surefire.common.junit4.JUnit4ProviderUtil.generateFailingTests(JUnit4ProviderUtil.java:64)
[ERROR] at org.apache.maven.surefire.junitcore.JUnitCoreProvider.invoke(JUnitCoreProvider.java:151)
[ERROR] at org.apache.maven.surefire.booter.ForkedBooter.invokeProviderInSameClassLoader(ForkedBooter.java:203)
[ERROR] at org.apache.maven.surefire.booter.ForkedBooter.runSuitesInProcess(ForkedBooter.java:155)
[ERROR] at org.apache.maven.surefire.booter.ForkedBooter.main(ForkedBooter.java:103)
[ERROR] -> [Help 1]
[ERROR] 
[ERROR] To see the full stack trace of the errors, re-run Maven with the -e switch.
[ERROR] Re-run Maven using the -X switch to enable full debug logging.
[ERROR] 
[ERROR] For more information about the errors and possible solutions, please read the following
articles:
[ERROR] [Help 1] http://cwiki.apache.org/confluence/display/MAVEN/MojoFailureException
[ERROR] 
[ERROR] After correcting the problems, you can resume the build with the command
[ERROR]   mvn <goals> -rf :hbase-server
Build step 'Invoke top-level Maven targets' marked build as failure
Performing Post build task...
Match found for :.* : True
Logical operation result is TRUE
Running script  : # Post-build task script. TODO: Check this in and have all builds reference
check-in.
pwd && ls
# NOTE!!!! The below code has been copied and pasted from ./dev-tools/run-test.sh
# Do not change here without syncing there and vice-versa.
ZOMBIE_TESTS_COUNT=`jps -v | grep surefirebooter | grep -e '-Dhbase.test' | wc -l`
if [[ $ZOMBIE_TESTS_COUNT != 0 ]] ; then
 echo "Suspicious java process found - waiting 30s to see if there are just slow to stop"
 sleep 30
 ZOMBIE_TESTS_COUNT=`jps -v | grep surefirebooter | grep -e '-Dhbase.test' | wc -l`
 if [[ $ZOMBIE_TESTS_COUNT != 0 ]] ; then
   echo " {color:red}There appear to be $ZOMBIE_TESTS_COUNT zombie tests{color}, they should
have been killed by surefire but survived"
   jps -v | grep surefirebooter | grep -e '-Dhbase.test'
   jps -v | grep surefirebooter | grep -e '-Dhbase.test' | cut -d ' ' -f 1 | xargs -n 1 jstack
   # Exit with error
   exit 1
 else
   echo "We're ok: there is no zombie test, but some tests took some time to stop"
 fi
else
  echo "We're ok: there is no zombie test"
fi
Setting JDK_1_7_LATEST__HOME=/home/jenkins/tools/java/latest1.7
Setting JDK_1_8_LATEST__HOME=/home/jenkins/tools/java/latest1.8
[30b16b4c] $ /bin/bash -xe /tmp/jenkins491075579522207944.sh
+ pwd
<https://builds.apache.org/job/HBase-1.4/jdk=JDK_1_8,label=Hadoop&&!H13/ws/>
+ ls
bin
CHANGES.txt
conf
dev-support
extra_env_var
hbase-annotations
hbase-archetypes
hbase-assembly
hbase-checkstyle
hbase-client
hbase-common
hbase-examples
hbase-external-blockcache
hbase-hadoop2-compat
hbase-hadoop-compat
hbase-it
hbase-metrics
hbase-metrics-api
hbase-native-client
hbase-prefix-tree
hbase-procedure
hbase-protocol
hbase-resource-bundle
hbase-rest
hbase-server
hbase-shaded
hbase-shell
hbase-testing-util
hbase-thrift
LICENSE.txt
NOTICE.txt
pom.xml
README.txt
src
target
++ jps -v
++ grep surefirebooter
++ grep -e -Dhbase.test
++ wc -l
+ ZOMBIE_TESTS_COUNT=0
+ [[ 0 != 0 ]]
+ echo 'We'\''re ok: there is no zombie test'
We're ok: there is no zombie test
POST BUILD TASK : SUCCESS
END OF POST BUILD TASK : 0
Archiving artifacts
Setting JDK_1_7_LATEST__HOME=/home/jenkins/tools/java/latest1.7
Setting JDK_1_8_LATEST__HOME=/home/jenkins/tools/java/latest1.8
Recording test results
Setting JDK_1_7_LATEST__HOME=/home/jenkins/tools/java/latest1.7
Setting JDK_1_8_LATEST__HOME=/home/jenkins/tools/java/latest1.8
Setting JDK_1_7_LATEST__HOME=/home/jenkins/tools/java/latest1.7
Setting JDK_1_8_LATEST__HOME=/home/jenkins/tools/java/latest1.8

Mime
View raw message