hbase-builds mailing list archives

Site index · List index
Message view « Date » · « Thread »
Top « Date » · « Thread »
From Apache Jenkins Server <jenk...@builds.apache.org>
Subject Build failed in Jenkins: HBase-1.5 » JDK_1_7,Hadoop&&!H13 #2
Date Mon, 14 Aug 2017 18:35:25 GMT
See <https://builds.apache.org/job/HBase-1.5/jdk=JDK_1_7,label=Hadoop&&!H13/2/display/redirect?page=changes>

Changes:

[jerryjch] HBASE-18522 Add RowMutations support to Batch

------------------------------------------
[...truncated 2.37 MB...]
Tests run: 4, Failures: 0, Errors: 0, Skipped: 0, Time elapsed: 56.577 sec - in org.apache.hadoop.hbase.util.TestMiniClusterLoadSequential
Running org.apache.hadoop.hbase.util.TestFSHDFSUtils
Tests run: 3, Failures: 0, Errors: 0, Skipped: 0, Time elapsed: 8.373 sec - in org.apache.hadoop.hbase.util.TestFSHDFSUtils
Running org.apache.hadoop.hbase.util.TestFSTableDescriptors
Tests run: 15, Failures: 0, Errors: 0, Skipped: 0, Time elapsed: 2.796 sec - in org.apache.hadoop.hbase.util.TestFSTableDescriptors
Running org.apache.hadoop.hbase.util.TestMiniClusterLoadParallel
Tests run: 2, Failures: 0, Errors: 0, Skipped: 0, Time elapsed: 61.27 sec - in org.apache.hadoop.hbase.util.hbck.TestOfflineMetaRebuildBase
Running org.apache.hadoop.hbase.util.TestMergeTable
Tests run: 6, Failures: 0, Errors: 0, Skipped: 0, Time elapsed: 68.567 sec - in org.apache.hadoop.hbase.util.TestMiniClusterLoadEncoded
Running org.apache.hadoop.hbase.zookeeper.lock.TestZKInterProcessReadWriteLock
Tests run: 4, Failures: 0, Errors: 0, Skipped: 0, Time elapsed: 53.283 sec - in org.apache.hadoop.hbase.util.TestMiniClusterLoadParallel
Running org.apache.hadoop.hbase.zookeeper.TestZKTableStateManager
Tests run: 1, Failures: 0, Errors: 0, Skipped: 0, Time elapsed: 1.45 sec - in org.apache.hadoop.hbase.zookeeper.TestZKTableStateManager
Running org.apache.hadoop.hbase.zookeeper.TestRecoverableZooKeeper
Tests run: 1, Failures: 0, Errors: 0, Skipped: 0, Time elapsed: 1.675 sec - in org.apache.hadoop.hbase.zookeeper.TestRecoverableZooKeeper
Tests run: 1, Failures: 0, Errors: 0, Skipped: 0, Time elapsed: 22.505 sec - in org.apache.hadoop.hbase.util.TestMergeTable
Running org.apache.hadoop.hbase.zookeeper.TestHQuorumPeer
Tests run: 4, Failures: 0, Errors: 0, Skipped: 0, Time elapsed: 0.976 sec - in org.apache.hadoop.hbase.zookeeper.TestHQuorumPeer
Running org.apache.hadoop.hbase.zookeeper.TestZKLeaderManager
Tests run: 1, Failures: 0, Errors: 0, Skipped: 0, Time elapsed: 0.139 sec - in org.apache.hadoop.hbase.zookeeper.TestZKLeaderManager
Running org.apache.hadoop.hbase.zookeeper.TestZooKeeperACL
Tests run: 7, Failures: 0, Errors: 0, Skipped: 0, Time elapsed: 0.421 sec - in org.apache.hadoop.hbase.zookeeper.TestZooKeeperACL
Running org.apache.hadoop.hbase.zookeeper.TestZKMulti
Running org.apache.hadoop.hbase.zookeeper.TestZooKeeperNodeTracker
Tests run: 12, Failures: 0, Errors: 0, Skipped: 0, Time elapsed: 1.406 sec - in org.apache.hadoop.hbase.zookeeper.TestZKMulti
Tests run: 3, Failures: 0, Errors: 0, Skipped: 0, Time elapsed: 1.082 sec - in org.apache.hadoop.hbase.zookeeper.TestZooKeeperNodeTracker
Running org.apache.hadoop.hbase.TestStochasticBalancerJmxMetrics
Tests run: 1, Failures: 0, Errors: 0, Skipped: 1, Time elapsed: 0.001 sec - in org.apache.hadoop.hbase.TestStochasticBalancerJmxMetrics
Tests run: 6, Failures: 0, Errors: 0, Skipped: 0, Time elapsed: 24.697 sec - in org.apache.hadoop.hbase.zookeeper.lock.TestZKInterProcessReadWriteLock
Running org.apache.hadoop.hbase.TestZooKeeper
Running org.apache.hadoop.hbase.TestFullLogReconstruction
Running org.apache.hadoop.hbase.TestJMXListener
Tests run: 3, Failures: 0, Errors: 0, Skipped: 0, Time elapsed: 1.184 sec - in org.apache.hadoop.hbase.TestJMXListener
Tests run: 1, Failures: 0, Errors: 0, Skipped: 0, Time elapsed: 11.59 sec - in org.apache.hadoop.hbase.TestFullLogReconstruction
Running org.apache.hadoop.hbase.TestPartialResultsFromClientSide
Running org.apache.hadoop.hbase.trace.TestHTraceHooks
Tests run: 1, Failures: 0, Errors: 0, Skipped: 0, Time elapsed: 18.967 sec - in org.apache.hadoop.hbase.trace.TestHTraceHooks
Tests run: 19, Failures: 0, Errors: 0, Skipped: 0, Time elapsed: 84.707 sec - in org.apache.hadoop.hbase.TestPartialResultsFromClientSide
Tests run: 59, Failures: 0, Errors: 0, Skipped: 1, Time elapsed: 384.252 sec - in org.apache.hadoop.hbase.util.TestHBaseFsck
Tests run: 8, Failures: 0, Errors: 2, Skipped: 0, Time elapsed: 697.163 sec <<< FAILURE!
- in org.apache.hadoop.hbase.mapred.TestTableSnapshotInputFormat
testWithMockedMapReduceMultiRegion(org.apache.hadoop.hbase.mapred.TestTableSnapshotInputFormat)
 Time elapsed: 600.033 sec  <<< ERROR!
org.junit.runners.model.TestTimedOutException: test timed out after 10 minutes
	at java.lang.Object.wait(Native Method)
	at org.apache.hadoop.hbase.client.RpcRetryingCaller.callWithRetries(RpcRetryingCaller.java:186)
	at org.apache.hadoop.hbase.client.HBaseAdmin.executeCallable(HBaseAdmin.java:4443)
	at org.apache.hadoop.hbase.client.HBaseAdmin.executeCallable(HBaseAdmin.java:4435)
	at org.apache.hadoop.hbase.client.HBaseAdmin.deleteSnapshot(HBaseAdmin.java:4315)
	at org.apache.hadoop.hbase.mapred.TestTableSnapshotInputFormat.testWithMockedMapReduce(TestTableSnapshotInputFormat.java:179)
	at org.apache.hadoop.hbase.mapred.TestTableSnapshotInputFormat.testWithMockedMapReduceMultiRegion(TestTableSnapshotInputFormat.java:134)

testWithMockedMapReduceMultiRegion(org.apache.hadoop.hbase.mapred.TestTableSnapshotInputFormat)
 Time elapsed: 600.033 sec  <<< ERROR!
java.lang.Exception: Appears to be stuck in thread NIOServerCxn.Factory:0.0.0.0/0.0.0.0:65072
	at sun.nio.ch.EPollArrayWrapper.epollWait(Native Method)
	at sun.nio.ch.EPollArrayWrapper.poll(EPollArrayWrapper.java:269)
	at sun.nio.ch.EPollSelectorImpl.doSelect(EPollSelectorImpl.java:79)
	at sun.nio.ch.SelectorImpl.lockAndDoSelect(SelectorImpl.java:87)
	at sun.nio.ch.SelectorImpl.select(SelectorImpl.java:98)
	at org.apache.zookeeper.server.NIOServerCnxnFactory.run(NIOServerCnxnFactory.java:178)
	at java.lang.Thread.run(Thread.java:745)

Tests run: 1, Failures: 0, Errors: 0, Skipped: 0, Time elapsed: 708.321 sec - in org.apache.hadoop.hbase.mapred.TestTableSnapshotInputFormat
Tests run: 10, Failures: 0, Errors: 1, Skipped: 0, Time elapsed: 460.262 sec <<<
FAILURE! - in org.apache.hadoop.hbase.TestZooKeeper
testMasterZKSessionRecoveryFailure(org.apache.hadoop.hbase.TestZooKeeper)  Time elapsed: 303.435
sec  <<< ERROR!
org.junit.runners.model.TestTimedOutException: test timed out after 300000 milliseconds
	at java.lang.Object.wait(Native Method)
	at java.lang.Object.wait(Object.java:503)
	at org.apache.hadoop.hbase.ipc.BlockingRpcCallback.get(BlockingRpcCallback.java:62)
	at org.apache.hadoop.hbase.ipc.AbstractRpcClient.callBlockingMethod(AbstractRpcClient.java:330)
	at org.apache.hadoop.hbase.ipc.AbstractRpcClient.access$200(AbstractRpcClient.java:94)
	at org.apache.hadoop.hbase.ipc.AbstractRpcClient$BlockingRpcChannelImplementation.callBlockingMethod(AbstractRpcClient.java:570)
	at org.apache.hadoop.hbase.protobuf.generated.MasterProtos$MasterService$BlockingStub.createTable(MasterProtos.java:65095)
	at org.apache.hadoop.hbase.client.ConnectionManager$HConnectionImplementation$4.createTable(ConnectionManager.java:1885)
	at org.apache.hadoop.hbase.client.HBaseAdmin$5.call(HBaseAdmin.java:763)
	at org.apache.hadoop.hbase.client.HBaseAdmin$5.call(HBaseAdmin.java:755)
	at org.apache.hadoop.hbase.client.RpcRetryingCaller.callWithRetries(RpcRetryingCaller.java:141)
	at org.apache.hadoop.hbase.client.HBaseAdmin.executeCallable(HBaseAdmin.java:4443)
	at org.apache.hadoop.hbase.client.HBaseAdmin.executeCallable(HBaseAdmin.java:4435)
	at org.apache.hadoop.hbase.client.HBaseAdmin.createTableAsyncV2(HBaseAdmin.java:754)
	at org.apache.hadoop.hbase.client.HBaseAdmin.createTable(HBaseAdmin.java:675)
	at org.apache.hadoop.hbase.client.HBaseAdmin.createTable(HBaseAdmin.java:608)
	at org.apache.hadoop.hbase.TestZooKeeper.testSanity(TestZooKeeper.java:258)
	at org.apache.hadoop.hbase.TestZooKeeper.testMasterZKSessionRecoveryFailure(TestZooKeeper.java:243)

Tests run: 1, Failures: 0, Errors: 0, Skipped: 0, Time elapsed: 469.678 sec - in org.apache.hadoop.hbase.TestZooKeeper

Results :

Tests in error: 
org.apache.hadoop.hbase.client.TestClientScannerRPCTimeout.testScannerNextRPCTimesout(org.apache.hadoop.hbase.client.TestClientScannerRPCTimeout)
  Run 1: TestClientScannerRPCTimeout.testScannerNextRPCTimesout:87 » TableExists testSc...
  Run 2: TestClientScannerRPCTimeout.testScannerNextRPCTimesout:87 » TableExists testSc...
  Run 3: TestClientScannerRPCTimeout.testScannerNextRPCTimesout:87 » TableExists testSc...

org.apache.hadoop.hbase.master.TestAssignmentListener.testAssignmentListener(org.apache.hadoop.hbase.master.TestAssignmentListener)
  Run 1: TestAssignmentListener.testAssignmentListener:228 » TestTimedOut test timed ou...
  Run 2: TestAssignmentListener.testAssignmentListener:228 » TestTimedOut test timed ou...
  Run 3: TestAssignmentListener.testAssignmentListener:228 » TestTimedOut test timed ou...

Flaked tests: 
org.apache.hadoop.hbase.TestZooKeeper.testMasterZKSessionRecoveryFailure(org.apache.hadoop.hbase.TestZooKeeper)
  Run 1: TestZooKeeper.testMasterZKSessionRecoveryFailure:243->testSanity:258->Object.wait:503->Object.wait:-2
» TestTimedOut
  Run 2: PASS

org.apache.hadoop.hbase.mapred.TestTableSnapshotInputFormat.testWithMockedMapReduceMultiRegion(org.apache.hadoop.hbase.mapred.TestTableSnapshotInputFormat)
  Run 1: TestTableSnapshotInputFormat.testWithMockedMapReduceMultiRegion:134->testWithMockedMapReduce:179->Object.wait:-2
» TestTimedOut
  Run 2: TestTableSnapshotInputFormat.testWithMockedMapReduceMultiRegion »  Appears to ...
  Run 3: PASS

org.apache.hadoop.hbase.regionserver.TestScannerHeartbeatMessages.testScannerHeartbeatMessages(org.apache.hadoop.hbase.regionserver.TestScannerHeartbeatMessages)
  Run 1: TestScannerHeartbeatMessages.testScannerHeartbeatMessages:207->testImportanceOfHeartbeats:237
Heartbeats messages are disabled, an exception should be thrown. If an exception  is not thrown,
the test case is not testing the importance of heartbeat messages
  Run 2: PASS


Tests run: 2832, Failures: 0, Errors: 2, Skipped: 57, Flakes: 3

[INFO] ------------------------------------------------------------------------
[INFO] Reactor Summary:
[INFO] 
[INFO] Apache HBase ...................................... SUCCESS [1:50.150s]
[INFO] Apache HBase - Checkstyle ......................... SUCCESS [16.858s]
[INFO] Apache HBase - Resource Bundle .................... SUCCESS [0.256s]
[INFO] Apache HBase - Annotations ........................ SUCCESS [1.243s]
[INFO] Apache HBase - Protocol ........................... SUCCESS [17.064s]
[INFO] Apache HBase - Common ............................. SUCCESS [2:52.467s]
[INFO] Apache HBase - Procedure .......................... SUCCESS [3:35.416s]
[INFO] Apache HBase - Metrics API ........................ SUCCESS [1.958s]
[INFO] Apache HBase - Hadoop Compatibility ............... SUCCESS [13.152s]
[INFO] Apache HBase - Metrics Implementation ............. SUCCESS [6.742s]
[INFO] Apache HBase - Hadoop Two Compatibility ........... SUCCESS [24.656s]
[INFO] Apache HBase - Client ............................. SUCCESS [1:53.512s]
[INFO] Apache HBase - Prefix Tree ........................ SUCCESS [11.985s]
[INFO] Apache HBase - Server ............................. FAILURE [1:48:21.695s]
[INFO] Apache HBase - Testing Util ....................... SKIPPED
[INFO] Apache HBase - Thrift ............................. SKIPPED
[INFO] Apache HBase - Rest ............................... SKIPPED
[INFO] Apache HBase - Shell .............................. SKIPPED
[INFO] Apache HBase - Integration Tests .................. SKIPPED
[INFO] Apache HBase - Examples ........................... SKIPPED
[INFO] Apache HBase - External Block Cache ............... SKIPPED
[INFO] Apache HBase - Assembly ........................... SKIPPED
[INFO] Apache HBase - Shaded ............................. SKIPPED
[INFO] Apache HBase - Shaded - Client .................... SKIPPED
[INFO] Apache HBase - Shaded - Server .................... SKIPPED
[INFO] Apache HBase - Archetypes ......................... SKIPPED
[INFO] Apache HBase - Exemplar for hbase-client archetype  SKIPPED
[INFO] Apache HBase - Exemplar for hbase-shaded-client archetype  SKIPPED
[INFO] Apache HBase - Archetype builder .................. SKIPPED
[INFO] ------------------------------------------------------------------------
[INFO] BUILD FAILURE
[INFO] ------------------------------------------------------------------------
[INFO] Total time: 2:00:41.264s
[INFO] Finished at: Mon Aug 14 18:34:18 UTC 2017
[INFO] Final Memory: 101M/1122M
[INFO] ------------------------------------------------------------------------
[ERROR] Failed to execute goal org.apache.maven.plugins:maven-surefire-plugin:2.18.1:test
(secondPartTestsExecution) on project hbase-server: There was a timeout or other error in
the fork -> [Help 1]
[ERROR] 
[ERROR] To see the full stack trace of the errors, re-run Maven with the -e switch.
[ERROR] Re-run Maven using the -X switch to enable full debug logging.
[ERROR] 
[ERROR] For more information about the errors and possible solutions, please read the following
articles:
[ERROR] [Help 1] http://cwiki.apache.org/confluence/display/MAVEN/MojoFailureException
[ERROR] 
[ERROR] After correcting the problems, you can resume the build with the command
[ERROR]   mvn <goals> -rf :hbase-server
Build step 'Invoke top-level Maven targets' marked build as failure
Performing Post build task...
Match found for :.* : True
Logical operation result is TRUE
Running script  : # Post-build task script. TODO: Check this in and have all builds reference
check-in.
pwd && ls
# NOTE!!!! The below code has been copied and pasted from ./dev-tools/run-test.sh
# Do not change here without syncing there and vice-versa.
ZOMBIE_TESTS_COUNT=`jps -v | grep surefirebooter | grep -e '-Dhbase.test' | wc -l`
if [[ $ZOMBIE_TESTS_COUNT != 0 ]] ; then
 echo "Suspicious java process found - waiting 30s to see if there are just slow to stop"
 sleep 30
 ZOMBIE_TESTS_COUNT=`jps -v | grep surefirebooter | grep -e '-Dhbase.test' | wc -l`
 if [[ $ZOMBIE_TESTS_COUNT != 0 ]] ; then
   echo " {color:red}There appear to be $ZOMBIE_TESTS_COUNT zombie tests{color}, they should
have been killed by surefire but survived"
   jps -v | grep surefirebooter | grep -e '-Dhbase.test'
   jps -v | grep surefirebooter | grep -e '-Dhbase.test' | cut -d ' ' -f 1 | xargs -n 1 jstack
   # Exit with error
   exit 1
 else
   echo "We're ok: there is no zombie test, but some tests took some time to stop"
 fi
else
  echo "We're ok: there is no zombie test"
fi
Setting JDK_1_7_LATEST__HOME=/home/jenkins/tools/java/latest1.7
Setting JDK_1_8_LATEST__HOME=/home/jenkins/tools/java/latest1.8
[19ccb43d] $ /bin/bash -xe /tmp/jenkins5205084350859255636.sh
+ pwd
<https://builds.apache.org/job/HBase-1.5/jdk=JDK_1_7,label=Hadoop&&!H13/ws/>
+ ls
bin
CHANGES.txt
conf
dev-support
extra_env_var
hbase-annotations
hbase-archetypes
hbase-assembly
hbase-checkstyle
hbase-client
hbase-common
hbase-examples
hbase-external-blockcache
hbase-hadoop2-compat
hbase-hadoop-compat
hbase-it
hbase-metrics
hbase-metrics-api
hbase-native-client
hbase-prefix-tree
hbase-procedure
hbase-protocol
hbase-resource-bundle
hbase-rest
hbase-server
hbase-shaded
hbase-shell
hbase-testing-util
hbase-thrift
LICENSE.txt
NOTICE.txt
pom.xml
README.txt
src
target
++ jps -v
++ grep surefirebooter
++ wc -l
++ grep -e -Dhbase.test
+ ZOMBIE_TESTS_COUNT=0
+ [[ 0 != 0 ]]
+ echo 'We'\''re ok: there is no zombie test'
We're ok: there is no zombie test
POST BUILD TASK : SUCCESS
END OF POST BUILD TASK : 0
Archiving artifacts
Setting JDK_1_7_LATEST__HOME=/home/jenkins/tools/java/latest1.7
Setting JDK_1_8_LATEST__HOME=/home/jenkins/tools/java/latest1.8
[Fast Archiver] No prior successful build to compare, so performing full copy of artifacts
Recording test results
Setting JDK_1_7_LATEST__HOME=/home/jenkins/tools/java/latest1.7
Setting JDK_1_8_LATEST__HOME=/home/jenkins/tools/java/latest1.8
Setting JDK_1_7_LATEST__HOME=/home/jenkins/tools/java/latest1.7
Setting JDK_1_8_LATEST__HOME=/home/jenkins/tools/java/latest1.8

Mime
View raw message