hbase-builds mailing list archives

Site index · List index
Message view « Date » · « Thread »
Top « Date » · « Thread »
From Apache Jenkins Server <jenk...@builds.apache.org>
Subject Build failed in Jenkins: HBase-1.4 » JDK_1_7,Hadoop&&!H13 #896
Date Thu, 31 Aug 2017 18:18:14 GMT
See <https://builds.apache.org/job/HBase-1.4/jdk=JDK_1_7,label=Hadoop&&!H13/896/display/redirect?page=changes>

Changes:

[tedyu] HBASE-18461 Build broken If the username contains a backslash

------------------------------------------
[...truncated 2.45 MB...]
Tests run: 6, Failures: 0, Errors: 0, Skipped: 0, Time elapsed: 11.305 sec - in org.apache.hadoop.hbase.util.TestRegionSplitter
Running org.apache.hadoop.hbase.util.TestConnectionCache
Tests run: 7, Failures: 0, Errors: 0, Skipped: 0, Time elapsed: 122.26 sec - in org.apache.hadoop.hbase.mapred.TestTableSnapshotInputFormat
Running org.apache.hadoop.hbase.util.TestCoprocessorScanPolicy
Running org.apache.hadoop.hbase.util.TestIdReadWriteLock
Tests run: 8, Failures: 0, Errors: 0, Skipped: 0, Time elapsed: 41.643 sec - in org.apache.hadoop.hbase.TestNamespace
Running org.apache.hadoop.hbase.util.TestIdLock
Tests run: 1, Failures: 0, Errors: 0, Skipped: 0, Time elapsed: 16.084 sec - in org.apache.hadoop.hbase.util.TestIdReadWriteLock
Tests run: 1, Failures: 0, Errors: 0, Skipped: 0, Time elapsed: 20.038 sec - in org.apache.hadoop.hbase.util.TestConnectionCache
Tests run: 2, Failures: 0, Errors: 0, Skipped: 0, Time elapsed: 62.756 sec - in org.apache.hadoop.hbase.TestDrainingServer
Tests run: 1, Failures: 0, Errors: 0, Skipped: 0, Time elapsed: 15.983 sec - in org.apache.hadoop.hbase.util.TestIdLock
Running org.apache.hadoop.hbase.util.TestMiniClusterLoadSequential
Tests run: 4, Failures: 0, Errors: 0, Skipped: 0, Time elapsed: 21.162 sec - in org.apache.hadoop.hbase.util.TestCoprocessorScanPolicy
Running org.apache.hadoop.hbase.util.TestMergeTool
Running org.apache.hadoop.hbase.util.TestFSVisitor
Running org.apache.hadoop.hbase.util.TestTableName
Tests run: 6, Failures: 0, Errors: 0, Skipped: 0, Time elapsed: 0.981 sec - in org.apache.hadoop.hbase.util.TestTableName
Tests run: 1, Failures: 0, Errors: 0, Skipped: 0, Time elapsed: 2.847 sec - in org.apache.hadoop.hbase.util.TestFSVisitor
Running org.apache.hadoop.hbase.util.TestFSUtils
Running org.apache.hadoop.hbase.util.hbck.TestOfflineMetaRebuildOverlap
Running org.apache.hadoop.hbase.util.TestHBaseFsck
Tests run: 14, Failures: 0, Errors: 0, Skipped: 0, Time elapsed: 23.82 sec - in org.apache.hadoop.hbase.util.TestFSUtils
Running org.apache.hadoop.hbase.util.hbck.TestOfflineMetaRebuildHole
Tests run: 1, Failures: 0, Errors: 0, Skipped: 0, Time elapsed: 31.611 sec - in org.apache.hadoop.hbase.util.TestMergeTool
Running org.apache.hadoop.hbase.util.hbck.TestOfflineMetaRebuildBase
Tests run: 1, Failures: 0, Errors: 0, Skipped: 0, Time elapsed: 34.035 sec - in org.apache.hadoop.hbase.util.hbck.TestOfflineMetaRebuildOverlap
Running org.apache.hadoop.hbase.util.TestMiniClusterLoadEncoded
Tests run: 1, Failures: 0, Errors: 0, Skipped: 0, Time elapsed: 32.142 sec - in org.apache.hadoop.hbase.util.hbck.TestOfflineMetaRebuildHole
Running org.apache.hadoop.hbase.util.TestFSHDFSUtils
Tests run: 4, Failures: 0, Errors: 0, Skipped: 0, Time elapsed: 67.315 sec - in org.apache.hadoop.hbase.util.TestMiniClusterLoadSequential
Running org.apache.hadoop.hbase.util.TestFSTableDescriptors
Tests run: 15, Failures: 0, Errors: 0, Skipped: 0, Time elapsed: 3.232 sec - in org.apache.hadoop.hbase.util.TestFSTableDescriptors
Tests run: 3, Failures: 0, Errors: 0, Skipped: 0, Time elapsed: 8.879 sec - in org.apache.hadoop.hbase.util.TestFSHDFSUtils
Running org.apache.hadoop.hbase.util.TestMiniClusterLoadParallel
Running org.apache.hadoop.hbase.util.TestMergeTable
Tests run: 2, Failures: 0, Errors: 0, Skipped: 0, Time elapsed: 70.987 sec - in org.apache.hadoop.hbase.util.hbck.TestOfflineMetaRebuildBase
Tests run: 1, Failures: 0, Errors: 0, Skipped: 0, Time elapsed: 29.197 sec - in org.apache.hadoop.hbase.util.TestMergeTable
Running org.apache.hadoop.hbase.zookeeper.lock.TestZKInterProcessReadWriteLock
Running org.apache.hadoop.hbase.zookeeper.TestZKTableStateManager
Tests run: 1, Failures: 0, Errors: 0, Skipped: 0, Time elapsed: 1.477 sec - in org.apache.hadoop.hbase.zookeeper.TestZKTableStateManager
Running org.apache.hadoop.hbase.zookeeper.TestRecoverableZooKeeper
Tests run: 1, Failures: 0, Errors: 0, Skipped: 0, Time elapsed: 1.992 sec - in org.apache.hadoop.hbase.zookeeper.TestRecoverableZooKeeper
Tests run: 6, Failures: 0, Errors: 0, Skipped: 0, Time elapsed: 79.899 sec - in org.apache.hadoop.hbase.util.TestMiniClusterLoadEncoded
Running org.apache.hadoop.hbase.zookeeper.TestZooKeeperACL
Tests run: 7, Failures: 0, Errors: 0, Skipped: 0, Time elapsed: 0.748 sec - in org.apache.hadoop.hbase.zookeeper.TestZooKeeperACL
Running org.apache.hadoop.hbase.zookeeper.TestHQuorumPeer
Tests run: 4, Failures: 0, Errors: 0, Skipped: 0, Time elapsed: 1.719 sec - in org.apache.hadoop.hbase.zookeeper.TestHQuorumPeer
Tests run: 6, Failures: 0, Errors: 0, Skipped: 0, Time elapsed: 24.895 sec - in org.apache.hadoop.hbase.zookeeper.lock.TestZKInterProcessReadWriteLock
Running org.apache.hadoop.hbase.zookeeper.TestZKLeaderManager
Tests run: 1, Failures: 0, Errors: 0, Skipped: 0, Time elapsed: 0.244 sec - in org.apache.hadoop.hbase.zookeeper.TestZKLeaderManager
Running org.apache.hadoop.hbase.zookeeper.TestZKMulti
Running org.apache.hadoop.hbase.zookeeper.TestZooKeeperNodeTracker
Tests run: 3, Failures: 0, Errors: 0, Skipped: 0, Time elapsed: 2.216 sec - in org.apache.hadoop.hbase.zookeeper.TestZooKeeperNodeTracker
Tests run: 12, Failures: 0, Errors: 0, Skipped: 0, Time elapsed: 2.749 sec - in org.apache.hadoop.hbase.zookeeper.TestZKMulti
Running org.apache.hadoop.hbase.TestStochasticBalancerJmxMetrics
Tests run: 1, Failures: 0, Errors: 0, Skipped: 1, Time elapsed: 0.002 sec - in org.apache.hadoop.hbase.TestStochasticBalancerJmxMetrics
Tests run: 4, Failures: 0, Errors: 0, Skipped: 0, Time elapsed: 62.695 sec - in org.apache.hadoop.hbase.util.TestMiniClusterLoadParallel
Running org.apache.hadoop.hbase.TestZooKeeper
Running org.apache.hadoop.hbase.TestFullLogReconstruction
Running org.apache.hadoop.hbase.TestJMXListener
Tests run: 3, Failures: 0, Errors: 0, Skipped: 0, Time elapsed: 1.76 sec - in org.apache.hadoop.hbase.TestJMXListener
Running org.apache.hadoop.hbase.TestPartialResultsFromClientSide
Tests run: 1, Failures: 0, Errors: 0, Skipped: 0, Time elapsed: 15.342 sec - in org.apache.hadoop.hbase.TestFullLogReconstruction
Running org.apache.hadoop.hbase.trace.TestHTraceHooks
Tests run: 1, Failures: 0, Errors: 0, Skipped: 0, Time elapsed: 18.612 sec - in org.apache.hadoop.hbase.trace.TestHTraceHooks
Tests run: 19, Failures: 0, Errors: 0, Skipped: 0, Time elapsed: 87.549 sec - in org.apache.hadoop.hbase.TestPartialResultsFromClientSide
Tests run: 59, Failures: 0, Errors: 0, Skipped: 1, Time elapsed: 405.454 sec - in org.apache.hadoop.hbase.util.TestHBaseFsck
Tests run: 10, Failures: 0, Errors: 1, Skipped: 0, Time elapsed: 463.707 sec <<<
FAILURE! - in org.apache.hadoop.hbase.TestZooKeeper
testMasterZKSessionRecoveryFailure(org.apache.hadoop.hbase.TestZooKeeper)  Time elapsed: 303.592
sec  <<< ERROR!
org.junit.runners.model.TestTimedOutException: test timed out after 300000 milliseconds
	at java.lang.Object.wait(Native Method)
	at java.lang.Object.wait(Object.java:503)
	at org.apache.hadoop.hbase.ipc.BlockingRpcCallback.get(BlockingRpcCallback.java:62)
	at org.apache.hadoop.hbase.ipc.AbstractRpcClient.callBlockingMethod(AbstractRpcClient.java:330)
	at org.apache.hadoop.hbase.ipc.AbstractRpcClient.access$200(AbstractRpcClient.java:94)
	at org.apache.hadoop.hbase.ipc.AbstractRpcClient$BlockingRpcChannelImplementation.callBlockingMethod(AbstractRpcClient.java:570)
	at org.apache.hadoop.hbase.protobuf.generated.MasterProtos$MasterService$BlockingStub.createTable(MasterProtos.java:65095)
	at org.apache.hadoop.hbase.client.ConnectionManager$HConnectionImplementation$4.createTable(ConnectionManager.java:1885)
	at org.apache.hadoop.hbase.client.HBaseAdmin$5.call(HBaseAdmin.java:764)
	at org.apache.hadoop.hbase.client.HBaseAdmin$5.call(HBaseAdmin.java:756)
	at org.apache.hadoop.hbase.client.RpcRetryingCaller.callWithRetries(RpcRetryingCaller.java:141)
	at org.apache.hadoop.hbase.client.HBaseAdmin.executeCallable(HBaseAdmin.java:4444)
	at org.apache.hadoop.hbase.client.HBaseAdmin.executeCallable(HBaseAdmin.java:4436)
	at org.apache.hadoop.hbase.client.HBaseAdmin.createTableAsyncV2(HBaseAdmin.java:755)
	at org.apache.hadoop.hbase.client.HBaseAdmin.createTable(HBaseAdmin.java:676)
	at org.apache.hadoop.hbase.client.HBaseAdmin.createTable(HBaseAdmin.java:609)
	at org.apache.hadoop.hbase.TestZooKeeper.testSanity(TestZooKeeper.java:258)
	at org.apache.hadoop.hbase.TestZooKeeper.testMasterZKSessionRecoveryFailure(TestZooKeeper.java:243)

Tests run: 1, Failures: 0, Errors: 0, Skipped: 0, Time elapsed: 473.556 sec - in org.apache.hadoop.hbase.TestZooKeeper

Results :

Tests in error: 
org.apache.hadoop.hbase.client.TestClientScannerRPCTimeout.testScannerNextRPCTimesout(org.apache.hadoop.hbase.client.TestClientScannerRPCTimeout)
  Run 1: TestClientScannerRPCTimeout.testScannerNextRPCTimesout:87 » TableExists testSc...
  Run 2: TestClientScannerRPCTimeout.testScannerNextRPCTimesout:87 » TableExists testSc...
  Run 3: TestClientScannerRPCTimeout.testScannerNextRPCTimesout:87 » TableExists testSc...

Flaked tests: 
org.apache.hadoop.hbase.TestZooKeeper.testMasterZKSessionRecoveryFailure(org.apache.hadoop.hbase.TestZooKeeper)
  Run 1: TestZooKeeper.testMasterZKSessionRecoveryFailure:243->testSanity:258->Object.wait:503->Object.wait:-2
» TestTimedOut
  Run 2: PASS

org.apache.hadoop.hbase.client.TestReplicasClient.testCancelOfMultiGet(org.apache.hadoop.hbase.client.TestReplicasClient)
  Run 1: TestReplicasClient.testCancelOfMultiGet:587 null
  Run 2: PASS

org.apache.hadoop.hbase.security.visibility.TestVisibilityLablesWithGroups.testGroupAuths(org.apache.hadoop.hbase.security.visibility.TestVisibilityLablesWithGroups)
  Run 1: TestVisibilityLablesWithGroups.testGroupAuths:115 » RetriesExhausted Failed af...
  Run 2: PASS


Tests run: 2842, Failures: 0, Errors: 1, Skipped: 57, Flakes: 3

[INFO] ------------------------------------------------------------------------
[INFO] Reactor Summary:
[INFO] 
[INFO] Apache HBase ...................................... SUCCESS [1:51.162s]
[INFO] Apache HBase - Checkstyle ......................... SUCCESS [16.422s]
[INFO] Apache HBase - Resource Bundle .................... SUCCESS [0.459s]
[INFO] Apache HBase - Annotations ........................ SUCCESS [1.361s]
[INFO] Apache HBase - Protocol ........................... SUCCESS [21.024s]
[INFO] Apache HBase - Common ............................. SUCCESS [3:18.593s]
[INFO] Apache HBase - Procedure .......................... SUCCESS [4:45.103s]
[INFO] Apache HBase - Metrics API ........................ SUCCESS [2.511s]
[INFO] Apache HBase - Hadoop Compatibility ............... SUCCESS [13.645s]
[INFO] Apache HBase - Metrics Implementation ............. SUCCESS [7.604s]
[INFO] Apache HBase - Hadoop Two Compatibility ........... SUCCESS [28.580s]
[INFO] Apache HBase - Client ............................. SUCCESS [2:22.036s]
[INFO] Apache HBase - Prefix Tree ........................ SUCCESS [26.695s]
[INFO] Apache HBase - Server ............................. FAILURE [2:07:03.920s]
[INFO] Apache HBase - Testing Util ....................... SKIPPED
[INFO] Apache HBase - Thrift ............................. SKIPPED
[INFO] Apache HBase - Rest ............................... SKIPPED
[INFO] Apache HBase - Shell .............................. SKIPPED
[INFO] Apache HBase - Integration Tests .................. SKIPPED
[INFO] Apache HBase - Examples ........................... SKIPPED
[INFO] Apache HBase - External Block Cache ............... SKIPPED
[INFO] Apache HBase - Assembly ........................... SKIPPED
[INFO] Apache HBase - Shaded ............................. SKIPPED
[INFO] Apache HBase - Shaded - Client .................... SKIPPED
[INFO] Apache HBase - Shaded - Server .................... SKIPPED
[INFO] Apache HBase Shaded Packaging Invariants .......... SKIPPED
[INFO] Apache HBase - Archetypes ......................... SKIPPED
[INFO] Apache HBase - Exemplar for hbase-client archetype  SKIPPED
[INFO] Apache HBase - Exemplar for hbase-shaded-client archetype  SKIPPED
[INFO] Apache HBase - Archetype builder .................. SKIPPED
[INFO] ------------------------------------------------------------------------
[INFO] BUILD FAILURE
[INFO] ------------------------------------------------------------------------
[INFO] Total time: 2:21:55.279s
[INFO] Finished at: Thu Aug 31 18:11:10 UTC 2017
[INFO] Final Memory: 102M/1042M
[INFO] ------------------------------------------------------------------------
[ERROR] Failed to execute goal org.apache.maven.plugins:maven-surefire-plugin:2.18.1:test
(secondPartTestsExecution) on project hbase-server: There was a timeout or other error in
the fork -> [Help 1]
[ERROR] 
[ERROR] To see the full stack trace of the errors, re-run Maven with the -e switch.
[ERROR] Re-run Maven using the -X switch to enable full debug logging.
[ERROR] 
[ERROR] For more information about the errors and possible solutions, please read the following
articles:
[ERROR] [Help 1] http://cwiki.apache.org/confluence/display/MAVEN/MojoFailureException
[ERROR] 
[ERROR] After correcting the problems, you can resume the build with the command
[ERROR]   mvn <goals> -rf :hbase-server
Build step 'Invoke top-level Maven targets' marked build as failure
Performing Post build task...
Match found for :.* : True
Logical operation result is TRUE
Running script  : # Post-build task script. TODO: Check this in and have all builds reference
check-in.
pwd && ls
# NOTE!!!! The below code has been copied and pasted from ./dev-tools/run-test.sh
# Do not change here without syncing there and vice-versa.
ZOMBIE_TESTS_COUNT=`jps -v | grep surefirebooter | grep -e '-Dhbase.test' | wc -l`
if [[ $ZOMBIE_TESTS_COUNT != 0 ]] ; then
 echo "Suspicious java process found - waiting 30s to see if there are just slow to stop"
 sleep 30
 ZOMBIE_TESTS_COUNT=`jps -v | grep surefirebooter | grep -e '-Dhbase.test' | wc -l`
 if [[ $ZOMBIE_TESTS_COUNT != 0 ]] ; then
   echo " {color:red}There appear to be $ZOMBIE_TESTS_COUNT zombie tests{color}, they should
have been killed by surefire but survived"
   jps -v | grep surefirebooter | grep -e '-Dhbase.test'
   jps -v | grep surefirebooter | grep -e '-Dhbase.test' | cut -d ' ' -f 1 | xargs -n 1 jstack
   # Exit with error
   exit 1
 else
   echo "We're ok: there is no zombie test, but some tests took some time to stop"
 fi
else
  echo "We're ok: there is no zombie test"
fi
Setting JDK_1_7_LATEST__HOME=/home/jenkins/tools/java/latest1.7
Setting JDK_1_8_LATEST__HOME=/home/jenkins/tools/java/latest1.8
[19ccb43d] $ /bin/bash -xe /tmp/jenkins697267847357212698.sh
+ pwd
<https://builds.apache.org/job/HBase-1.4/jdk=JDK_1_7,label=Hadoop&&!H13/ws/>
+ ls
bin
CHANGES.txt
conf
dev-support
extra_env_var
hbase-annotations
hbase-archetypes
hbase-assembly
hbase-checkstyle
hbase-client
hbase-common
hbase-examples
hbase-external-blockcache
hbase-hadoop2-compat
hbase-hadoop-compat
hbase-it
hbase-metrics
hbase-metrics-api
hbase-native-client
hbase-prefix-tree
hbase-procedure
hbase-protocol
hbase-resource-bundle
hbase-rest
hbase-server
hbase-shaded
hbase-shell
hbase-testing-util
hbase-thrift
LICENSE.txt
NOTICE.txt
pom.xml
README.txt
src
target
++ jps -v
++ grep surefirebooter
++ grep -e -Dhbase.test
++ wc -l
+ ZOMBIE_TESTS_COUNT=0
+ [[ 0 != 0 ]]
+ echo 'We'\''re ok: there is no zombie test'
We're ok: there is no zombie test
POST BUILD TASK : SUCCESS
END OF POST BUILD TASK : 0
Archiving artifacts
Setting JDK_1_7_LATEST__HOME=/home/jenkins/tools/java/latest1.7
Setting JDK_1_8_LATEST__HOME=/home/jenkins/tools/java/latest1.8
Recording test results
Setting JDK_1_7_LATEST__HOME=/home/jenkins/tools/java/latest1.7
Setting JDK_1_8_LATEST__HOME=/home/jenkins/tools/java/latest1.8
Setting JDK_1_7_LATEST__HOME=/home/jenkins/tools/java/latest1.7
Setting JDK_1_8_LATEST__HOME=/home/jenkins/tools/java/latest1.8

Mime
View raw message