hbase-builds mailing list archives

Site index · List index
Message view « Date » · « Thread »
Top « Date » · « Thread »
From Apache Jenkins Server <jenk...@builds.apache.org>
Subject Build failed in Jenkins: HBase-1.5 » JDK_1_8,Hadoop&&!H13 #5
Date Tue, 15 Aug 2017 17:48:32 GMT
See <https://builds.apache.org/job/HBase-1.5/jdk=JDK_1_8,label=Hadoop&&!H13/5/display/redirect>

------------------------------------------
[...truncated 2.40 MB...]
Tests run: 3, Failures: 0, Errors: 0, Skipped: 0, Time elapsed: 7.563 sec - in org.apache.hadoop.hbase.util.TestFSHDFSUtils
Tests run: 4, Failures: 0, Errors: 0, Skipped: 0, Time elapsed: 51.528 sec - in org.apache.hadoop.hbase.util.TestMiniClusterLoadParallel
Running org.apache.hadoop.hbase.util.TestFSVisitor
Running org.apache.hadoop.hbase.util.TestFSUtils
Tests run: 1, Failures: 0, Errors: 0, Skipped: 0, Time elapsed: 1.291 sec - in org.apache.hadoop.hbase.util.TestFSVisitor
Running org.apache.hadoop.hbase.util.TestDefaultEnvironmentEdge
Tests run: 1, Failures: 0, Errors: 0, Skipped: 0, Time elapsed: 0.405 sec - in org.apache.hadoop.hbase.util.TestDefaultEnvironmentEdge
Tests run: 1, Failures: 0, Errors: 0, Skipped: 0, Time elapsed: 14.969 sec - in org.apache.hadoop.hbase.util.TestConnectionCache
Running org.apache.hadoop.hbase.wal.TestWALFiltering
Running org.apache.hadoop.hbase.util.TestRegionSplitter
Tests run: 14, Failures: 0, Errors: 0, Skipped: 0, Time elapsed: 14.457 sec - in org.apache.hadoop.hbase.util.TestFSUtils
Tests run: 6, Failures: 0, Errors: 0, Skipped: 0, Time elapsed: 9.164 sec - in org.apache.hadoop.hbase.util.TestRegionSplitter
Running org.apache.hadoop.hbase.wal.TestWALRootDir
Tests run: 1, Failures: 0, Errors: 0, Skipped: 0, Time elapsed: 0.566 sec - in org.apache.hadoop.hbase.wal.TestWALRootDir
Running org.apache.hadoop.hbase.wal.TestWALOpenAfterDNRollingStart
Running org.apache.hadoop.hbase.wal.TestDefaultWALProviderWithHLogKey
Tests run: 1, Failures: 0, Errors: 0, Skipped: 0, Time elapsed: 26.462 sec - in org.apache.hadoop.hbase.wal.TestWALFiltering
Tests run: 5, Failures: 0, Errors: 0, Skipped: 0, Time elapsed: 6.576 sec - in org.apache.hadoop.hbase.wal.TestDefaultWALProviderWithHLogKey
Running org.apache.hadoop.hbase.wal.TestWALReaderOnSecureWAL
Running org.apache.hadoop.hbase.wal.TestBoundedRegionGroupingStrategy
Tests run: 2, Failures: 0, Errors: 0, Skipped: 0, Time elapsed: 1.573 sec - in org.apache.hadoop.hbase.wal.TestWALReaderOnSecureWAL
Running org.apache.hadoop.hbase.wal.TestWALSplit
Tests run: 5, Failures: 0, Errors: 0, Skipped: 0, Time elapsed: 19.508 sec - in org.apache.hadoop.hbase.wal.TestBoundedRegionGroupingStrategy
Running org.apache.hadoop.hbase.wal.TestSecureWAL
Tests run: 1, Failures: 0, Errors: 0, Skipped: 0, Time elapsed: 1.113 sec - in org.apache.hadoop.hbase.wal.TestSecureWAL
Running org.apache.hadoop.hbase.wal.TestWALSplitCompressed
Tests run: 1, Failures: 0, Errors: 0, Skipped: 0, Time elapsed: 46.044 sec - in org.apache.hadoop.hbase.wal.TestWALOpenAfterDNRollingStart
Running org.apache.hadoop.hbase.wal.TestDefaultWALProvider
Tests run: 5, Failures: 0, Errors: 0, Skipped: 0, Time elapsed: 6.965 sec - in org.apache.hadoop.hbase.wal.TestDefaultWALProvider
Running org.apache.hadoop.hbase.wal.TestWALFactory
Tests run: 9, Failures: 0, Errors: 0, Skipped: 0, Time elapsed: 15 sec - in org.apache.hadoop.hbase.wal.TestWALFactory
Running org.apache.hadoop.hbase.namespace.TestNamespaceAuditor
Tests run: 33, Failures: 0, Errors: 0, Skipped: 0, Time elapsed: 76.357 sec - in org.apache.hadoop.hbase.wal.TestWALSplit
Running org.apache.hadoop.hbase.constraint.TestConstraint
Tests run: 33, Failures: 0, Errors: 0, Skipped: 0, Time elapsed: 70.909 sec - in org.apache.hadoop.hbase.wal.TestWALSplitCompressed
Running org.apache.hadoop.hbase.TestNamespace
Tests run: 5, Failures: 0, Errors: 0, Skipped: 0, Time elapsed: 23.322 sec - in org.apache.hadoop.hbase.constraint.TestConstraint
Running org.apache.hadoop.hbase.TestInfoServers
Tests run: 3, Failures: 0, Errors: 0, Skipped: 0, Time elapsed: 5.958 sec - in org.apache.hadoop.hbase.TestInfoServers
Running org.apache.hadoop.hbase.TestRegionRebalancing
Tests run: 8, Failures: 0, Errors: 0, Skipped: 0, Time elapsed: 39.24 sec - in org.apache.hadoop.hbase.TestNamespace
Running org.apache.hadoop.hbase.filter.TestMultiRowRangeFilter
Tests run: 2, Failures: 0, Errors: 0, Skipped: 0, Time elapsed: 44.393 sec - in org.apache.hadoop.hbase.TestRegionRebalancing
Tests run: 21, Failures: 0, Errors: 0, Skipped: 0, Time elapsed: 22.989 sec - in org.apache.hadoop.hbase.filter.TestMultiRowRangeFilter
Tests run: 12, Failures: 0, Errors: 0, Skipped: 1, Time elapsed: 106.896 sec - in org.apache.hadoop.hbase.namespace.TestNamespaceAuditor
Running org.apache.hadoop.hbase.filter.TestScanRowPrefix
Running org.apache.hadoop.hbase.filter.TestFuzzyRowFilterEndToEnd
Running org.apache.hadoop.hbase.filter.TestFilterWrapper
Tests run: 1, Failures: 0, Errors: 0, Skipped: 0, Time elapsed: 8.746 sec - in org.apache.hadoop.hbase.filter.TestScanRowPrefix
Tests run: 1, Failures: 0, Errors: 0, Skipped: 0, Time elapsed: 3.724 sec - in org.apache.hadoop.hbase.filter.TestFilterWrapper
Running org.apache.hadoop.hbase.filter.TestFuzzyRowAndColumnRangeFilter
Running org.apache.hadoop.hbase.filter.TestColumnRangeFilter
Tests run: 1, Failures: 0, Errors: 0, Skipped: 0, Time elapsed: 6.793 sec - in org.apache.hadoop.hbase.filter.TestFuzzyRowAndColumnRangeFilter
Tests run: 1, Failures: 0, Errors: 0, Skipped: 0, Time elapsed: 10.062 sec - in org.apache.hadoop.hbase.filter.TestColumnRangeFilter
Running org.apache.hadoop.hbase.filter.TestFilterWithScanLimits
Running org.apache.hadoop.hbase.filter.TestFilterListOrOperatorWithBlkCnt
Tests run: 1, Failures: 0, Errors: 0, Skipped: 0, Time elapsed: 4.973 sec - in org.apache.hadoop.hbase.filter.TestFilterWithScanLimits
Running org.apache.hadoop.hbase.io.TestFileLink
Tests run: 1, Failures: 0, Errors: 0, Skipped: 0, Time elapsed: 11.149 sec - in org.apache.hadoop.hbase.filter.TestFilterListOrOperatorWithBlkCnt
Running org.apache.hadoop.hbase.io.hfile.TestScannerSelectionUsingTTL
Tests run: 6, Failures: 0, Errors: 0, Skipped: 0, Time elapsed: 12.213 sec - in org.apache.hadoop.hbase.io.TestFileLink
Running org.apache.hadoop.hbase.io.hfile.TestCacheConfig
Tests run: 7, Failures: 0, Errors: 0, Skipped: 0, Time elapsed: 1.433 sec - in org.apache.hadoop.hbase.io.hfile.TestCacheConfig
Running org.apache.hadoop.hbase.io.hfile.TestHFileSeek
Tests run: 1, Failures: 0, Errors: 0, Skipped: 0, Time elapsed: 1.61 sec - in org.apache.hadoop.hbase.io.hfile.TestHFileSeek
Running org.apache.hadoop.hbase.io.hfile.TestSeekBeforeWithInlineBlocks
Tests run: 1, Failures: 0, Errors: 0, Skipped: 0, Time elapsed: 9.765 sec - in org.apache.hadoop.hbase.io.hfile.TestSeekBeforeWithInlineBlocks
Running org.apache.hadoop.hbase.io.hfile.TestForceCacheImportantBlocks
Tests run: 59, Failures: 0, Errors: 0, Skipped: 1, Time elapsed: 368.431 sec - in org.apache.hadoop.hbase.util.TestHBaseFsck
Running org.apache.hadoop.hbase.io.hfile.TestCacheOnWrite
Tests run: 4, Failures: 0, Errors: 0, Skipped: 0, Time elapsed: 32.704 sec - in org.apache.hadoop.hbase.io.hfile.TestForceCacheImportantBlocks
Running org.apache.hadoop.hbase.io.hfile.TestHFileBlock

Results :

Failed tests: 
  TestVisibilityLabelsWithACL.setupBeforeClass:103 Waiting timed out after [10,000] msec
Tests in error: 
org.apache.hadoop.hbase.master.TestTableLockManager.testReapAllTableLocks(org.apache.hadoop.hbase.master.TestTableLockManager)
  Run 1: TestTableLockManager.testReapAllTableLocks:283 » LockTimeout Timed out acquiri...
  Run 2: TestTableLockManager.testReapAllTableLocks:283 » LockTimeout Timed out acquiri...
  Run 3: TestTableLockManager.testReapAllTableLocks:283 » LockTimeout Timed out acquiri...

org.apache.hadoop.hbase.regionserver.TestSCVFWithMiniCluster.org.apache.hadoop.hbase.regionserver.TestSCVFWithMiniCluster
  Run 1: TestSCVFWithMiniCluster.setUp:83->create:229 » RetriesExhausted Failed after
a...
  Run 2: TestSCVFWithMiniCluster.tearDown:128 NullPointer

Flaked tests: 
org.apache.hadoop.hbase.client.TestClientScannerRPCTimeout.testScannerNextRPCTimesout(org.apache.hadoop.hbase.client.TestClientScannerRPCTimeout)
  Run 1: TestClientScannerRPCTimeout.testScannerNextRPCTimesout:87 » TableExists testSc...
  Run 2: PASS

org.apache.hadoop.hbase.security.visibility.TestEnforcingScanLabelGenerator.testEnforcingScanLabelGenerator(org.apache.hadoop.hbase.security.visibility.TestEnforcingScanLabelGenerator)
  Run 1: TestEnforcingScanLabelGenerator.testEnforcingScanLabelGenerator:101 » RetriesExhausted
  Run 2: PASS


Tests run: 2647, Failures: 1, Errors: 2, Skipped: 57, Flakes: 2

[INFO] ------------------------------------------------------------------------
[INFO] Reactor Summary:
[INFO] 
[INFO] Apache HBase ...................................... SUCCESS [1:45.641s]
[INFO] Apache HBase - Checkstyle ......................... SUCCESS [15.511s]
[INFO] Apache HBase - Resource Bundle .................... SUCCESS [0.185s]
[INFO] Apache HBase - Annotations ........................ SUCCESS [1.382s]
[INFO] Apache HBase - Protocol ........................... SUCCESS [18.218s]
[INFO] Apache HBase - Common ............................. SUCCESS [2:35.195s]
[INFO] Apache HBase - Procedure .......................... SUCCESS [3:34.664s]
[INFO] Apache HBase - Metrics API ........................ SUCCESS [1.103s]
[INFO] Apache HBase - Hadoop Compatibility ............... SUCCESS [11.124s]
[INFO] Apache HBase - Metrics Implementation ............. SUCCESS [5.367s]
[INFO] Apache HBase - Hadoop Two Compatibility ........... SUCCESS [18.933s]
[INFO] Apache HBase - Client ............................. SUCCESS [1:40.600s]
[INFO] Apache HBase - Prefix Tree ........................ SUCCESS [8.016s]
[INFO] Apache HBase - Server ............................. FAILURE [1:28:49.962s]
[INFO] Apache HBase - Testing Util ....................... SKIPPED
[INFO] Apache HBase - Thrift ............................. SKIPPED
[INFO] Apache HBase - Rest ............................... SKIPPED
[INFO] Apache HBase - Shell .............................. SKIPPED
[INFO] Apache HBase - Integration Tests .................. SKIPPED
[INFO] Apache HBase - Examples ........................... SKIPPED
[INFO] Apache HBase - External Block Cache ............... SKIPPED
[INFO] Apache HBase - Assembly ........................... SKIPPED
[INFO] Apache HBase - Shaded ............................. SKIPPED
[INFO] Apache HBase - Shaded - Client .................... SKIPPED
[INFO] Apache HBase - Shaded - Server .................... SKIPPED
[INFO] Apache HBase - Archetypes ......................... SKIPPED
[INFO] Apache HBase - Exemplar for hbase-client archetype  SKIPPED
[INFO] Apache HBase - Exemplar for hbase-shaded-client archetype  SKIPPED
[INFO] Apache HBase - Archetype builder .................. SKIPPED
[INFO] ------------------------------------------------------------------------
[INFO] BUILD FAILURE
[INFO] ------------------------------------------------------------------------
[INFO] Total time: 1:40:17.453s
[INFO] Finished at: Tue Aug 15 17:47:07 UTC 2017
[INFO] Final Memory: 569M/1322M
[INFO] ------------------------------------------------------------------------
[ERROR] Failed to execute goal org.apache.maven.plugins:maven-surefire-plugin:2.18.1:test
(secondPartTestsExecution) on project hbase-server: ExecutionException: java.lang.RuntimeException:
There was an error in the forked process
[ERROR] java.lang.ArrayIndexOutOfBoundsException: 1
[ERROR] at org.apache.maven.surefire.common.junit4.JUnit4ProviderUtil.generateFailingTests(JUnit4ProviderUtil.java:64)
[ERROR] at org.apache.maven.surefire.junitcore.JUnitCoreProvider.invoke(JUnitCoreProvider.java:151)
[ERROR] at org.apache.maven.surefire.booter.ForkedBooter.invokeProviderInSameClassLoader(ForkedBooter.java:203)
[ERROR] at org.apache.maven.surefire.booter.ForkedBooter.runSuitesInProcess(ForkedBooter.java:155)
[ERROR] at org.apache.maven.surefire.booter.ForkedBooter.main(ForkedBooter.java:103)
[ERROR] -> [Help 1]
[ERROR] 
[ERROR] To see the full stack trace of the errors, re-run Maven with the -e switch.
[ERROR] Re-run Maven using the -X switch to enable full debug logging.
[ERROR] 
[ERROR] For more information about the errors and possible solutions, please read the following
articles:
[ERROR] [Help 1] http://cwiki.apache.org/confluence/display/MAVEN/MojoFailureException
[ERROR] 
[ERROR] After correcting the problems, you can resume the build with the command
[ERROR]   mvn <goals> -rf :hbase-server
Build step 'Invoke top-level Maven targets' marked build as failure
Performing Post build task...
Match found for :.* : True
Logical operation result is TRUE
Running script  : # Post-build task script. TODO: Check this in and have all builds reference
check-in.
pwd && ls
# NOTE!!!! The below code has been copied and pasted from ./dev-tools/run-test.sh
# Do not change here without syncing there and vice-versa.
ZOMBIE_TESTS_COUNT=`jps -v | grep surefirebooter | grep -e '-Dhbase.test' | wc -l`
if [[ $ZOMBIE_TESTS_COUNT != 0 ]] ; then
 echo "Suspicious java process found - waiting 30s to see if there are just slow to stop"
 sleep 30
 ZOMBIE_TESTS_COUNT=`jps -v | grep surefirebooter | grep -e '-Dhbase.test' | wc -l`
 if [[ $ZOMBIE_TESTS_COUNT != 0 ]] ; then
   echo " {color:red}There appear to be $ZOMBIE_TESTS_COUNT zombie tests{color}, they should
have been killed by surefire but survived"
   jps -v | grep surefirebooter | grep -e '-Dhbase.test'
   jps -v | grep surefirebooter | grep -e '-Dhbase.test' | cut -d ' ' -f 1 | xargs -n 1 jstack
   # Exit with error
   exit 1
 else
   echo "We're ok: there is no zombie test, but some tests took some time to stop"
 fi
else
  echo "We're ok: there is no zombie test"
fi
Setting JDK_1_7_LATEST__HOME=/home/jenkins/tools/java/latest1.7
Setting JDK_1_8_LATEST__HOME=/home/jenkins/tools/java/latest1.8
[30b16b4c] $ /bin/bash -xe /tmp/jenkins1848184438469889149.sh
+ pwd
<https://builds.apache.org/job/HBase-1.5/jdk=JDK_1_8,label=Hadoop&&!H13/ws/>
+ ls
bin
CHANGES.txt
conf
dev-support
extra_env_var
hbase-annotations
hbase-archetypes
hbase-assembly
hbase-checkstyle
hbase-client
hbase-common
hbase-examples
hbase-external-blockcache
hbase-hadoop2-compat
hbase-hadoop-compat
hbase-it
hbase-metrics
hbase-metrics-api
hbase-native-client
hbase-prefix-tree
hbase-procedure
hbase-protocol
hbase-resource-bundle
hbase-rest
hbase-server
hbase-shaded
hbase-shell
hbase-testing-util
hbase-thrift
LICENSE.txt
NOTICE.txt
pom.xml
README.txt
src
target
++ jps -v
++ grep surefirebooter
++ grep -e -Dhbase.test
++ wc -l
+ ZOMBIE_TESTS_COUNT=2
+ [[ 2 != 0 ]]
+ echo 'Suspicious java process found - waiting 30s to see if there are just slow to stop'
Suspicious java process found - waiting 30s to see if there are just slow to stop
+ sleep 30
++ grep surefirebooter
++ jps -v
++ grep -e -Dhbase.test
++ wc -l
+ ZOMBIE_TESTS_COUNT=0
+ [[ 0 != 0 ]]
+ echo 'We'\''re ok: there is no zombie test, but some tests took some time to stop'
We're ok: there is no zombie test, but some tests took some time to stop
POST BUILD TASK : SUCCESS
END OF POST BUILD TASK : 0
Archiving artifacts
Setting JDK_1_7_LATEST__HOME=/home/jenkins/tools/java/latest1.7
Setting JDK_1_8_LATEST__HOME=/home/jenkins/tools/java/latest1.8
[Fast Archiver] No prior successful build to compare, so performing full copy of artifacts
Recording test results
Setting JDK_1_7_LATEST__HOME=/home/jenkins/tools/java/latest1.7
Setting JDK_1_8_LATEST__HOME=/home/jenkins/tools/java/latest1.8
Setting JDK_1_7_LATEST__HOME=/home/jenkins/tools/java/latest1.7
Setting JDK_1_8_LATEST__HOME=/home/jenkins/tools/java/latest1.8

Mime
View raw message