hbase-builds mailing list archives

Site index · List index
Message view « Date » · « Thread »
Top « Date » · « Thread »
From Apache Jenkins Server <jenk...@builds.apache.org>
Subject Build failed in Jenkins: HBase-1.4 » JDK_1_7,Hadoop&&!H13 #873
Date Mon, 21 Aug 2017 18:53:33 GMT
See <https://builds.apache.org/job/HBase-1.4/jdk=JDK_1_7,label=Hadoop&&!H13/873/display/redirect?page=changes>

Changes:

[apurtell] HBASE-18623 Frequent failed to parse at EOF warnings from WALEntryStream

------------------------------------------
[...truncated 2.33 MB...]
Tests run: 16, Failures: 0, Errors: 0, Skipped: 0, Time elapsed: 9.098 sec - in org.apache.hadoop.hbase.io.hfile.TestHFileBlockIndex
Running org.apache.hadoop.hbase.io.hfile.TestSeekBeforeWithInlineBlocks
Running org.apache.hadoop.hbase.io.hfile.TestHFileSeek
Tests run: 1, Failures: 0, Errors: 0, Skipped: 0, Time elapsed: 3.285 sec - in org.apache.hadoop.hbase.io.hfile.TestHFileSeek
Tests run: 72, Failures: 0, Errors: 0, Skipped: 0, Time elapsed: 172.802 sec - in org.apache.hadoop.hbase.io.hfile.TestCacheOnWrite
Tests run: 1, Failures: 0, Errors: 0, Skipped: 0, Time elapsed: 14.866 sec - in org.apache.hadoop.hbase.io.hfile.TestSeekBeforeWithInlineBlocks
Running org.apache.hadoop.hbase.io.hfile.TestCacheConfig
Running org.apache.hadoop.hbase.io.hfile.TestScannerSelectionUsingTTL
Tests run: 7, Failures: 0, Errors: 0, Skipped: 0, Time elapsed: 2.529 sec - in org.apache.hadoop.hbase.io.hfile.TestCacheConfig
Running org.apache.hadoop.hbase.io.encoding.TestDataBlockEncoders
Running org.apache.hadoop.hbase.io.encoding.TestEncodedSeekers
Tests run: 28, Failures: 0, Errors: 0, Skipped: 0, Time elapsed: 31.548 sec - in org.apache.hadoop.hbase.io.encoding.TestDataBlockEncoders
Running org.apache.hadoop.hbase.io.encoding.TestBufferedDataBlockEncoder
Tests run: 9, Failures: 0, Errors: 0, Skipped: 0, Time elapsed: 469.953 sec - in org.apache.hadoop.hbase.snapshot.TestExportSnapshot
Tests run: 1, Failures: 0, Errors: 0, Skipped: 0, Time elapsed: 15.494 sec - in org.apache.hadoop.hbase.io.encoding.TestBufferedDataBlockEncoder
Running org.apache.hadoop.hbase.io.encoding.TestLoadAndSwitchEncodeOnDisk
Running org.apache.hadoop.hbase.io.encoding.TestChangingEncoding
Tests run: 6, Failures: 0, Errors: 0, Skipped: 0, Time elapsed: 64.133 sec - in org.apache.hadoop.hbase.io.hfile.TestScannerSelectionUsingTTL
Running org.apache.hadoop.hbase.io.TestFileLink
Tests run: 6, Failures: 0, Errors: 0, Skipped: 0, Time elapsed: 20.369 sec - in org.apache.hadoop.hbase.io.TestFileLink
Tests run: 1, Failures: 0, Errors: 0, Skipped: 0, Time elapsed: 38.688 sec - in org.apache.hadoop.hbase.io.encoding.TestLoadAndSwitchEncodeOnDisk
Running org.apache.hadoop.hbase.wal.TestWALFactory
Running org.apache.hadoop.hbase.wal.TestWALOpenAfterDNRollingStart
Tests run: 24, Failures: 0, Errors: 0, Skipped: 0, Time elapsed: 103.796 sec - in org.apache.hadoop.hbase.io.encoding.TestEncodedSeekers
Running org.apache.hadoop.hbase.wal.TestWALFiltering
Tests run: 9, Failures: 0, Errors: 0, Skipped: 0, Time elapsed: 17.35 sec - in org.apache.hadoop.hbase.wal.TestWALFactory
Running org.apache.hadoop.hbase.wal.TestWALReaderOnSecureWAL
Tests run: 2, Failures: 0, Errors: 0, Skipped: 0, Time elapsed: 1.807 sec - in org.apache.hadoop.hbase.wal.TestWALReaderOnSecureWAL
Running org.apache.hadoop.hbase.wal.TestDefaultWALProvider
Tests run: 5, Failures: 0, Errors: 0, Skipped: 0, Time elapsed: 8.678 sec - in org.apache.hadoop.hbase.wal.TestDefaultWALProvider
Tests run: 1, Failures: 0, Errors: 0, Skipped: 0, Time elapsed: 32.604 sec - in org.apache.hadoop.hbase.wal.TestWALFiltering
Running org.apache.hadoop.hbase.wal.TestWALSplit
Running org.apache.hadoop.hbase.wal.TestBoundedRegionGroupingStrategy
Tests run: 1, Failures: 0, Errors: 0, Skipped: 0, Time elapsed: 45.879 sec - in org.apache.hadoop.hbase.wal.TestWALOpenAfterDNRollingStart
Running org.apache.hadoop.hbase.wal.TestSecureWAL
Tests run: 1, Failures: 0, Errors: 0, Skipped: 0, Time elapsed: 1.359 sec - in org.apache.hadoop.hbase.wal.TestSecureWAL
Running org.apache.hadoop.hbase.wal.TestDefaultWALProviderWithHLogKey
Tests run: 5, Failures: 0, Errors: 0, Skipped: 0, Time elapsed: 22.674 sec - in org.apache.hadoop.hbase.wal.TestBoundedRegionGroupingStrategy
Tests run: 5, Failures: 0, Errors: 0, Skipped: 0, Time elapsed: 9.722 sec - in org.apache.hadoop.hbase.wal.TestDefaultWALProviderWithHLogKey
Running org.apache.hadoop.hbase.wal.TestWALSplitCompressed
Running org.apache.hadoop.hbase.wal.TestWALRootDir
Tests run: 1, Failures: 0, Errors: 0, Skipped: 0, Time elapsed: 0.641 sec - in org.apache.hadoop.hbase.wal.TestWALRootDir
Running org.apache.hadoop.hbase.zookeeper.TestZooKeeperACL
Tests run: 7, Failures: 0, Errors: 0, Skipped: 0, Time elapsed: 0.341 sec - in org.apache.hadoop.hbase.zookeeper.TestZooKeeperACL
Running org.apache.hadoop.hbase.zookeeper.TestZKLeaderManager
Tests run: 1, Failures: 0, Errors: 0, Skipped: 0, Time elapsed: 0.269 sec - in org.apache.hadoop.hbase.zookeeper.TestZKLeaderManager
Running org.apache.hadoop.hbase.zookeeper.TestZooKeeperNodeTracker
Tests run: 3, Failures: 0, Errors: 0, Skipped: 0, Time elapsed: 1.256 sec - in org.apache.hadoop.hbase.zookeeper.TestZooKeeperNodeTracker
Running org.apache.hadoop.hbase.zookeeper.TestRecoverableZooKeeper
Tests run: 1, Failures: 0, Errors: 0, Skipped: 0, Time elapsed: 1.812 sec - in org.apache.hadoop.hbase.zookeeper.TestRecoverableZooKeeper
Running org.apache.hadoop.hbase.zookeeper.TestZKTableStateManager
Tests run: 1, Failures: 0, Errors: 0, Skipped: 0, Time elapsed: 1.142 sec - in org.apache.hadoop.hbase.zookeeper.TestZKTableStateManager
Running org.apache.hadoop.hbase.zookeeper.TestZKMulti
Tests run: 12, Failures: 0, Errors: 0, Skipped: 0, Time elapsed: 3.365 sec - in org.apache.hadoop.hbase.zookeeper.TestZKMulti
Running org.apache.hadoop.hbase.zookeeper.lock.TestZKInterProcessReadWriteLock
Tests run: 33, Failures: 0, Errors: 0, Skipped: 0, Time elapsed: 89.377 sec - in org.apache.hadoop.hbase.wal.TestWALSplit
Tests run: 6, Failures: 0, Errors: 0, Skipped: 0, Time elapsed: 25.187 sec - in org.apache.hadoop.hbase.zookeeper.lock.TestZKInterProcessReadWriteLock
Running org.apache.hadoop.hbase.zookeeper.TestHQuorumPeer
Tests run: 4, Failures: 0, Errors: 0, Skipped: 0, Time elapsed: 1.068 sec - in org.apache.hadoop.hbase.zookeeper.TestHQuorumPeer
Running org.apache.hadoop.hbase.TestIOFencing
Running org.apache.hadoop.hbase.constraint.TestConstraint
Running org.apache.hadoop.hbase.TestMovedRegionsCleaner
Tests run: 1, Failures: 0, Errors: 0, Skipped: 0, Time elapsed: 10.309 sec - in org.apache.hadoop.hbase.TestMovedRegionsCleaner
Tests run: 33, Failures: 0, Errors: 0, Skipped: 0, Time elapsed: 98.353 sec - in org.apache.hadoop.hbase.wal.TestWALSplitCompressed
Running org.apache.hadoop.hbase.backup.example.TestZooKeeperTableArchiveClient
Tests run: 5, Failures: 0, Errors: 0, Skipped: 0, Time elapsed: 35.895 sec - in org.apache.hadoop.hbase.constraint.TestConstraint
Running org.apache.hadoop.hbase.backup.TestHFileArchiving
Tests run: 3, Failures: 0, Errors: 0, Skipped: 0, Time elapsed: 4.689 sec - in org.apache.hadoop.hbase.backup.example.TestZooKeeperTableArchiveClient
Running org.apache.hadoop.hbase.tool.TestCanaryTool
Running org.apache.hadoop.hbase.TestHColumnDescriptorDefaultVersions
Tests run: 3, Failures: 0, Errors: 0, Skipped: 0, Time elapsed: 234.001 sec - in org.apache.hadoop.hbase.io.encoding.TestChangingEncoding
Running org.apache.hadoop.hbase.ipc.TestProtoBufRpc
Tests run: 1, Failures: 0, Errors: 0, Skipped: 0, Time elapsed: 2.674 sec - in org.apache.hadoop.hbase.ipc.TestProtoBufRpc
Running org.apache.hadoop.hbase.ipc.TestRpcClientLeaks
Tests run: 1, Failures: 0, Errors: 0, Skipped: 0, Time elapsed: 7.884 sec - in org.apache.hadoop.hbase.ipc.TestRpcClientLeaks
Running org.apache.hadoop.hbase.ipc.TestRpcServerSlowConnectionSetup
Tests run: 2, Failures: 0, Errors: 0, Skipped: 0, Time elapsed: 86.999 sec - in org.apache.hadoop.hbase.TestIOFencing
Running org.apache.hadoop.hbase.ipc.TestHBaseClient
Tests run: 1, Failures: 0, Errors: 0, Skipped: 0, Time elapsed: 0.447 sec - in org.apache.hadoop.hbase.ipc.TestHBaseClient
Tests run: 1, Failures: 0, Errors: 0, Skipped: 0, Time elapsed: 7.077 sec - in org.apache.hadoop.hbase.ipc.TestRpcServerSlowConnectionSetup
Tests run: 4, Failures: 0, Errors: 0, Skipped: 0, Time elapsed: 40.537 sec - in org.apache.hadoop.hbase.TestHColumnDescriptorDefaultVersions
Running org.apache.hadoop.hbase.TestNamespace
Tests run: 5, Failures: 0, Errors: 0, Skipped: 0, Time elapsed: 60.761 sec - in org.apache.hadoop.hbase.backup.TestHFileArchiving
Tests run: 7, Failures: 0, Errors: 0, Skipped: 0, Time elapsed: 96.323 sec - in org.apache.hadoop.hbase.tool.TestCanaryTool
Tests run: 8, Failures: 0, Errors: 0, Skipped: 0, Time elapsed: 61.252 sec - in org.apache.hadoop.hbase.TestNamespace

Results :

Failed tests: 
  TestVisibilityLabelsWithACL.setupBeforeClass:103 Waiting timed out after [10,000] msec
Tests in error: 
  TestCoprocessorEndpoint.setupBeforeClass:100 » SocketTimeout callTimeout=5000,...
Flaked tests: 
org.apache.hadoop.hbase.client.TestReplicasClient.testCancelOfMultiGet(org.apache.hadoop.hbase.client.TestReplicasClient)
  Run 1: TestReplicasClient.testCancelOfMultiGet:585 null
  Run 2: PASS


Tests run: 2836, Failures: 1, Errors: 1, Skipped: 57, Flakes: 1

[INFO] ------------------------------------------------------------------------
[INFO] Reactor Summary:
[INFO] 
[INFO] Apache HBase ...................................... SUCCESS [1:48.570s]
[INFO] Apache HBase - Checkstyle ......................... SUCCESS [15.890s]
[INFO] Apache HBase - Resource Bundle .................... SUCCESS [0.306s]
[INFO] Apache HBase - Annotations ........................ SUCCESS [1.323s]
[INFO] Apache HBase - Protocol ........................... SUCCESS [17.761s]
[INFO] Apache HBase - Common ............................. SUCCESS [2:44.615s]
[INFO] Apache HBase - Procedure .......................... SUCCESS [3:40.423s]
[INFO] Apache HBase - Metrics API ........................ SUCCESS [1.853s]
[INFO] Apache HBase - Hadoop Compatibility ............... SUCCESS [12.087s]
[INFO] Apache HBase - Metrics Implementation ............. SUCCESS [5.723s]
[INFO] Apache HBase - Hadoop Two Compatibility ........... SUCCESS [20.178s]
[INFO] Apache HBase - Client ............................. SUCCESS [1:59.898s]
[INFO] Apache HBase - Prefix Tree ........................ SUCCESS [10.460s]
[INFO] Apache HBase - Server ............................. FAILURE [2:06:18.740s]
[INFO] Apache HBase - Testing Util ....................... SKIPPED
[INFO] Apache HBase - Thrift ............................. SKIPPED
[INFO] Apache HBase - Rest ............................... SKIPPED
[INFO] Apache HBase - Shell .............................. SKIPPED
[INFO] Apache HBase - Integration Tests .................. SKIPPED
[INFO] Apache HBase - Examples ........................... SKIPPED
[INFO] Apache HBase - External Block Cache ............... SKIPPED
[INFO] Apache HBase - Assembly ........................... SKIPPED
[INFO] Apache HBase - Shaded ............................. SKIPPED
[INFO] Apache HBase - Shaded - Client .................... SKIPPED
[INFO] Apache HBase - Shaded - Server .................... SKIPPED
[INFO] Apache HBase - Archetypes ......................... SKIPPED
[INFO] Apache HBase - Exemplar for hbase-client archetype  SKIPPED
[INFO] Apache HBase - Exemplar for hbase-shaded-client archetype  SKIPPED
[INFO] Apache HBase - Archetype builder .................. SKIPPED
[INFO] ------------------------------------------------------------------------
[INFO] BUILD FAILURE
[INFO] ------------------------------------------------------------------------
[INFO] Total time: 2:18:31.504s
[INFO] Finished at: Mon Aug 21 18:48:49 UTC 2017
[INFO] Final Memory: 519M/873M
[INFO] ------------------------------------------------------------------------
[ERROR] Failed to execute goal org.apache.maven.plugins:maven-surefire-plugin:2.18.1:test
(secondPartTestsExecution) on project hbase-server: ExecutionException: java.lang.RuntimeException:
There was an error in the forked process
[ERROR] java.lang.ArrayIndexOutOfBoundsException: 1
[ERROR] at org.apache.maven.surefire.common.junit4.JUnit4ProviderUtil.generateFailingTests(JUnit4ProviderUtil.java:64)
[ERROR] at org.apache.maven.surefire.junitcore.JUnitCoreProvider.invoke(JUnitCoreProvider.java:151)
[ERROR] at org.apache.maven.surefire.booter.ForkedBooter.invokeProviderInSameClassLoader(ForkedBooter.java:203)
[ERROR] at org.apache.maven.surefire.booter.ForkedBooter.runSuitesInProcess(ForkedBooter.java:155)
[ERROR] at org.apache.maven.surefire.booter.ForkedBooter.main(ForkedBooter.java:103)
[ERROR] -> [Help 1]
[ERROR] 
[ERROR] To see the full stack trace of the errors, re-run Maven with the -e switch.
[ERROR] Re-run Maven using the -X switch to enable full debug logging.
[ERROR] 
[ERROR] For more information about the errors and possible solutions, please read the following
articles:
[ERROR] [Help 1] http://cwiki.apache.org/confluence/display/MAVEN/MojoFailureException
[ERROR] 
[ERROR] After correcting the problems, you can resume the build with the command
[ERROR]   mvn <goals> -rf :hbase-server
Build step 'Invoke top-level Maven targets' marked build as failure
Performing Post build task...
Match found for :.* : True
Logical operation result is TRUE
Running script  : # Post-build task script. TODO: Check this in and have all builds reference
check-in.
pwd && ls
# NOTE!!!! The below code has been copied and pasted from ./dev-tools/run-test.sh
# Do not change here without syncing there and vice-versa.
ZOMBIE_TESTS_COUNT=`jps -v | grep surefirebooter | grep -e '-Dhbase.test' | wc -l`
if [[ $ZOMBIE_TESTS_COUNT != 0 ]] ; then
 echo "Suspicious java process found - waiting 30s to see if there are just slow to stop"
 sleep 30
 ZOMBIE_TESTS_COUNT=`jps -v | grep surefirebooter | grep -e '-Dhbase.test' | wc -l`
 if [[ $ZOMBIE_TESTS_COUNT != 0 ]] ; then
   echo " {color:red}There appear to be $ZOMBIE_TESTS_COUNT zombie tests{color}, they should
have been killed by surefire but survived"
   jps -v | grep surefirebooter | grep -e '-Dhbase.test'
   jps -v | grep surefirebooter | grep -e '-Dhbase.test' | cut -d ' ' -f 1 | xargs -n 1 jstack
   # Exit with error
   exit 1
 else
   echo "We're ok: there is no zombie test, but some tests took some time to stop"
 fi
else
  echo "We're ok: there is no zombie test"
fi
Setting JDK_1_7_LATEST__HOME=/home/jenkins/tools/java/latest1.7
Setting JDK_1_8_LATEST__HOME=/home/jenkins/tools/java/latest1.8
[19ccb43d] $ /bin/bash -xe /tmp/jenkins5805338888614674263.sh
+ pwd
<https://builds.apache.org/job/HBase-1.4/jdk=JDK_1_7,label=Hadoop&&!H13/ws/>
+ ls
bin
CHANGES.txt
conf
dev-support
extra_env_var
hbase-annotations
hbase-archetypes
hbase-assembly
hbase-checkstyle
hbase-client
hbase-common
hbase-examples
hbase-external-blockcache
hbase-hadoop2-compat
hbase-hadoop-compat
hbase-it
hbase-metrics
hbase-metrics-api
hbase-native-client
hbase-prefix-tree
hbase-procedure
hbase-protocol
hbase-resource-bundle
hbase-rest
hbase-server
hbase-shaded
hbase-shell
hbase-testing-util
hbase-thrift
LICENSE.txt
NOTICE.txt
pom.xml
README.txt
src
target
++ jps -v
++ grep surefirebooter
++ grep -e -Dhbase.test
++ wc -l
+ ZOMBIE_TESTS_COUNT=1
+ [[ 1 != 0 ]]
+ echo 'Suspicious java process found - waiting 30s to see if there are just slow to stop'
Suspicious java process found - waiting 30s to see if there are just slow to stop
+ sleep 30
++ jps -v
++ grep surefirebooter
++ wc -l
++ grep -e -Dhbase.test
+ ZOMBIE_TESTS_COUNT=0
+ [[ 0 != 0 ]]
+ echo 'We'\''re ok: there is no zombie test, but some tests took some time to stop'
We're ok: there is no zombie test, but some tests took some time to stop
POST BUILD TASK : SUCCESS
END OF POST BUILD TASK : 0
Archiving artifacts
Setting JDK_1_7_LATEST__HOME=/home/jenkins/tools/java/latest1.7
Setting JDK_1_8_LATEST__HOME=/home/jenkins/tools/java/latest1.8
Recording test results
Setting JDK_1_7_LATEST__HOME=/home/jenkins/tools/java/latest1.7
Setting JDK_1_8_LATEST__HOME=/home/jenkins/tools/java/latest1.8
Setting JDK_1_7_LATEST__HOME=/home/jenkins/tools/java/latest1.7
Setting JDK_1_8_LATEST__HOME=/home/jenkins/tools/java/latest1.8

Mime
View raw message