hbase-builds mailing list archives

Site index · List index
Message view « Date » · « Thread »
Top « Date » · « Thread »
From Apache Jenkins Server <jenk...@builds.apache.org>
Subject Build failed in Jenkins: HBase-1.5 » JDK_1_8,Hadoop&&!H13 #42
Date Thu, 31 Aug 2017 17:57:39 GMT
See <https://builds.apache.org/job/HBase-1.5/jdk=JDK_1_8,label=Hadoop&&!H13/42/display/redirect?page=changes>

Changes:

[tedyu] HBASE-18461 Build broken If the username contains a backslash

------------------------------------------
[...truncated 2.46 MB...]
Tests run: 5, Failures: 0, Errors: 0, Skipped: 0, Time elapsed: 39.339 sec - in org.apache.hadoop.hbase.master.procedure.TestModifyColumnFamilyProcedure
Running org.apache.hadoop.hbase.master.TestActiveMasterManager
Tests run: 2, Failures: 0, Errors: 0, Skipped: 0, Time elapsed: 2.007 sec - in org.apache.hadoop.hbase.master.TestActiveMasterManager
Running org.apache.hadoop.hbase.master.TestMasterFileSystemWithWALDir
Tests run: 1, Failures: 0, Errors: 0, Skipped: 0, Time elapsed: 2.023 sec - in org.apache.hadoop.hbase.master.TestMasterFileSystemWithWALDir
Running org.apache.hadoop.hbase.master.TestGetLastFlushedSequenceId
Running org.apache.hadoop.hbase.master.TestSplitLogManager
Tests run: 4, Failures: 0, Errors: 0, Skipped: 0, Time elapsed: 31.185 sec - in org.apache.hadoop.hbase.master.TestMaster
Tests run: 8, Failures: 0, Errors: 2, Skipped: 0, Time elapsed: 751.523 sec <<< FAILURE!
- in org.apache.hadoop.hbase.mapred.TestTableSnapshotInputFormat
testRestoreSnapshotDoesNotCreateBackRefLinks(org.apache.hadoop.hbase.mapred.TestTableSnapshotInputFormat)
 Time elapsed: 600.036 sec  <<< ERROR!
org.junit.runners.model.TestTimedOutException: test timed out after 10 minutes
	at java.lang.Object.wait(Native Method)
	at org.apache.hadoop.hbase.client.RpcRetryingCaller.callWithRetries(RpcRetryingCaller.java:186)
	at org.apache.hadoop.hbase.client.HBaseAdmin.executeCallable(HBaseAdmin.java:4444)
	at org.apache.hadoop.hbase.client.HBaseAdmin.executeCallable(HBaseAdmin.java:4436)
	at org.apache.hadoop.hbase.client.HBaseAdmin.deleteSnapshot(HBaseAdmin.java:4316)
	at org.apache.hadoop.hbase.mapreduce.TableSnapshotInputFormatTestBase.testRestoreSnapshotDoesNotCreateBackRefLinks(TableSnapshotInputFormatTestBase.java:153)
	at sun.reflect.NativeMethodAccessorImpl.invoke0(Native Method)
	at sun.reflect.NativeMethodAccessorImpl.invoke(NativeMethodAccessorImpl.java:62)
	at sun.reflect.DelegatingMethodAccessorImpl.invoke(DelegatingMethodAccessorImpl.java:43)
	at java.lang.reflect.Method.invoke(Method.java:498)
	at org.junit.runners.model.FrameworkMethod$1.runReflectiveCall(FrameworkMethod.java:50)
	at org.junit.internal.runners.model.ReflectiveCallable.run(ReflectiveCallable.java:12)
	at org.junit.runners.model.FrameworkMethod.invokeExplosively(FrameworkMethod.java:47)
	at org.junit.internal.runners.statements.InvokeMethod.evaluate(InvokeMethod.java:17)
	at org.junit.internal.runners.statements.FailOnTimeout$CallableStatement.call(FailOnTimeout.java:298)
	at org.junit.internal.runners.statements.FailOnTimeout$CallableStatement.call(FailOnTimeout.java:292)
	at java.util.concurrent.FutureTask.run(FutureTask.java:266)
	at java.lang.Thread.run(Thread.java:748)

testRestoreSnapshotDoesNotCreateBackRefLinks(org.apache.hadoop.hbase.mapred.TestTableSnapshotInputFormat)
 Time elapsed: 600.038 sec  <<< ERROR!
java.lang.Exception: Appears to be stuck in thread NIOServerCxn.Factory:0.0.0.0/0.0.0.0:60385
	at sun.nio.ch.EPollArrayWrapper.epollWait(Native Method)
	at sun.nio.ch.EPollArrayWrapper.poll(EPollArrayWrapper.java:269)
	at sun.nio.ch.EPollSelectorImpl.doSelect(EPollSelectorImpl.java:93)
	at sun.nio.ch.SelectorImpl.lockAndDoSelect(SelectorImpl.java:86)
	at sun.nio.ch.SelectorImpl.select(SelectorImpl.java:97)
	at org.apache.zookeeper.server.NIOServerCnxnFactory.run(NIOServerCnxnFactory.java:178)
	at java.lang.Thread.run(Thread.java:748)

Tests run: 1, Failures: 0, Errors: 0, Skipped: 0, Time elapsed: 766.549 sec - in org.apache.hadoop.hbase.mapred.TestTableSnapshotInputFormat
Running org.apache.hadoop.hbase.master.TestMetaShutdownHandler
Running org.apache.hadoop.hbase.master.cleaner.TestLogsCleaner
Tests run: 1, Failures: 0, Errors: 0, Skipped: 0, Time elapsed: 30.066 sec - in org.apache.hadoop.hbase.master.TestGetLastFlushedSequenceId
Tests run: 3, Failures: 0, Errors: 0, Skipped: 0, Time elapsed: 12.61 sec - in org.apache.hadoop.hbase.master.cleaner.TestLogsCleaner
Running org.apache.hadoop.hbase.master.cleaner.TestReplicationZKNodeCleaner
Running org.apache.hadoop.hbase.master.cleaner.TestHFileCleaner
Tests run: 3, Failures: 0, Errors: 0, Skipped: 0, Time elapsed: 1.832 sec - in org.apache.hadoop.hbase.master.cleaner.TestHFileCleaner
Tests run: 1, Failures: 0, Errors: 0, Skipped: 0, Time elapsed: 31.781 sec - in org.apache.hadoop.hbase.master.TestMetaShutdownHandler
Running org.apache.hadoop.hbase.master.handler.TestEnableTableHandler
Tests run: 2, Failures: 0, Errors: 0, Skipped: 0, Time elapsed: 22.911 sec - in org.apache.hadoop.hbase.master.cleaner.TestReplicationZKNodeCleaner
Running org.apache.hadoop.hbase.master.handler.TestCreateTableHandler
Running org.apache.hadoop.hbase.master.cleaner.TestSnapshotFromMaster
Tests run: 4, Failures: 0, Errors: 0, Skipped: 0, Time elapsed: 129.988 sec - in org.apache.hadoop.hbase.master.TestTableLockManager
Running org.apache.hadoop.hbase.master.balancer.TestBaseLoadBalancer
Tests run: 7, Failures: 0, Errors: 0, Skipped: 0, Time elapsed: 0.853 sec - in org.apache.hadoop.hbase.master.balancer.TestBaseLoadBalancer
Running org.apache.hadoop.hbase.master.balancer.TestStochasticLoadBalancer
Tests run: 3, Failures: 0, Errors: 0, Skipped: 0, Time elapsed: 54.868 sec - in org.apache.hadoop.hbase.master.handler.TestCreateTableHandler
Running org.apache.hadoop.hbase.master.balancer.TestStochasticLoadBalancer2
Tests run: 4, Failures: 0, Errors: 0, Skipped: 0, Time elapsed: 60.883 sec - in org.apache.hadoop.hbase.master.cleaner.TestSnapshotFromMaster
Running org.apache.hadoop.hbase.master.balancer.TestDefaultLoadBalancer
Tests run: 1, Failures: 0, Errors: 0, Skipped: 0, Time elapsed: 4.619 sec - in org.apache.hadoop.hbase.master.balancer.TestDefaultLoadBalancer
Running org.apache.hadoop.hbase.master.TestRestartCluster
Tests run: 15, Failures: 0, Errors: 0, Skipped: 1, Time elapsed: 150.565 sec - in org.apache.hadoop.hbase.master.TestSplitLogManager
Tests run: 3, Failures: 0, Errors: 0, Skipped: 0, Time elapsed: 107.722 sec - in org.apache.hadoop.hbase.master.handler.TestEnableTableHandler
Running org.apache.hadoop.hbase.master.TestMasterOperationsForRegionReplicas
Running org.apache.hadoop.hbase.master.snapshot.TestSnapshotFileCache

Results :

Failed tests: 
org.apache.hadoop.hbase.replication.TestMasterReplication.testCyclicReplication2(org.apache.hadoop.hbase.replication.TestMasterReplication)
  Run 1: TestMasterReplication.testCyclicReplication2:316->wait:703 Waited too much time
for replication. Row:row4. IsDeleteReplication:true
  Run 2: TestMasterReplication.testCyclicReplication2:316->wait:703 Waited too much time
for replication. Row:row4. IsDeleteReplication:true

Tests in error: 
  TestAdmin2.testCreateTableRPCTimeOut:209 » TimeoutIO java.util.concurrent.Time...
org.apache.hadoop.hbase.master.TestAssignmentListener.testAssignmentListener(org.apache.hadoop.hbase.master.TestAssignmentListener)
  Run 1: TestAssignmentListener.testAssignmentListener:228 » TestTimedOut test timed ou...
  Run 2: TestAssignmentListener.testAssignmentListener:228 » TestTimedOut test timed ou...
  Run 3: TestAssignmentListener.testAssignmentListener:228 » TestTimedOut test timed ou...

  TestMasterBalanceThrottling.testThrottlingByBalanceInterval:81 » TestTimedOut ...
  TestMasterBalanceThrottling.testThrottlingByMaxRitPercent:105 » TestTimedOut t...
Flaked tests: 
org.apache.hadoop.hbase.client.TestAdmin1.testMergeRegions(org.apache.hadoop.hbase.client.TestAdmin1)
  Run 1: TestAdmin1.testMergeRegions:1417 expected:<2> but was:<3>
  Run 2: PASS

org.apache.hadoop.hbase.client.TestClientScannerRPCTimeout.testScannerNextRPCTimesout(org.apache.hadoop.hbase.client.TestClientScannerRPCTimeout)
  Run 1: TestClientScannerRPCTimeout.testScannerNextRPCTimesout:87 » TableExists testSc...
  Run 2: PASS

org.apache.hadoop.hbase.mapred.TestTableSnapshotInputFormat.testRestoreSnapshotDoesNotCreateBackRefLinks(org.apache.hadoop.hbase.mapred.TestTableSnapshotInputFormat)
  Run 1: TestTableSnapshotInputFormat>TableSnapshotInputFormatTestBase.testRestoreSnapshotDoesNotCreateBackRefLinks:153->Object.wait:-2
» TestTimedOut
  Run 2: TestTableSnapshotInputFormat.testRestoreSnapshotDoesNotCreateBackRefLinks »  A...
  Run 3: PASS

org.apache.hadoop.hbase.master.normalizer.TestSimpleRegionNormalizerOnCluster.testRegionNormalizationMergeOnCluster(org.apache.hadoop.hbase.master.normalizer.TestSimpleRegionNormalizerOnCluster)
  Run 1: TestSimpleRegionNormalizerOnCluster.testRegionNormalizationMergeOnCluster:189 »
RetriesExhausted
  Run 2: PASS


Tests run: 1941, Failures: 1, Errors: 4, Skipped: 17, Flakes: 4

[INFO] ------------------------------------------------------------------------
[INFO] Reactor Summary:
[INFO] 
[INFO] Apache HBase ...................................... SUCCESS [1:54.202s]
[INFO] Apache HBase - Checkstyle ......................... SUCCESS [17.156s]
[INFO] Apache HBase - Resource Bundle .................... SUCCESS [0.475s]
[INFO] Apache HBase - Annotations ........................ SUCCESS [1.840s]
[INFO] Apache HBase - Protocol ........................... SUCCESS [25.188s]
[INFO] Apache HBase - Common ............................. SUCCESS [3:18.113s]
[INFO] Apache HBase - Procedure .......................... SUCCESS [4:15.113s]
[INFO] Apache HBase - Metrics API ........................ SUCCESS [3.052s]
[INFO] Apache HBase - Hadoop Compatibility ............... SUCCESS [14.694s]
[INFO] Apache HBase - Metrics Implementation ............. SUCCESS [8.932s]
[INFO] Apache HBase - Hadoop Two Compatibility ........... SUCCESS [27.469s]
[INFO] Apache HBase - Client ............................. SUCCESS [2:07.552s]
[INFO] Apache HBase - Prefix Tree ........................ SUCCESS [12.799s]
[INFO] Apache HBase - Server ............................. FAILURE [1:53:58.773s]
[INFO] Apache HBase - Testing Util ....................... SKIPPED
[INFO] Apache HBase - Thrift ............................. SKIPPED
[INFO] Apache HBase - Rest ............................... SKIPPED
[INFO] Apache HBase - Shell .............................. SKIPPED
[INFO] Apache HBase - Integration Tests .................. SKIPPED
[INFO] Apache HBase - Examples ........................... SKIPPED
[INFO] Apache HBase - External Block Cache ............... SKIPPED
[INFO] Apache HBase - Assembly ........................... SKIPPED
[INFO] Apache HBase - Shaded ............................. SKIPPED
[INFO] Apache HBase - Shaded - Client .................... SKIPPED
[INFO] Apache HBase - Shaded - Server .................... SKIPPED
[INFO] Apache HBase Shaded Packaging Invariants .......... SKIPPED
[INFO] Apache HBase - Archetypes ......................... SKIPPED
[INFO] Apache HBase - Exemplar for hbase-client archetype  SKIPPED
[INFO] Apache HBase - Exemplar for hbase-shaded-client archetype  SKIPPED
[INFO] Apache HBase - Archetype builder .................. SKIPPED
[INFO] ------------------------------------------------------------------------
[INFO] BUILD FAILURE
[INFO] ------------------------------------------------------------------------
[INFO] Total time: 2:08:01.047s
[INFO] Finished at: Thu Aug 31 17:56:07 UTC 2017
[INFO] Final Memory: 415M/575M
[INFO] ------------------------------------------------------------------------
[ERROR] Failed to execute goal org.apache.maven.plugins:maven-surefire-plugin:2.18.1:test
(secondPartTestsExecution) on project hbase-server: ExecutionException: java.lang.RuntimeException:
java.lang.RuntimeException: org.apache.maven.surefire.report.ReporterException: When writing
xml report stdout/stderr: /tmp/stderr3153875609443310948deferred (No such file or directory)
-> [Help 1]
[ERROR] 
[ERROR] To see the full stack trace of the errors, re-run Maven with the -e switch.
[ERROR] Re-run Maven using the -X switch to enable full debug logging.
[ERROR] 
[ERROR] For more information about the errors and possible solutions, please read the following
articles:
[ERROR] [Help 1] http://cwiki.apache.org/confluence/display/MAVEN/MojoFailureException
[ERROR] 
[ERROR] After correcting the problems, you can resume the build with the command
[ERROR]   mvn <goals> -rf :hbase-server
Build step 'Invoke top-level Maven targets' marked build as failure
Performing Post build task...
Match found for :.* : True
Logical operation result is TRUE
Running script  : # Post-build task script. TODO: Check this in and have all builds reference
check-in.
pwd && ls
# NOTE!!!! The below code has been copied and pasted from ./dev-tools/run-test.sh
# Do not change here without syncing there and vice-versa.
ZOMBIE_TESTS_COUNT=`jps -v | grep surefirebooter | grep -e '-Dhbase.test' | wc -l`
if [[ $ZOMBIE_TESTS_COUNT != 0 ]] ; then
 echo "Suspicious java process found - waiting 30s to see if there are just slow to stop"
 sleep 30
 ZOMBIE_TESTS_COUNT=`jps -v | grep surefirebooter | grep -e '-Dhbase.test' | wc -l`
 if [[ $ZOMBIE_TESTS_COUNT != 0 ]] ; then
   echo " {color:red}There appear to be $ZOMBIE_TESTS_COUNT zombie tests{color}, they should
have been killed by surefire but survived"
   jps -v | grep surefirebooter | grep -e '-Dhbase.test'
   jps -v | grep surefirebooter | grep -e '-Dhbase.test' | cut -d ' ' -f 1 | xargs -n 1 jstack
   # Exit with error
   exit 1
 else
   echo "We're ok: there is no zombie test, but some tests took some time to stop"
 fi
else
  echo "We're ok: there is no zombie test"
fi
Setting JDK_1_7_LATEST__HOME=/home/jenkins/tools/java/latest1.7
Setting JDK_1_8_LATEST__HOME=/home/jenkins/tools/java/latest1.8
[30b16b4c] $ /bin/bash -xe /tmp/jenkins138245078641720743.sh
+ pwd
<https://builds.apache.org/job/HBase-1.5/jdk=JDK_1_8,label=Hadoop&&!H13/ws/>
+ ls
bin
CHANGES.txt
conf
dev-support
extra_env_var
hbase-annotations
hbase-archetypes
hbase-assembly
hbase-checkstyle
hbase-client
hbase-common
hbase-examples
hbase-external-blockcache
hbase-hadoop2-compat
hbase-hadoop-compat
hbase-it
hbase-metrics
hbase-metrics-api
hbase-native-client
hbase-prefix-tree
hbase-procedure
hbase-protocol
hbase-resource-bundle
hbase-rest
hbase-server
hbase-shaded
hbase-shell
hbase-testing-util
hbase-thrift
LICENSE.txt
NOTICE.txt
pom.xml
README.txt
src
target
++ jps -v
++ grep surefirebooter
++ grep -e -Dhbase.test
++ wc -l
+ ZOMBIE_TESTS_COUNT=1
+ [[ 1 != 0 ]]
+ echo 'Suspicious java process found - waiting 30s to see if there are just slow to stop'
Suspicious java process found - waiting 30s to see if there are just slow to stop
+ sleep 30
++ wc -l
++ grep -e -Dhbase.test
++ grep surefirebooter
++ jps -v
+ ZOMBIE_TESTS_COUNT=0
+ [[ 0 != 0 ]]
+ echo 'We'\''re ok: there is no zombie test, but some tests took some time to stop'
We're ok: there is no zombie test, but some tests took some time to stop
POST BUILD TASK : SUCCESS
END OF POST BUILD TASK : 0
Archiving artifacts
Setting JDK_1_7_LATEST__HOME=/home/jenkins/tools/java/latest1.7
Setting JDK_1_8_LATEST__HOME=/home/jenkins/tools/java/latest1.8
[Fast Archiver] No prior successful build to compare, so performing full copy of artifacts
Recording test results
Setting JDK_1_7_LATEST__HOME=/home/jenkins/tools/java/latest1.7
Setting JDK_1_8_LATEST__HOME=/home/jenkins/tools/java/latest1.8
Setting JDK_1_7_LATEST__HOME=/home/jenkins/tools/java/latest1.7
Setting JDK_1_8_LATEST__HOME=/home/jenkins/tools/java/latest1.8

Mime
View raw message