hbase-builds mailing list archives

Site index · List index
Message view « Date » · « Thread »
Top « Date » · « Thread »
From Apache Jenkins Server <jenk...@builds.apache.org>
Subject Build failed in Jenkins: HBase-1.4 » JDK_1_7,Hadoop&&!H13 #870
Date Fri, 18 Aug 2017 21:50:24 GMT
See <https://builds.apache.org/job/HBase-1.4/jdk=JDK_1_7,label=Hadoop&&!H13/870/display/redirect?page=changes>

Changes:

[chia7712] HBASE-18572 Delete can't remove the cells which have no visibility label

[chia7712] HBASE-18471 The DeleteFamily cell is skipped when StoreScanner seeks to

------------------------------------------
[...truncated 2.33 MB...]
Running org.apache.hadoop.hbase.coprocessor.TestWALObserver
Tests run: 7, Failures: 0, Errors: 0, Skipped: 0, Time elapsed: 12.436 sec - in org.apache.hadoop.hbase.replication.TestReplicationEndpoint
Tests run: 7, Failures: 0, Errors: 0, Skipped: 0, Time elapsed: 9.764 sec - in org.apache.hadoop.hbase.coprocessor.TestWALObserver
Running org.apache.hadoop.hbase.coprocessor.TestRegionObserverInterface
Running org.apache.hadoop.hbase.coprocessor.TestBatchCoprocessorEndpoint
Tests run: 4, Failures: 0, Errors: 0, Skipped: 0, Time elapsed: 2.117 sec - in org.apache.hadoop.hbase.coprocessor.TestBatchCoprocessorEndpoint
Running org.apache.hadoop.hbase.coprocessor.TestRegionServerObserver
Tests run: 1, Failures: 0, Errors: 0, Skipped: 0, Time elapsed: 39.037 sec - in org.apache.hadoop.hbase.replication.TestReplicationSyncUpToolWithBulkLoadedData
Running org.apache.hadoop.hbase.coprocessor.TestRegionObserverForAddingMutationsFromCoprocessors
Tests run: 1, Failures: 0, Errors: 0, Skipped: 0, Time elapsed: 19.159 sec - in org.apache.hadoop.hbase.coprocessor.TestRegionServerObserver
Tests run: 5, Failures: 0, Errors: 0, Skipped: 0, Time elapsed: 12.233 sec - in org.apache.hadoop.hbase.coprocessor.TestRegionObserverForAddingMutationsFromCoprocessors
Running org.apache.hadoop.hbase.coprocessor.TestDoubleColumnInterpreter
Running org.apache.hadoop.hbase.coprocessor.TestHTableWrapper
Tests run: 38, Failures: 0, Errors: 0, Skipped: 0, Time elapsed: 4.736 sec - in org.apache.hadoop.hbase.coprocessor.TestDoubleColumnInterpreter
Tests run: 1, Failures: 0, Errors: 0, Skipped: 0, Time elapsed: 8.641 sec - in org.apache.hadoop.hbase.coprocessor.TestHTableWrapper
Tests run: 8, Failures: 0, Errors: 0, Skipped: 0, Time elapsed: 201.119 sec - in org.apache.hadoop.hbase.replication.TestMasterReplication
Running org.apache.hadoop.hbase.coprocessor.TestRegionObserverScannerOpenHook
Running org.apache.hadoop.hbase.coprocessor.TestNegativeMemstoreSizeWithSlowCoprocessor
Tests run: 1, Failures: 0, Errors: 0, Skipped: 0, Time elapsed: 1.436 sec - in org.apache.hadoop.hbase.coprocessor.TestNegativeMemstoreSizeWithSlowCoprocessor
Running org.apache.hadoop.hbase.coprocessor.TestAggregateProtocol
Tests run: 14, Failures: 0, Errors: 0, Skipped: 2, Time elapsed: 77.735 sec - in org.apache.hadoop.hbase.coprocessor.TestRegionObserverInterface
Running org.apache.hadoop.hbase.coprocessor.TestCoprocessorStop
Tests run: 1, Failures: 0, Errors: 0, Skipped: 0, Time elapsed: 0.957 sec - in org.apache.hadoop.hbase.coprocessor.TestCoprocessorStop
Tests run: 3, Failures: 0, Errors: 0, Skipped: 0, Time elapsed: 14.644 sec - in org.apache.hadoop.hbase.coprocessor.TestRegionObserverScannerOpenHook
Tests run: 44, Failures: 0, Errors: 0, Skipped: 0, Time elapsed: 4.967 sec - in org.apache.hadoop.hbase.coprocessor.TestAggregateProtocol
Tests run: 3, Failures: 0, Errors: 0, Skipped: 0, Time elapsed: 181.838 sec - in org.apache.hadoop.hbase.replication.TestSerialReplication
Running org.apache.hadoop.hbase.coprocessor.TestRegionServerCoprocessorExceptionWithAbort
Running org.apache.hadoop.hbase.coprocessor.TestMasterCoprocessorExceptionWithAbort
Running org.apache.hadoop.hbase.coprocessor.TestMasterObserver
Running org.apache.hadoop.hbase.coprocessor.TestOpenTableInCoprocessor
Running org.apache.hadoop.hbase.coprocessor.TestRegionServerCoprocessorEndpoint
Tests run: 2, Failures: 0, Errors: 0, Skipped: 0, Time elapsed: 1.094 sec - in org.apache.hadoop.hbase.coprocessor.TestRegionServerCoprocessorEndpoint
Tests run: 1, Failures: 0, Errors: 0, Skipped: 0, Time elapsed: 5.022 sec - in org.apache.hadoop.hbase.coprocessor.TestMasterCoprocessorExceptionWithAbort
Running org.apache.hadoop.hbase.coprocessor.TestCoprocessorTableEndpoint
Tests run: 2, Failures: 0, Errors: 0, Skipped: 0, Time elapsed: 19.469 sec - in org.apache.hadoop.hbase.coprocessor.TestRegionServerCoprocessorExceptionWithAbort
Running org.apache.hadoop.hbase.coprocessor.TestCoprocessorEndpoint
Tests run: 2, Failures: 0, Errors: 0, Skipped: 0, Time elapsed: 18.5 sec - in org.apache.hadoop.hbase.coprocessor.TestOpenTableInCoprocessor
Tests run: 6, Failures: 0, Errors: 0, Skipped: 0, Time elapsed: 2.011 sec - in org.apache.hadoop.hbase.coprocessor.TestCoprocessorEndpoint
Running org.apache.hadoop.hbase.coprocessor.TestCoprocessorMetrics
Tests run: 2, Failures: 0, Errors: 0, Skipped: 0, Time elapsed: 12.376 sec - in org.apache.hadoop.hbase.coprocessor.TestCoprocessorTableEndpoint
Running org.apache.hadoop.hbase.coprocessor.TestIncrementTimeRange
Running org.apache.hadoop.hbase.coprocessor.TestClassLoading
Running org.apache.hadoop.hbase.coprocessor.TestBigDecimalColumnInterpreter
Tests run: 1, Failures: 0, Errors: 0, Skipped: 0, Time elapsed: 7.938 sec - in org.apache.hadoop.hbase.coprocessor.TestIncrementTimeRange
Tests run: 38, Failures: 0, Errors: 0, Skipped: 0, Time elapsed: 5.905 sec - in org.apache.hadoop.hbase.coprocessor.TestBigDecimalColumnInterpreter
Tests run: 9, Failures: 0, Errors: 0, Skipped: 0, Time elapsed: 45.288 sec - in org.apache.hadoop.hbase.coprocessor.TestMasterObserver
Running org.apache.hadoop.hbase.coprocessor.TestRegionObserverBypass
Running org.apache.hadoop.hbase.coprocessor.TestRowProcessorEndpoint
Running org.apache.hadoop.hbase.coprocessor.TestRegionServerCoprocessorExceptionWithRemove
Tests run: 9, Failures: 0, Errors: 0, Skipped: 0, Time elapsed: 35.978 sec - in org.apache.hadoop.hbase.coprocessor.TestCoprocessorMetrics
Running org.apache.hadoop.hbase.TestStochasticBalancerJmxMetrics
Tests run: 1, Failures: 0, Errors: 0, Skipped: 1, Time elapsed: 0.001 sec - in org.apache.hadoop.hbase.TestStochasticBalancerJmxMetrics
Tests run: 2, Failures: 0, Errors: 0, Skipped: 0, Time elapsed: 9.707 sec - in org.apache.hadoop.hbase.coprocessor.TestRegionObserverBypass
Running org.apache.hadoop.hbase.TestMetaTableLocator
Tests run: 7, Failures: 0, Errors: 0, Skipped: 0, Time elapsed: 4.318 sec - in org.apache.hadoop.hbase.TestMetaTableLocator
Tests run: 9, Failures: 0, Errors: 0, Skipped: 0, Time elapsed: 31.633 sec - in org.apache.hadoop.hbase.coprocessor.TestClassLoading
Running org.apache.hadoop.hbase.TestHBaseTestingUtility
Running org.apache.hadoop.hbase.TestJMXListener
Tests run: 3, Failures: 0, Errors: 0, Skipped: 0, Time elapsed: 1.067 sec - in org.apache.hadoop.hbase.TestJMXListener
Tests run: 4, Failures: 0, Errors: 0, Skipped: 0, Time elapsed: 21.406 sec - in org.apache.hadoop.hbase.coprocessor.TestRowProcessorEndpoint
Tests run: 1, Failures: 0, Errors: 0, Skipped: 0, Time elapsed: 18.066 sec - in org.apache.hadoop.hbase.coprocessor.TestRegionServerCoprocessorExceptionWithRemove
Running org.apache.hadoop.hbase.namespace.TestNamespaceAuditor
Tests run: 12, Failures: 0, Errors: 0, Skipped: 0, Time elapsed: 106.775 sec - in org.apache.hadoop.hbase.TestHBaseTestingUtility
Tests run: 12, Failures: 0, Errors: 0, Skipped: 1, Time elapsed: 107.437 sec - in org.apache.hadoop.hbase.namespace.TestNamespaceAuditor

Results :

Tests in error: 
org.apache.hadoop.hbase.client.TestClientScannerRPCTimeout.testScannerNextRPCTimesout(org.apache.hadoop.hbase.client.TestClientScannerRPCTimeout)
  Run 1: TestClientScannerRPCTimeout.testScannerNextRPCTimesout:87 » TableExists testSc...
  Run 2: TestClientScannerRPCTimeout.testScannerNextRPCTimesout:87 » TableExists testSc...
  Run 3: TestClientScannerRPCTimeout.testScannerNextRPCTimesout:87 » TableExists testSc...

org.apache.hadoop.hbase.regionserver.TestRSKilledWhenInitializing.testRSTerminationAfterRegisteringToMasterBeforeCreatingEphemeralNode(org.apache.hadoop.hbase.regionserver.TestRSKilledWhenInitializing)
  Run 1: TestRSKilledWhenInitializing.testRSTerminationAfterRegisteringToMasterBeforeCreatingEphemeralNode:142
null
  Run 2: TestRSKilledWhenInitializing.testRSTerminationAfterRegisteringToMasterBeforeCreatingEphemeralNode:115
» TestTimedOut
  Run 3: TestRSKilledWhenInitializing.testRSTerminationAfterRegisteringToMasterBeforeCreatingEphemeralNode
» 
  Run 4: TestRSKilledWhenInitializing.testRSTerminationAfterRegisteringToMasterBeforeCreatingEphemeralNode:115
» TestTimedOut
  Run 5: TestRSKilledWhenInitializing.testRSTerminationAfterRegisteringToMasterBeforeCreatingEphemeralNode
» 

Flaked tests: 
org.apache.hadoop.hbase.mapred.TestTableSnapshotInputFormat.testWithMapReduceMultiRegion(org.apache.hadoop.hbase.mapred.TestTableSnapshotInputFormat)
  Run 1: TestTableSnapshotInputFormat.testWithMapReduceMultiRegion:140->TableSnapshotInputFormatTestBase.testWithMapReduce:168->testWithMapReduceImpl:224->doTestWithMapReduce:234->TableSnapshotInputFormatTestBase.createTableAndSnapshot:206
» RetriesExhausted
  Run 2: PASS

org.apache.hadoop.hbase.security.access.TestAccessControlFilter.testQualifierAccess(org.apache.hadoop.hbase.security.access.TestAccessControlFilter)
  Run 1: TestAccessControlFilter.testQualifierAccess:97->SecureTestUtil.createTable:710->SecureTestUtil.createTable:726->SecureTestUtil.createTable:739->Object.wait:-2
» TestTimedOut
  Run 2: PASS


Tests run: 2851, Failures: 0, Errors: 2, Skipped: 57, Flakes: 2

[INFO] ------------------------------------------------------------------------
[INFO] Reactor Summary:
[INFO] 
[INFO] Apache HBase ...................................... SUCCESS [1:46.965s]
[INFO] Apache HBase - Checkstyle ......................... SUCCESS [15.849s]
[INFO] Apache HBase - Resource Bundle .................... SUCCESS [0.360s]
[INFO] Apache HBase - Annotations ........................ SUCCESS [1.480s]
[INFO] Apache HBase - Protocol ........................... SUCCESS [18.683s]
[INFO] Apache HBase - Common ............................. SUCCESS [2:46.258s]
[INFO] Apache HBase - Procedure .......................... SUCCESS [3:40.997s]
[INFO] Apache HBase - Metrics API ........................ SUCCESS [1.619s]
[INFO] Apache HBase - Hadoop Compatibility ............... SUCCESS [12.611s]
[INFO] Apache HBase - Metrics Implementation ............. SUCCESS [6.055s]
[INFO] Apache HBase - Hadoop Two Compatibility ........... SUCCESS [21.262s]
[INFO] Apache HBase - Client ............................. SUCCESS [1:49.907s]
[INFO] Apache HBase - Prefix Tree ........................ SUCCESS [10.266s]
[INFO] Apache HBase - Server ............................. FAILURE [1:41:48.586s]
[INFO] Apache HBase - Testing Util ....................... SKIPPED
[INFO] Apache HBase - Thrift ............................. SKIPPED
[INFO] Apache HBase - Rest ............................... SKIPPED
[INFO] Apache HBase - Shell .............................. SKIPPED
[INFO] Apache HBase - Integration Tests .................. SKIPPED
[INFO] Apache HBase - Examples ........................... SKIPPED
[INFO] Apache HBase - External Block Cache ............... SKIPPED
[INFO] Apache HBase - Assembly ........................... SKIPPED
[INFO] Apache HBase - Shaded ............................. SKIPPED
[INFO] Apache HBase - Shaded - Client .................... SKIPPED
[INFO] Apache HBase - Shaded - Server .................... SKIPPED
[INFO] Apache HBase - Archetypes ......................... SKIPPED
[INFO] Apache HBase - Exemplar for hbase-client archetype  SKIPPED
[INFO] Apache HBase - Exemplar for hbase-shaded-client archetype  SKIPPED
[INFO] Apache HBase - Archetype builder .................. SKIPPED
[INFO] ------------------------------------------------------------------------
[INFO] BUILD FAILURE
[INFO] ------------------------------------------------------------------------
[INFO] Total time: 1:53:54.111s
[INFO] Finished at: Fri Aug 18 21:40:52 UTC 2017
[INFO] Final Memory: 102M/1075M
[INFO] ------------------------------------------------------------------------
[ERROR] Failed to execute goal org.apache.maven.plugins:maven-surefire-plugin:2.18.1:test
(secondPartTestsExecution) on project hbase-server: There are test failures.
[ERROR] 
[ERROR] Please refer to <https://builds.apache.org/job/HBase-1.4/jdk=JDK_1_7,label=Hadoop&&!H13/ws/hbase-server/target/surefire-reports>
for the individual test results.
[ERROR] -> [Help 1]
[ERROR] 
[ERROR] To see the full stack trace of the errors, re-run Maven with the -e switch.
[ERROR] Re-run Maven using the -X switch to enable full debug logging.
[ERROR] 
[ERROR] For more information about the errors and possible solutions, please read the following
articles:
[ERROR] [Help 1] http://cwiki.apache.org/confluence/display/MAVEN/MojoFailureException
[ERROR] 
[ERROR] After correcting the problems, you can resume the build with the command
[ERROR]   mvn <goals> -rf :hbase-server
Build step 'Invoke top-level Maven targets' marked build as failure
Performing Post build task...
Match found for :.* : True
Logical operation result is TRUE
Running script  : # Post-build task script. TODO: Check this in and have all builds reference
check-in.
pwd && ls
# NOTE!!!! The below code has been copied and pasted from ./dev-tools/run-test.sh
# Do not change here without syncing there and vice-versa.
ZOMBIE_TESTS_COUNT=`jps -v | grep surefirebooter | grep -e '-Dhbase.test' | wc -l`
if [[ $ZOMBIE_TESTS_COUNT != 0 ]] ; then
 echo "Suspicious java process found - waiting 30s to see if there are just slow to stop"
 sleep 30
 ZOMBIE_TESTS_COUNT=`jps -v | grep surefirebooter | grep -e '-Dhbase.test' | wc -l`
 if [[ $ZOMBIE_TESTS_COUNT != 0 ]] ; then
   echo " {color:red}There appear to be $ZOMBIE_TESTS_COUNT zombie tests{color}, they should
have been killed by surefire but survived"
   jps -v | grep surefirebooter | grep -e '-Dhbase.test'
   jps -v | grep surefirebooter | grep -e '-Dhbase.test' | cut -d ' ' -f 1 | xargs -n 1 jstack
   # Exit with error
   exit 1
 else
   echo "We're ok: there is no zombie test, but some tests took some time to stop"
 fi
else
  echo "We're ok: there is no zombie test"
fi
Setting JDK_1_7_LATEST__HOME=/home/jenkins/tools/java/latest1.7
Setting JDK_1_8_LATEST__HOME=/home/jenkins/tools/java/latest1.8
[19ccb43d] $ /bin/bash -xe /tmp/jenkins897613634643463442.sh
+ pwd
<https://builds.apache.org/job/HBase-1.4/jdk=JDK_1_7,label=Hadoop&&!H13/ws/>
+ ls
bin
CHANGES.txt
conf
dev-support
extra_env_var
hbase-annotations
hbase-archetypes
hbase-assembly
hbase-checkstyle
hbase-client
hbase-common
hbase-examples
hbase-external-blockcache
hbase-hadoop2-compat
hbase-hadoop-compat
hbase-it
hbase-metrics
hbase-metrics-api
hbase-native-client
hbase-prefix-tree
hbase-procedure
hbase-protocol
hbase-resource-bundle
hbase-rest
hbase-server
hbase-shaded
hbase-shell
hbase-testing-util
hbase-thrift
LICENSE.txt
NOTICE.txt
pom.xml
README.txt
src
target
++ jps -v
++ grep surefirebooter
++ wc -l
++ grep -e -Dhbase.test
+ ZOMBIE_TESTS_COUNT=0
+ [[ 0 != 0 ]]
+ echo 'We'\''re ok: there is no zombie test'
We're ok: there is no zombie test
POST BUILD TASK : SUCCESS
END OF POST BUILD TASK : 0
Archiving artifacts
Setting JDK_1_7_LATEST__HOME=/home/jenkins/tools/java/latest1.7
Setting JDK_1_8_LATEST__HOME=/home/jenkins/tools/java/latest1.8
Recording test results
Setting JDK_1_7_LATEST__HOME=/home/jenkins/tools/java/latest1.7
Setting JDK_1_8_LATEST__HOME=/home/jenkins/tools/java/latest1.8
ERROR: Step ?Publish JUnit test result report? aborted due to exception: 
java.lang.OutOfMemoryError: Java heap space
Caused: java.io.IOException: Remote call on H4 failed
	at hudson.remoting.Channel.call(Channel.java:838)
	at hudson.FilePath.act(FilePath.java:986)
Caused: java.io.IOException: remote file operation failed: <https://builds.apache.org/job/HBase-1.4/jdk=JDK_1_7,label=Hadoop&&!H13/ws/>
at hudson.remoting.Channel@28c87fc0:H4
	at hudson.FilePath.act(FilePath.java:993)
	at hudson.FilePath.act(FilePath.java:975)
	at hudson.tasks.junit.JUnitParser.parseResult(JUnitParser.java:103)
	at hudson.tasks.junit.JUnitResultArchiver.parse(JUnitResultArchiver.java:128)
	at hudson.tasks.junit.JUnitResultArchiver.perform(JUnitResultArchiver.java:149)
	at hudson.tasks.BuildStepCompatibilityLayer.perform(BuildStepCompatibilityLayer.java:81)
	at hudson.tasks.BuildStepMonitor$1.perform(BuildStepMonitor.java:20)
	at hudson.model.AbstractBuild$AbstractBuildExecution.perform(AbstractBuild.java:735)
	at hudson.model.AbstractBuild$AbstractBuildExecution.performAllBuildSteps(AbstractBuild.java:676)
	at hudson.model.Build$BuildExecution.post2(Build.java:186)
	at hudson.model.AbstractBuild$AbstractBuildExecution.post(AbstractBuild.java:621)
	at hudson.model.Run.execute(Run.java:1760)
	at hudson.matrix.MatrixRun.run(MatrixRun.java:146)
	at hudson.model.ResourceController.execute(ResourceController.java:97)
	at hudson.model.Executor.run(Executor.java:405)
Setting JDK_1_7_LATEST__HOME=/home/jenkins/tools/java/latest1.7
Setting JDK_1_8_LATEST__HOME=/home/jenkins/tools/java/latest1.8

Mime
View raw message