hbase-builds mailing list archives

Site index · List index
Message view « Date » · « Thread »
Top « Date » · « Thread »
From Apache Jenkins Server <jenk...@builds.apache.org>
Subject Build failed in Jenkins: HBase-1.4 » JDK_1_7,Hadoop&&!H13 #837
Date Mon, 07 Aug 2017 18:55:56 GMT
See <https://builds.apache.org/job/HBase-1.4/jdk=JDK_1_7,label=Hadoop&&!H13/837/display/redirect?page=changes>

Changes:

[busbey] HBASE-18527 Update nightly job to account for changes in jenkins

------------------------------------------
[...truncated 2.41 MB...]
Tests run: 4, Failures: 0, Errors: 0, Skipped: 0, Time elapsed: 0.954 sec - in org.apache.hadoop.hbase.zookeeper.TestHQuorumPeer
Running org.apache.hadoop.hbase.TestIOFencing
Tests run: 6, Failures: 0, Errors: 0, Skipped: 0, Time elapsed: 25.691 sec - in org.apache.hadoop.hbase.zookeeper.lock.TestZKInterProcessReadWriteLock
Running org.apache.hadoop.hbase.constraint.TestConstraint
Tests run: 33, Failures: 0, Errors: 0, Skipped: 0, Time elapsed: 88.828 sec - in org.apache.hadoop.hbase.wal.TestWALSplit
Running org.apache.hadoop.hbase.TestMovedRegionsCleaner
Tests run: 1, Failures: 0, Errors: 0, Skipped: 0, Time elapsed: 11.447 sec - in org.apache.hadoop.hbase.TestMovedRegionsCleaner
Running org.apache.hadoop.hbase.backup.TestHFileArchiving
Tests run: 33, Failures: 0, Errors: 0, Skipped: 0, Time elapsed: 96.683 sec - in org.apache.hadoop.hbase.wal.TestWALSplitCompressed
Tests run: 5, Failures: 0, Errors: 0, Skipped: 0, Time elapsed: 37.159 sec - in org.apache.hadoop.hbase.constraint.TestConstraint
Running org.apache.hadoop.hbase.backup.example.TestZooKeeperTableArchiveClient
Tests run: 3, Failures: 0, Errors: 0, Skipped: 0, Time elapsed: 4.648 sec - in org.apache.hadoop.hbase.backup.example.TestZooKeeperTableArchiveClient
Running org.apache.hadoop.hbase.tool.TestCanaryTool
Running org.apache.hadoop.hbase.TestHColumnDescriptorDefaultVersions
Tests run: 3, Failures: 0, Errors: 0, Skipped: 0, Time elapsed: 239.301 sec - in org.apache.hadoop.hbase.io.encoding.TestChangingEncoding
Running org.apache.hadoop.hbase.ipc.TestProtoBufRpc
Tests run: 1, Failures: 0, Errors: 0, Skipped: 0, Time elapsed: 2.524 sec - in org.apache.hadoop.hbase.ipc.TestProtoBufRpc
Tests run: 2, Failures: 0, Errors: 0, Skipped: 0, Time elapsed: 92.391 sec - in org.apache.hadoop.hbase.TestIOFencing
Running org.apache.hadoop.hbase.ipc.TestRpcServerSlowConnectionSetup
Tests run: 1, Failures: 0, Errors: 0, Skipped: 0, Time elapsed: 7.103 sec - in org.apache.hadoop.hbase.ipc.TestRpcServerSlowConnectionSetup
Running org.apache.hadoop.hbase.ipc.TestRpcClientLeaks
Running org.apache.hadoop.hbase.ipc.TestHBaseClient
Tests run: 1, Failures: 0, Errors: 0, Skipped: 0, Time elapsed: 1.085 sec - in org.apache.hadoop.hbase.ipc.TestHBaseClient
Tests run: 1, Failures: 0, Errors: 0, Skipped: 0, Time elapsed: 7.985 sec - in org.apache.hadoop.hbase.ipc.TestRpcClientLeaks
Running org.apache.hadoop.hbase.TestNamespace
Tests run: 5, Failures: 0, Errors: 0, Skipped: 0, Time elapsed: 62.444 sec - in org.apache.hadoop.hbase.backup.TestHFileArchiving
Tests run: 4, Failures: 0, Errors: 0, Skipped: 0, Time elapsed: 39.127 sec - in org.apache.hadoop.hbase.TestHColumnDescriptorDefaultVersions
Tests run: 7, Failures: 0, Errors: 0, Skipped: 0, Time elapsed: 102.286 sec - in org.apache.hadoop.hbase.tool.TestCanaryTool
Tests run: 8, Failures: 0, Errors: 0, Skipped: 0, Time elapsed: 65.048 sec - in org.apache.hadoop.hbase.TestNamespace

Results :

Failed tests: 
  TestReplicator.testReplicatorBatching:95 Waiting timed out after [60,000] msec We waited
too long for expected replication of 10 entries
Flaked tests: 
org.apache.hadoop.hbase.client.TestClientScannerRPCTimeout.testScannerNextRPCTimesout(org.apache.hadoop.hbase.client.TestClientScannerRPCTimeout)
  Run 1: TestClientScannerRPCTimeout.testScannerNextRPCTimesout:87 » TableExists testSc...
  Run 2: TestClientScannerRPCTimeout.testScannerNextRPCTimesout:87 » TableExists testSc...
  Run 3: PASS

org.apache.hadoop.hbase.client.TestReplicasClient.testCancelOfMultiGet(org.apache.hadoop.hbase.client.TestReplicasClient)
  Run 1: TestReplicasClient.testCancelOfMultiGet:585 null
  Run 2: PASS

org.apache.hadoop.hbase.mapreduce.TestSecureLoadIncrementalHFilesSplitRecovery.testGroupOrSplitFailure(org.apache.hadoop.hbase.mapreduce.TestSecureLoadIncrementalHFilesSplitRecovery)
  Run 1: TestSecureLoadIncrementalHFilesSplitRecovery>TestLoadIncrementalHFilesSplitRecovery.testGroupOrSplitFailure:462->TestLoadIncrementalHFilesSplitRecovery.setupTable:136->Object.wait:-2
» TestTimedOut
  Run 2: PASS

org.apache.hadoop.hbase.mapreduce.TestSecureLoadIncrementalHFilesSplitRecovery.testGroupOrSplitPresplit(org.apache.hadoop.hbase.mapreduce.TestSecureLoadIncrementalHFilesSplitRecovery)
  Run 1: TestSecureLoadIncrementalHFilesSplitRecovery>TestLoadIncrementalHFilesSplitRecovery.testGroupOrSplitPresplit:389->TestLoadIncrementalHFilesSplitRecovery.setupTable:136->Object.wait:-2
» TestTimedOut
  Run 2: PASS

org.apache.hadoop.hbase.mapreduce.TestSecureLoadIncrementalHFilesSplitRecovery.testGroupOrSplitWhenRegionHoleExistsInMeta(org.apache.hadoop.hbase.mapreduce.TestSecureLoadIncrementalHFilesSplitRecovery)
  Run 1: TestSecureLoadIncrementalHFilesSplitRecovery>TestLoadIncrementalHFilesSplitRecovery.testGroupOrSplitWhenRegionHoleExistsInMeta:502->TestLoadIncrementalHFilesSplitRecovery.setupTableWithSplitkeys:159->Object.wait:-2
» TestTimedOut
  Run 2: PASS

org.apache.hadoop.hbase.mapreduce.TestSecureLoadIncrementalHFilesSplitRecovery.testSplitTmpFileCleanUp(org.apache.hadoop.hbase.mapreduce.TestSecureLoadIncrementalHFilesSplitRecovery)
  Run 1: TestSecureLoadIncrementalHFilesSplitRecovery>TestLoadIncrementalHFilesSplitRecovery.testSplitTmpFileCleanUp:431->TestLoadIncrementalHFilesSplitRecovery.setupTableWithSplitkeys:159->Object.wait:-2
» TestTimedOut
  Run 2: PASS

org.apache.hadoop.hbase.mapreduce.TestSecureLoadIncrementalHFilesSplitRecovery.testSplitWhileBulkLoadPhase(org.apache.hadoop.hbase.mapreduce.TestSecureLoadIncrementalHFilesSplitRecovery)
  Run 1: TestSecureLoadIncrementalHFilesSplitRecovery>TestLoadIncrementalHFilesSplitRecovery.testSplitWhileBulkLoadPhase:346->TestLoadIncrementalHFilesSplitRecovery.setupTable:136->Object.wait:-2
» TestTimedOut
  Run 2: PASS

org.apache.hadoop.hbase.regionserver.TestCompactionInDeadRegionServer.test(org.apache.hadoop.hbase.regionserver.TestCompactionInDeadRegionServer)
  Run 1: TestCompactionInDeadRegionServer.test:132 Should fail as our wal file has already
been closed, and walDir has also been renamed
  Run 2: PASS

org.apache.hadoop.hbase.replication.regionserver.TestRegionReplicaReplicationEndpoint.testRegionReplicaReplicationForFlushAndCompaction(org.apache.hadoop.hbase.replication.regionserver.TestRegionReplicaReplicationEndpoint)
  Run 1: TestRegionReplicaReplicationEndpoint.testRegionReplicaReplicationForFlushAndCompaction:306
» RetriesExhausted
  Run 2: TestRegionReplicaReplicationEndpoint.testRegionReplicaReplicationForFlushAndCompaction:306
» RetriesExhausted
  Run 3: PASS

org.apache.hadoop.hbase.replication.regionserver.TestRegionReplicaReplicationEndpoint.testRegionReplicaReplicationIgnoresDisabledTables(org.apache.hadoop.hbase.replication.regionserver.TestRegionReplicaReplicationEndpoint)
  Run 1: TestRegionReplicaReplicationEndpoint.testRegionReplicaReplicationIgnoresDisabledTables:332->testRegionReplicaReplicationIgnoresDisabledTables:351
» RetriesExhausted
  Run 2: TestRegionReplicaReplicationEndpoint.testRegionReplicaReplicationIgnoresDisabledTables:332->testRegionReplicaReplicationIgnoresDisabledTables:351
» RetriesExhausted
  Run 3: PASS

org.apache.hadoop.hbase.replication.regionserver.TestRegionReplicaReplicationEndpoint.testRegionReplicaReplicationIgnoresDroppedTables(org.apache.hadoop.hbase.replication.regionserver.TestRegionReplicaReplicationEndpoint)
  Run 1: TestRegionReplicaReplicationEndpoint.testRegionReplicaReplicationIgnoresDroppedTables:337->testRegionReplicaReplicationIgnoresDisabledTables:350
» RetriesExhausted
  Run 2: TestRegionReplicaReplicationEndpoint.testRegionReplicaReplicationIgnoresDroppedTables:337->testRegionReplicaReplicationIgnoresDisabledTables:350
» RetriesExhausted
  Run 3: PASS

org.apache.hadoop.hbase.replication.regionserver.TestRegionReplicaReplicationEndpoint.testRegionReplicaReplicationPeerIsCreated(org.apache.hadoop.hbase.replication.regionserver.TestRegionReplicaReplicationEndpoint)
  Run 1: TestRegionReplicaReplicationEndpoint.testRegionReplicaReplicationPeerIsCreated:121
» RetriesExhausted
  Run 2: TestRegionReplicaReplicationEndpoint.testRegionReplicaReplicationPeerIsCreated:121
» RetriesExhausted
  Run 3: PASS

org.apache.hadoop.hbase.replication.regionserver.TestRegionReplicaReplicationEndpoint.testRegionReplicaReplicationPeerIsCreatedForModifyTable(org.apache.hadoop.hbase.replication.regionserver.TestRegionReplicaReplicationEndpoint)
  Run 1: TestRegionReplicaReplicationEndpoint.testRegionReplicaReplicationPeerIsCreatedForModifyTable:152
» RetriesExhausted
  Run 2: TestRegionReplicaReplicationEndpoint.testRegionReplicaReplicationPeerIsCreatedForModifyTable:152
» RetriesExhausted
  Run 3: PASS

org.apache.hadoop.hbase.replication.regionserver.TestRegionReplicaReplicationEndpoint.testRegionReplicaReplicationWith10Replicas(org.apache.hadoop.hbase.replication.regionserver.TestRegionReplicaReplicationEndpoint)
  Run 1: TestRegionReplicaReplicationEndpoint.testRegionReplicaReplicationWith10Replicas:261->testRegionReplicaReplication:180
» RetriesExhausted
  Run 2: TestRegionReplicaReplicationEndpoint.testRegionReplicaReplicationWith10Replicas:261->testRegionReplicaReplication:180
» RetriesExhausted
  Run 3: PASS

org.apache.hadoop.hbase.replication.regionserver.TestRegionReplicaReplicationEndpoint.testRegionReplicaReplicationWith2Replicas(org.apache.hadoop.hbase.replication.regionserver.TestRegionReplicaReplicationEndpoint)
  Run 1: TestRegionReplicaReplicationEndpoint.testRegionReplicaReplicationWith2Replicas:251->testRegionReplicaReplication:180
» RetriesExhausted
  Run 2: TestRegionReplicaReplicationEndpoint.testRegionReplicaReplicationWith2Replicas:251->testRegionReplicaReplication:180
» RetriesExhausted
  Run 3: PASS

org.apache.hadoop.hbase.replication.regionserver.TestRegionReplicaReplicationEndpoint.testRegionReplicaReplicationWith3Replicas(org.apache.hadoop.hbase.replication.regionserver.TestRegionReplicaReplicationEndpoint)
  Run 1: TestRegionReplicaReplicationEndpoint.testRegionReplicaReplicationWith3Replicas:256->testRegionReplicaReplication:180
» RetriesExhausted
  Run 2: TestRegionReplicaReplicationEndpoint.testRegionReplicaReplicationWith3Replicas:256->testRegionReplicaReplication:180
» RetriesExhausted
  Run 3: PASS

org.apache.hadoop.hbase.replication.regionserver.TestRegionReplicaReplicationEndpoint.testRegionReplicaWithoutMemstoreReplication(org.apache.hadoop.hbase.replication.regionserver.TestRegionReplicaReplicationEndpoint)
  Run 1: TestRegionReplicaReplicationEndpoint.testRegionReplicaWithoutMemstoreReplication:271
» RetriesExhausted
  Run 2: TestRegionReplicaReplicationEndpoint.testRegionReplicaWithoutMemstoreReplication:271
» RetriesExhausted
  Run 3: PASS


Tests run: 2840, Failures: 1, Errors: 0, Skipped: 57, Flakes: 17

[INFO] ------------------------------------------------------------------------
[INFO] Reactor Summary:
[INFO] 
[INFO] Apache HBase ...................................... SUCCESS [1:49.930s]
[INFO] Apache HBase - Checkstyle ......................... SUCCESS [16.244s]
[INFO] Apache HBase - Resource Bundle .................... SUCCESS [0.345s]
[INFO] Apache HBase - Annotations ........................ SUCCESS [2.176s]
[INFO] Apache HBase - Protocol ........................... SUCCESS [23.580s]
[INFO] Apache HBase - Common ............................. SUCCESS [3:18.565s]
[INFO] Apache HBase - Procedure .......................... SUCCESS [3:59.181s]
[INFO] Apache HBase - Metrics API ........................ SUCCESS [2.626s]
[INFO] Apache HBase - Hadoop Compatibility ............... SUCCESS [13.509s]
[INFO] Apache HBase - Metrics Implementation ............. SUCCESS [13.678s]
[INFO] Apache HBase - Hadoop Two Compatibility ........... SUCCESS [24.743s]
[INFO] Apache HBase - Client ............................. SUCCESS [2:16.200s]
[INFO] Apache HBase - Prefix Tree ........................ SUCCESS [12.930s]
[INFO] Apache HBase - Server ............................. FAILURE [2:03:36.359s]
[INFO] Apache HBase - Testing Util ....................... SKIPPED
[INFO] Apache HBase - Thrift ............................. SKIPPED
[INFO] Apache HBase - Rest ............................... SKIPPED
[INFO] Apache HBase - Shell .............................. SKIPPED
[INFO] Apache HBase - Integration Tests .................. SKIPPED
[INFO] Apache HBase - Examples ........................... SKIPPED
[INFO] Apache HBase - External Block Cache ............... SKIPPED
[INFO] Apache HBase - Assembly ........................... SKIPPED
[INFO] Apache HBase - Shaded ............................. SKIPPED
[INFO] Apache HBase - Shaded - Client .................... SKIPPED
[INFO] Apache HBase - Shaded - Server .................... SKIPPED
[INFO] Apache HBase - Archetypes ......................... SKIPPED
[INFO] Apache HBase - Exemplar for hbase-client archetype  SKIPPED
[INFO] Apache HBase - Exemplar for hbase-shaded-client archetype  SKIPPED
[INFO] Apache HBase - Archetype builder .................. SKIPPED
[INFO] ------------------------------------------------------------------------
[INFO] BUILD FAILURE
[INFO] ------------------------------------------------------------------------
[INFO] Total time: 2:17:27.633s
[INFO] Finished at: Mon Aug 07 18:46:25 UTC 2017
[INFO] Final Memory: 103M/1574M
[INFO] ------------------------------------------------------------------------
[ERROR] Failed to execute goal org.apache.maven.plugins:maven-surefire-plugin:2.18.1:test
(secondPartTestsExecution) on project hbase-server: ExecutionException: java.lang.RuntimeException:
java.lang.RuntimeException: org.apache.maven.surefire.report.ReporterException: When writing
xml report stdout/stderr: /tmp/stderr7736566946251842116deferred (No such file or directory)
-> [Help 1]
[ERROR] 
[ERROR] To see the full stack trace of the errors, re-run Maven with the -e switch.
[ERROR] Re-run Maven using the -X switch to enable full debug logging.
[ERROR] 
[ERROR] For more information about the errors and possible solutions, please read the following
articles:
[ERROR] [Help 1] http://cwiki.apache.org/confluence/display/MAVEN/MojoFailureException
[ERROR] 
[ERROR] After correcting the problems, you can resume the build with the command
[ERROR]   mvn <goals> -rf :hbase-server
Build step 'Invoke top-level Maven targets' marked build as failure
Performing Post build task...
Match found for :.* : True
Logical operation result is TRUE
Running script  : # Post-build task script. TODO: Check this in and have all builds reference
check-in.
pwd && ls
# NOTE!!!! The below code has been copied and pasted from ./dev-tools/run-test.sh
# Do not change here without syncing there and vice-versa.
ZOMBIE_TESTS_COUNT=`jps -v | grep surefirebooter | grep -e '-Dhbase.test' | wc -l`
if [[ $ZOMBIE_TESTS_COUNT != 0 ]] ; then
 echo "Suspicious java process found - waiting 30s to see if there are just slow to stop"
 sleep 30
 ZOMBIE_TESTS_COUNT=`jps -v | grep surefirebooter | grep -e '-Dhbase.test' | wc -l`
 if [[ $ZOMBIE_TESTS_COUNT != 0 ]] ; then
   echo " {color:red}There appear to be $ZOMBIE_TESTS_COUNT zombie tests{color}, they should
have been killed by surefire but survived"
   jps -v | grep surefirebooter | grep -e '-Dhbase.test'
   jps -v | grep surefirebooter | grep -e '-Dhbase.test' | cut -d ' ' -f 1 | xargs -n 1 jstack
   # Exit with error
   exit 1
 else
   echo "We're ok: there is no zombie test, but some tests took some time to stop"
 fi
else
  echo "We're ok: there is no zombie test"
fi
Setting JDK_1_7_LATEST__HOME=/home/jenkins/tools/java/latest1.7
Setting JDK_1_8_LATEST__HOME=/home/jenkins/tools/java/latest1.8
[19ccb43d] $ /bin/bash -xe /tmp/jenkins2157881788430204110.sh
+ pwd
<https://builds.apache.org/job/HBase-1.4/jdk=JDK_1_7,label=Hadoop&&!H13/ws/>
+ ls
bin
CHANGES.txt
conf
dev-support
extra_env_var
hbase-annotations
hbase-archetypes
hbase-assembly
hbase-checkstyle
hbase-client
hbase-common
hbase-examples
hbase-external-blockcache
hbase-hadoop2-compat
hbase-hadoop-compat
hbase-it
hbase-metrics
hbase-metrics-api
hbase-native-client
hbase-prefix-tree
hbase-procedure
hbase-protocol
hbase-resource-bundle
hbase-rest
hbase-server
hbase-shaded
hbase-shell
hbase-testing-util
hbase-thrift
LICENSE.txt
NOTICE.txt
pom.xml
README.txt
src
target
++ jps -v
++ grep surefirebooter
++ grep -e -Dhbase.test
++ wc -l
+ ZOMBIE_TESTS_COUNT=0
+ [[ 0 != 0 ]]
+ echo 'We'\''re ok: there is no zombie test'
We're ok: there is no zombie test
POST BUILD TASK : SUCCESS
END OF POST BUILD TASK : 0
Archiving artifacts
Setting JDK_1_7_LATEST__HOME=/home/jenkins/tools/java/latest1.7
Setting JDK_1_8_LATEST__HOME=/home/jenkins/tools/java/latest1.8
Recording test results
Setting JDK_1_7_LATEST__HOME=/home/jenkins/tools/java/latest1.7
Setting JDK_1_8_LATEST__HOME=/home/jenkins/tools/java/latest1.8
Setting JDK_1_7_LATEST__HOME=/home/jenkins/tools/java/latest1.7
Setting JDK_1_8_LATEST__HOME=/home/jenkins/tools/java/latest1.8

Mime
View raw message