hbase-builds mailing list archives

Site index · List index
Message view « Date » · « Thread »
Top « Date » · « Thread »
From Apache Jenkins Server <jenk...@builds.apache.org>
Subject Build failed in Jenkins: HBase-1.5 » JDK_1_8,Hadoop&&!H13 #8
Date Wed, 16 Aug 2017 07:24:05 GMT
See <https://builds.apache.org/job/HBase-1.5/jdk=JDK_1_8,label=Hadoop&&!H13/8/display/redirect?page=changes>

Changes:

[apurtell] HBASE-18437 Revoke access permissions of a user from a table does not

------------------------------------------
[...truncated 2.30 MB...]
Running org.apache.hadoop.hbase.zookeeper.TestZooKeeperNodeTracker
Tests run: 12, Failures: 0, Errors: 0, Skipped: 0, Time elapsed: 1.136 sec - in org.apache.hadoop.hbase.zookeeper.TestZKMulti
Tests run: 3, Failures: 0, Errors: 0, Skipped: 0, Time elapsed: 0.749 sec - in org.apache.hadoop.hbase.zookeeper.TestZooKeeperNodeTracker
Running org.apache.hadoop.hbase.TestStochasticBalancerJmxMetrics
Tests run: 1, Failures: 0, Errors: 0, Skipped: 1, Time elapsed: 0.001 sec - in org.apache.hadoop.hbase.TestStochasticBalancerJmxMetrics
Running org.apache.hadoop.hbase.TestZooKeeper
Tests run: 6, Failures: 0, Errors: 0, Skipped: 0, Time elapsed: 24.52 sec - in org.apache.hadoop.hbase.zookeeper.lock.TestZKInterProcessReadWriteLock
Running org.apache.hadoop.hbase.TestFullLogReconstruction
Running org.apache.hadoop.hbase.TestJMXListener
Tests run: 3, Failures: 0, Errors: 0, Skipped: 0, Time elapsed: 1.383 sec - in org.apache.hadoop.hbase.TestJMXListener
Tests run: 1, Failures: 0, Errors: 0, Skipped: 0, Time elapsed: 17.689 sec - in org.apache.hadoop.hbase.TestFullLogReconstruction
Running org.apache.hadoop.hbase.TestPartialResultsFromClientSide
Running org.apache.hadoop.hbase.trace.TestHTraceHooks
Tests run: 1, Failures: 0, Errors: 0, Skipped: 0, Time elapsed: 18.52 sec - in org.apache.hadoop.hbase.trace.TestHTraceHooks
Tests run: 19, Failures: 0, Errors: 0, Skipped: 0, Time elapsed: 69.126 sec - in org.apache.hadoop.hbase.TestPartialResultsFromClientSide
Tests run: 10, Failures: 0, Errors: 0, Skipped: 0, Time elapsed: 163.711 sec - in org.apache.hadoop.hbase.TestZooKeeper
Tests run: 59, Failures: 0, Errors: 0, Skipped: 1, Time elapsed: 382.299 sec - in org.apache.hadoop.hbase.util.TestHBaseFsck
Tests run: 7, Failures: 0, Errors: 1, Skipped: 0, Time elapsed: 604.485 sec <<< FAILURE!
- in org.apache.hadoop.hbase.mapred.TestTableSnapshotInputFormat
testWithMapReduceAndOfflineHBaseMultiRegion(org.apache.hadoop.hbase.mapred.TestTableSnapshotInputFormat)
 Time elapsed: 516.557 sec  <<< ERROR!
org.apache.hadoop.hbase.client.RetriesExhaustedException: Failed after attempts=35, exceptions:
Wed Aug 16 07:12:48 UTC 2017, RpcRetryingCaller{globalStartTime=1502867567604, pause=100,
retries=35}, java.io.IOException: Call to asf912.gq1.ygridcore.net/67.195.81.156:34774 failed
on local exception: java.io.EOFException
Wed Aug 16 07:12:48 UTC 2017, RpcRetryingCaller{globalStartTime=1502867567604, pause=100,
retries=35}, org.apache.hadoop.hbase.MasterNotRunningException: java.io.IOException: Can't
get master address from ZooKeeper; znode data == null
Wed Aug 16 07:12:48 UTC 2017, RpcRetryingCaller{globalStartTime=1502867567604, pause=100,
retries=35}, org.apache.hadoop.hbase.MasterNotRunningException: java.io.IOException: Can't
get master address from ZooKeeper; znode data == null
Wed Aug 16 07:12:49 UTC 2017, RpcRetryingCaller{globalStartTime=1502867567604, pause=100,
retries=35}, org.apache.hadoop.hbase.MasterNotRunningException: java.io.IOException: Can't
get master address from ZooKeeper; znode data == null
Wed Aug 16 07:12:49 UTC 2017, RpcRetryingCaller{globalStartTime=1502867567604, pause=100,
retries=35}, org.apache.hadoop.hbase.MasterNotRunningException: java.io.IOException: Can't
get master address from ZooKeeper; znode data == null
Wed Aug 16 07:12:50 UTC 2017, RpcRetryingCaller{globalStartTime=1502867567604, pause=100,
retries=35}, org.apache.hadoop.hbase.MasterNotRunningException: java.io.IOException: Can't
get master address from ZooKeeper; znode data == null
Wed Aug 16 07:12:52 UTC 2017, RpcRetryingCaller{globalStartTime=1502867567604, pause=100,
retries=35}, org.apache.hadoop.hbase.MasterNotRunningException: java.io.IOException: Can't
get master address from ZooKeeper; znode data == null
Wed Aug 16 07:12:56 UTC 2017, RpcRetryingCaller{globalStartTime=1502867567604, pause=100,
retries=35}, org.apache.hadoop.hbase.MasterNotRunningException: java.io.IOException: Can't
get master address from ZooKeeper; znode data == null
Wed Aug 16 07:13:06 UTC 2017, RpcRetryingCaller{globalStartTime=1502867567604, pause=100,
retries=35}, org.apache.hadoop.hbase.MasterNotRunningException: java.io.IOException: Can't
get master address from ZooKeeper; znode data == null
Wed Aug 16 07:13:16 UTC 2017, RpcRetryingCaller{globalStartTime=1502867567604, pause=100,
retries=35}, org.apache.hadoop.hbase.MasterNotRunningException: java.io.IOException: Can't
get master address from ZooKeeper; znode data == null
Wed Aug 16 07:13:26 UTC 2017, RpcRetryingCaller{globalStartTime=1502867567604, pause=100,
retries=35}, org.apache.hadoop.hbase.MasterNotRunningException: java.io.IOException: Can't
get master address from ZooKeeper; znode data == null
Wed Aug 16 07:13:36 UTC 2017, RpcRetryingCaller{globalStartTime=1502867567604, pause=100,
retries=35}, org.apache.hadoop.hbase.MasterNotRunningException: java.io.IOException: Can't
get master address from ZooKeeper; znode data == null
Wed Aug 16 07:13:57 UTC 2017, RpcRetryingCaller{globalStartTime=1502867567604, pause=100,
retries=35}, org.apache.hadoop.hbase.MasterNotRunningException: java.io.IOException: Can't
get master address from ZooKeeper; znode data == null
Wed Aug 16 07:14:17 UTC 2017, RpcRetryingCaller{globalStartTime=1502867567604, pause=100,
retries=35}, org.apache.hadoop.hbase.MasterNotRunningException: java.io.IOException: Can't
get master address from ZooKeeper; znode data == null
Wed Aug 16 07:14:37 UTC 2017, RpcRetryingCaller{globalStartTime=1502867567604, pause=100,
retries=35}, org.apache.hadoop.hbase.MasterNotRunningException: java.io.IOException: Can't
get master address from ZooKeeper; znode data == null
Wed Aug 16 07:14:57 UTC 2017, RpcRetryingCaller{globalStartTime=1502867567604, pause=100,
retries=35}, org.apache.hadoop.hbase.MasterNotRunningException: java.io.IOException: Can't
get master address from ZooKeeper; znode data == null
Wed Aug 16 07:15:17 UTC 2017, RpcRetryingCaller{globalStartTime=1502867567604, pause=100,
retries=35}, org.apache.hadoop.hbase.MasterNotRunningException: java.io.IOException: Can't
get master address from ZooKeeper; znode data == null
Wed Aug 16 07:15:37 UTC 2017, RpcRetryingCaller{globalStartTime=1502867567604, pause=100,
retries=35}, org.apache.hadoop.hbase.MasterNotRunningException: java.io.IOException: Can't
get master address from ZooKeeper; znode data == null
Wed Aug 16 07:15:57 UTC 2017, RpcRetryingCaller{globalStartTime=1502867567604, pause=100,
retries=35}, org.apache.hadoop.hbase.MasterNotRunningException: java.io.IOException: Can't
get master address from ZooKeeper; znode data == null
Wed Aug 16 07:16:17 UTC 2017, RpcRetryingCaller{globalStartTime=1502867567604, pause=100,
retries=35}, org.apache.hadoop.hbase.MasterNotRunningException: java.io.IOException: Can't
get master address from ZooKeeper; znode data == null
Wed Aug 16 07:16:38 UTC 2017, RpcRetryingCaller{globalStartTime=1502867567604, pause=100,
retries=35}, org.apache.hadoop.hbase.MasterNotRunningException: java.io.IOException: Can't
get master address from ZooKeeper; znode data == null
Wed Aug 16 07:16:58 UTC 2017, RpcRetryingCaller{globalStartTime=1502867567604, pause=100,
retries=35}, org.apache.hadoop.hbase.MasterNotRunningException: java.io.IOException: Can't
get master address from ZooKeeper; znode data == null
Wed Aug 16 07:17:18 UTC 2017, RpcRetryingCaller{globalStartTime=1502867567604, pause=100,
retries=35}, org.apache.hadoop.hbase.MasterNotRunningException: java.io.IOException: Can't
get master address from ZooKeeper; znode data == null
Wed Aug 16 07:17:38 UTC 2017, RpcRetryingCaller{globalStartTime=1502867567604, pause=100,
retries=35}, org.apache.hadoop.hbase.MasterNotRunningException: java.io.IOException: Can't
get master address from ZooKeeper; znode data == null
Wed Aug 16 07:17:58 UTC 2017, RpcRetryingCaller{globalStartTime=1502867567604, pause=100,
retries=35}, org.apache.hadoop.hbase.MasterNotRunningException: java.io.IOException: Can't
get master address from ZooKeeper; znode data == null
Wed Aug 16 07:18:18 UTC 2017, RpcRetryingCaller{globalStartTime=1502867567604, pause=100,
retries=35}, org.apache.hadoop.hbase.MasterNotRunningException: java.io.IOException: Can't
get master address from ZooKeeper; znode data == null
Wed Aug 16 07:18:38 UTC 2017, RpcRetryingCaller{globalStartTime=1502867567604, pause=100,
retries=35}, org.apache.hadoop.hbase.MasterNotRunningException: java.io.IOException: Can't
get master address from ZooKeeper; znode data == null
Wed Aug 16 07:18:58 UTC 2017, RpcRetryingCaller{globalStartTime=1502867567604, pause=100,
retries=35}, org.apache.hadoop.hbase.MasterNotRunningException: java.io.IOException: Can't
get master address from ZooKeeper; znode data == null
Wed Aug 16 07:19:18 UTC 2017, RpcRetryingCaller{globalStartTime=1502867567604, pause=100,
retries=35}, org.apache.hadoop.hbase.MasterNotRunningException: java.io.IOException: Can't
get master address from ZooKeeper; znode data == null
Wed Aug 16 07:19:38 UTC 2017, RpcRetryingCaller{globalStartTime=1502867567604, pause=100,
retries=35}, org.apache.hadoop.hbase.MasterNotRunningException: java.io.IOException: Can't
get master address from ZooKeeper; znode data == null
Wed Aug 16 07:19:59 UTC 2017, RpcRetryingCaller{globalStartTime=1502867567604, pause=100,
retries=35}, org.apache.hadoop.hbase.MasterNotRunningException: java.io.IOException: Can't
get master address from ZooKeeper; znode data == null
Wed Aug 16 07:20:19 UTC 2017, RpcRetryingCaller{globalStartTime=1502867567604, pause=100,
retries=35}, org.apache.hadoop.hbase.MasterNotRunningException: java.io.IOException: Can't
get master address from ZooKeeper; znode data == null
Wed Aug 16 07:20:39 UTC 2017, RpcRetryingCaller{globalStartTime=1502867567604, pause=100,
retries=35}, org.apache.hadoop.hbase.MasterNotRunningException: java.io.IOException: Can't
get master address from ZooKeeper; znode data == null
Wed Aug 16 07:20:59 UTC 2017, RpcRetryingCaller{globalStartTime=1502867567604, pause=100,
retries=35}, org.apache.hadoop.hbase.MasterNotRunningException: java.io.IOException: Can't
get master address from ZooKeeper; znode data == null
Wed Aug 16 07:21:19 UTC 2017, RpcRetryingCaller{globalStartTime=1502867567604, pause=100,
retries=35}, org.apache.hadoop.hbase.MasterNotRunningException: java.io.IOException: Can't
get master address from ZooKeeper; znode data == null

	at org.apache.hadoop.hbase.zookeeper.MasterAddressTracker.getMasterAddress(MasterAddressTracker.java:154)
	at org.apache.hadoop.hbase.client.ConnectionManager$HConnectionImplementation$StubMaker.makeStubNoRetries(ConnectionManager.java:1548)
	at org.apache.hadoop.hbase.client.ConnectionManager$HConnectionImplementation$StubMaker.makeStub(ConnectionManager.java:1589)
	at org.apache.hadoop.hbase.client.ConnectionManager$HConnectionImplementation$MasterServiceStubMaker.makeStub(ConnectionManager.java:1618)
	at org.apache.hadoop.hbase.client.ConnectionManager$HConnectionImplementation.getKeepAliveMasterService(ConnectionManager.java:1775)
	at org.apache.hadoop.hbase.client.MasterCallable.prepare(MasterCallable.java:38)
	at org.apache.hadoop.hbase.client.RpcRetryingCaller.callWithRetries(RpcRetryingCaller.java:139)
	at org.apache.hadoop.hbase.client.HBaseAdmin.executeCallable(HBaseAdmin.java:4443)
	at org.apache.hadoop.hbase.client.HBaseAdmin.executeCallable(HBaseAdmin.java:4435)
	at org.apache.hadoop.hbase.client.HBaseAdmin.createTableAsyncV2(HBaseAdmin.java:754)
	at org.apache.hadoop.hbase.client.HBaseAdmin.createTable(HBaseAdmin.java:675)
	at org.apache.hadoop.hbase.client.HBaseAdmin.createTable(HBaseAdmin.java:652)
	at org.apache.hadoop.hbase.HBaseTestingUtility.createTable(HBaseTestingUtility.java:1462)
	at org.apache.hadoop.hbase.mapreduce.TableSnapshotInputFormatTestBase.createTableAndSnapshot(TableSnapshotInputFormatTestBase.java:206)
	at org.apache.hadoop.hbase.mapred.TestTableSnapshotInputFormat.doTestWithMapReduce(TestTableSnapshotInputFormat.java:234)
	at org.apache.hadoop.hbase.mapred.TestTableSnapshotInputFormat.testWithMapReduceImpl(TestTableSnapshotInputFormat.java:224)

Tests run: 1, Failures: 0, Errors: 0, Skipped: 0, Time elapsed: 616.65 sec - in org.apache.hadoop.hbase.mapred.TestTableSnapshotInputFormat

Results :

Tests in error: 
  TestCoprocessorEndpoint.setupBeforeClass:100 » SocketTimeout callTimeout=5000,...
org.apache.hadoop.hbase.master.TestTableLockManager.testReapAllTableLocks(org.apache.hadoop.hbase.master.TestTableLockManager)
  Run 1: TestTableLockManager.testReapAllTableLocks:283 » LockTimeout Timed out acquiri...
  Run 2: TestTableLockManager.testReapAllTableLocks:283 » LockTimeout Timed out acquiri...
  Run 3: TestTableLockManager.testReapAllTableLocks:283 » LockTimeout Timed out acquiri...

org.apache.hadoop.hbase.regionserver.TestRSKilledWhenInitializing.testRSTerminationAfterRegisteringToMasterBeforeCreatingEphemeralNode(org.apache.hadoop.hbase.regionserver.TestRSKilledWhenInitializing)
  Run 1: TestRSKilledWhenInitializing.testRSTerminationAfterRegisteringToMasterBeforeCreatingEphemeralNode:142
null
  Run 2: TestRSKilledWhenInitializing.testRSTerminationAfterRegisteringToMasterBeforeCreatingEphemeralNode:115
» TestTimedOut
  Run 3: TestRSKilledWhenInitializing.testRSTerminationAfterRegisteringToMasterBeforeCreatingEphemeralNode
» 
  Run 4: TestRSKilledWhenInitializing.testRSTerminationAfterRegisteringToMasterBeforeCreatingEphemeralNode:115
» TestTimedOut
  Run 5: TestRSKilledWhenInitializing.testRSTerminationAfterRegisteringToMasterBeforeCreatingEphemeralNode
» 

Flaked tests: 
org.apache.hadoop.hbase.client.TestClientScannerRPCTimeout.testScannerNextRPCTimesout(org.apache.hadoop.hbase.client.TestClientScannerRPCTimeout)
  Run 1: TestClientScannerRPCTimeout.testScannerNextRPCTimesout:87 » TableExists testSc...
  Run 2: TestClientScannerRPCTimeout.testScannerNextRPCTimesout:87 » TableExists testSc...
  Run 3: PASS

org.apache.hadoop.hbase.mapred.TestTableSnapshotInputFormat.testWithMapReduceAndOfflineHBaseMultiRegion(org.apache.hadoop.hbase.mapred.TestTableSnapshotInputFormat)
  Run 1: TestTableSnapshotInputFormat.testWithMapReduceAndOfflineHBaseMultiRegion:147->TableSnapshotInputFormatTestBase.testWithMapReduce:168->testWithMapReduceImpl:224->doTestWithMapReduce:234->TableSnapshotInputFormatTestBase.createTableAndSnapshot:206
» RetriesExhausted
  Run 2: PASS

org.apache.hadoop.hbase.security.visibility.TestVisibilityLabelsReplication.testVisibilityReplication(org.apache.hadoop.hbase.security.visibility.TestVisibilityLabelsReplication)
  Run 1: TestVisibilityLabelsReplication.setup:206 » RetriesExhausted Failed after atte...
  Run 2: PASS


Tests run: 2838, Failures: 0, Errors: 3, Skipped: 57, Flakes: 3

[INFO] ------------------------------------------------------------------------
[INFO] Reactor Summary:
[INFO] 
[INFO] Apache HBase ...................................... SUCCESS [1:45.450s]
[INFO] Apache HBase - Checkstyle ......................... SUCCESS [15.192s]
[INFO] Apache HBase - Resource Bundle .................... SUCCESS [0.182s]
[INFO] Apache HBase - Annotations ........................ SUCCESS [1.363s]
[INFO] Apache HBase - Protocol ........................... SUCCESS [18.625s]
[INFO] Apache HBase - Common ............................. SUCCESS [3:30.533s]
[INFO] Apache HBase - Procedure .......................... SUCCESS [3:44.576s]
[INFO] Apache HBase - Metrics API ........................ SUCCESS [1.382s]
[INFO] Apache HBase - Hadoop Compatibility ............... SUCCESS [12.505s]
[INFO] Apache HBase - Metrics Implementation ............. SUCCESS [6.088s]
[INFO] Apache HBase - Hadoop Two Compatibility ........... SUCCESS [22.576s]
[INFO] Apache HBase - Client ............................. SUCCESS [1:46.711s]
[INFO] Apache HBase - Prefix Tree ........................ SUCCESS [10.143s]
[INFO] Apache HBase - Server ............................. FAILURE [1:40:01.898s]
[INFO] Apache HBase - Testing Util ....................... SKIPPED
[INFO] Apache HBase - Thrift ............................. SKIPPED
[INFO] Apache HBase - Rest ............................... SKIPPED
[INFO] Apache HBase - Shell .............................. SKIPPED
[INFO] Apache HBase - Integration Tests .................. SKIPPED
[INFO] Apache HBase - Examples ........................... SKIPPED
[INFO] Apache HBase - External Block Cache ............... SKIPPED
[INFO] Apache HBase - Assembly ........................... SKIPPED
[INFO] Apache HBase - Shaded ............................. SKIPPED
[INFO] Apache HBase - Shaded - Client .................... SKIPPED
[INFO] Apache HBase - Shaded - Server .................... SKIPPED
[INFO] Apache HBase - Archetypes ......................... SKIPPED
[INFO] Apache HBase - Exemplar for hbase-client archetype  SKIPPED
[INFO] Apache HBase - Exemplar for hbase-shaded-client archetype  SKIPPED
[INFO] Apache HBase - Archetype builder .................. SKIPPED
[INFO] ------------------------------------------------------------------------
[INFO] BUILD FAILURE
[INFO] ------------------------------------------------------------------------
[INFO] Total time: 1:52:51.116s
[INFO] Finished at: Wed Aug 16 07:22:34 UTC 2017
[INFO] Final Memory: 103M/841M
[INFO] ------------------------------------------------------------------------
[ERROR] Failed to execute goal org.apache.maven.plugins:maven-surefire-plugin:2.18.1:test
(secondPartTestsExecution) on project hbase-server: ExecutionException: java.lang.RuntimeException:
There was an error in the forked process
[ERROR] java.lang.ArrayIndexOutOfBoundsException: 1
[ERROR] at org.apache.maven.surefire.common.junit4.JUnit4ProviderUtil.generateFailingTests(JUnit4ProviderUtil.java:64)
[ERROR] at org.apache.maven.surefire.junitcore.JUnitCoreProvider.invoke(JUnitCoreProvider.java:151)
[ERROR] at org.apache.maven.surefire.booter.ForkedBooter.invokeProviderInSameClassLoader(ForkedBooter.java:203)
[ERROR] at org.apache.maven.surefire.booter.ForkedBooter.runSuitesInProcess(ForkedBooter.java:155)
[ERROR] at org.apache.maven.surefire.booter.ForkedBooter.main(ForkedBooter.java:103)
[ERROR] -> [Help 1]
[ERROR] 
[ERROR] To see the full stack trace of the errors, re-run Maven with the -e switch.
[ERROR] Re-run Maven using the -X switch to enable full debug logging.
[ERROR] 
[ERROR] For more information about the errors and possible solutions, please read the following
articles:
[ERROR] [Help 1] http://cwiki.apache.org/confluence/display/MAVEN/MojoFailureException
[ERROR] 
[ERROR] After correcting the problems, you can resume the build with the command
[ERROR]   mvn <goals> -rf :hbase-server
Build step 'Invoke top-level Maven targets' marked build as failure
Performing Post build task...
Match found for :.* : True
Logical operation result is TRUE
Running script  : # Post-build task script. TODO: Check this in and have all builds reference
check-in.
pwd && ls
# NOTE!!!! The below code has been copied and pasted from ./dev-tools/run-test.sh
# Do not change here without syncing there and vice-versa.
ZOMBIE_TESTS_COUNT=`jps -v | grep surefirebooter | grep -e '-Dhbase.test' | wc -l`
if [[ $ZOMBIE_TESTS_COUNT != 0 ]] ; then
 echo "Suspicious java process found - waiting 30s to see if there are just slow to stop"
 sleep 30
 ZOMBIE_TESTS_COUNT=`jps -v | grep surefirebooter | grep -e '-Dhbase.test' | wc -l`
 if [[ $ZOMBIE_TESTS_COUNT != 0 ]] ; then
   echo " {color:red}There appear to be $ZOMBIE_TESTS_COUNT zombie tests{color}, they should
have been killed by surefire but survived"
   jps -v | grep surefirebooter | grep -e '-Dhbase.test'
   jps -v | grep surefirebooter | grep -e '-Dhbase.test' | cut -d ' ' -f 1 | xargs -n 1 jstack
   # Exit with error
   exit 1
 else
   echo "We're ok: there is no zombie test, but some tests took some time to stop"
 fi
else
  echo "We're ok: there is no zombie test"
fi
Setting JDK_1_7_LATEST__HOME=/home/jenkins/tools/java/latest1.7
Setting JDK_1_8_LATEST__HOME=/home/jenkins/tools/java/latest1.8
[30b16b4c] $ /bin/bash -xe /tmp/jenkins3136172541029330920.sh
+ pwd
<https://builds.apache.org/job/HBase-1.5/jdk=JDK_1_8,label=Hadoop&&!H13/ws/>
+ ls
bin
CHANGES.txt
conf
dev-support
extra_env_var
hbase-annotations
hbase-archetypes
hbase-assembly
hbase-checkstyle
hbase-client
hbase-common
hbase-examples
hbase-external-blockcache
hbase-hadoop2-compat
hbase-hadoop-compat
hbase-it
hbase-metrics
hbase-metrics-api
hbase-native-client
hbase-prefix-tree
hbase-procedure
hbase-protocol
hbase-resource-bundle
hbase-rest
hbase-server
hbase-shaded
hbase-shell
hbase-testing-util
hbase-thrift
LICENSE.txt
NOTICE.txt
pom.xml
README.txt
src
target
++ wc -l
++ grep -e -Dhbase.test
++ grep surefirebooter
++ jps -v
+ ZOMBIE_TESTS_COUNT=0
+ [[ 0 != 0 ]]
+ echo 'We'\''re ok: there is no zombie test'
We're ok: there is no zombie test
POST BUILD TASK : SUCCESS
END OF POST BUILD TASK : 0
Archiving artifacts
Setting JDK_1_7_LATEST__HOME=/home/jenkins/tools/java/latest1.7
Setting JDK_1_8_LATEST__HOME=/home/jenkins/tools/java/latest1.8
[Fast Archiver] No prior successful build to compare, so performing full copy of artifacts
Recording test results
Setting JDK_1_7_LATEST__HOME=/home/jenkins/tools/java/latest1.7
Setting JDK_1_8_LATEST__HOME=/home/jenkins/tools/java/latest1.8
Setting JDK_1_7_LATEST__HOME=/home/jenkins/tools/java/latest1.7
Setting JDK_1_8_LATEST__HOME=/home/jenkins/tools/java/latest1.8

Mime
View raw message