hbase-builds mailing list archives

Site index · List index
Message view « Date » · « Thread »
Top « Date » · « Thread »
From Apache Jenkins Server <jenk...@builds.apache.org>
Subject Build failed in Jenkins: HBase-1.1-JDK7 #1902
Date Thu, 17 Aug 2017 00:26:30 GMT
See <https://builds.apache.org/job/HBase-1.1-JDK7/1902/display/redirect?page=changes>

Changes:

[stack] HBASE-18125 shell disregards spaces at the end of a split key in a split

------------------------------------------
[...truncated 270.73 KB...]
Tests run: 1, Failures: 0, Errors: 0, Skipped: 0, Time elapsed: 0.943 sec - in org.apache.hadoop.hbase.zookeeper.TestZKTableStateManager
Running org.apache.hadoop.hbase.zookeeper.TestRecoverableZooKeeper
Tests run: 1, Failures: 0, Errors: 0, Skipped: 0, Time elapsed: 1.262 sec - in org.apache.hadoop.hbase.zookeeper.TestRecoverableZooKeeper
Tests run: 4, Failures: 0, Errors: 0, Skipped: 0, Time elapsed: 51.695 sec - in org.apache.hadoop.hbase.util.TestMiniClusterLoadParallel
Running org.apache.hadoop.hbase.zookeeper.TestHQuorumPeer
Tests run: 4, Failures: 0, Errors: 0, Skipped: 0, Time elapsed: 1.213 sec - in org.apache.hadoop.hbase.zookeeper.TestHQuorumPeer
Running org.apache.hadoop.hbase.zookeeper.TestZKLeaderManager
Tests run: 1, Failures: 0, Errors: 0, Skipped: 0, Time elapsed: 0.169 sec - in org.apache.hadoop.hbase.zookeeper.TestZKLeaderManager
Running org.apache.hadoop.hbase.zookeeper.TestZooKeeperACL
Tests run: 7, Failures: 0, Errors: 0, Skipped: 0, Time elapsed: 0.391 sec - in org.apache.hadoop.hbase.zookeeper.TestZooKeeperACL
Running org.apache.hadoop.hbase.zookeeper.TestZKMulti
Running org.apache.hadoop.hbase.zookeeper.TestZooKeeperNodeTracker
Tests run: 12, Failures: 0, Errors: 0, Skipped: 0, Time elapsed: 1.939 sec - in org.apache.hadoop.hbase.zookeeper.TestZKMulti
Tests run: 3, Failures: 0, Errors: 0, Skipped: 0, Time elapsed: 1.172 sec - in org.apache.hadoop.hbase.zookeeper.TestZooKeeperNodeTracker
Tests run: 6, Failures: 0, Errors: 0, Skipped: 0, Time elapsed: 24.738 sec - in org.apache.hadoop.hbase.zookeeper.lock.TestZKInterProcessReadWriteLock
Running org.apache.hadoop.hbase.TestZooKeeper
Running org.apache.hadoop.hbase.TestFullLogReconstruction
Running org.apache.hadoop.hbase.TestJMXListener
Tests run: 2, Failures: 0, Errors: 0, Skipped: 0, Time elapsed: 1.375 sec - in org.apache.hadoop.hbase.TestJMXListener
Tests run: 1, Failures: 0, Errors: 0, Skipped: 0, Time elapsed: 9.511 sec - in org.apache.hadoop.hbase.TestFullLogReconstruction
Running org.apache.hadoop.hbase.TestPartialResultsFromClientSide
Running org.apache.hadoop.hbase.TestMetaMigrationConvertingToPB
Tests run: 3, Failures: 0, Errors: 0, Skipped: 0, Time elapsed: 2.341 sec - in org.apache.hadoop.hbase.TestMetaMigrationConvertingToPB
Tests run: 7, Failures: 0, Errors: 0, Skipped: 0, Time elapsed: 356.353 sec - in org.apache.hadoop.hbase.mapred.TestTableSnapshotInputFormat
Running org.apache.hadoop.hbase.trace.TestHTraceHooks
Tests run: 1, Failures: 0, Errors: 0, Skipped: 0, Time elapsed: 2.99 sec - in org.apache.hadoop.hbase.trace.TestHTraceHooks
Tests run: 12, Failures: 0, Errors: 0, Skipped: 0, Time elapsed: 81.65 sec - in org.apache.hadoop.hbase.TestZooKeeper
Tests run: 19, Failures: 0, Errors: 0, Skipped: 0, Time elapsed: 79.091 sec - in org.apache.hadoop.hbase.TestPartialResultsFromClientSide
Tests run: 52, Failures: 0, Errors: 0, Skipped: 1, Time elapsed: 374.484 sec - in org.apache.hadoop.hbase.util.TestHBaseFsck

Results :

Tests in error: 
org.apache.hadoop.hbase.regionserver.TestCompactSplitThread.testThreadPoolSizeTuning(org.apache.hadoop.hbase.regionserver.TestCompactSplitThread)
  Run 1: TestCompactSplitThread.testThreadPoolSizeTuning:50 » IO Shutting down
  Run 2: TestCompactSplitThread.testThreadPoolSizeTuning:50 » IllegalState A mini-clust...
  Run 3: TestCompactSplitThread.testThreadPoolSizeTuning:50 » IllegalState A mini-clust...

org.apache.hadoop.hbase.regionserver.TestRegionReplicaFailover.testLotsOfRegionReplicas[0](org.apache.hadoop.hbase.regionserver.TestRegionReplicaFailover)
  Run 1: TestRegionReplicaFailover.before:115 » IllegalState A mini-cluster is already ...
  Run 2: TestRegionReplicaFailover.after:124 NullPointer
  Run 3: TestRegionReplicaFailover.before:115 » IllegalState A mini-cluster is already ...
  Run 4: TestRegionReplicaFailover.after:124 NullPointer
  Run 5: TestRegionReplicaFailover.before:115 » IllegalState A mini-cluster is already ...
  Run 6: TestRegionReplicaFailover.after:124 NullPointer

org.apache.hadoop.hbase.regionserver.TestRegionReplicaFailover.testLotsOfRegionReplicas[1](org.apache.hadoop.hbase.regionserver.TestRegionReplicaFailover)
  Run 1: TestRegionReplicaFailover.before:115 » IllegalState A mini-cluster is already ...
  Run 2: TestRegionReplicaFailover.after:124 NullPointer
  Run 3: TestRegionReplicaFailover.before:115 » IllegalState A mini-cluster is already ...
  Run 4: TestRegionReplicaFailover.after:124 NullPointer
  Run 5: TestRegionReplicaFailover.before:115 » IllegalState A mini-cluster is already ...
  Run 6: TestRegionReplicaFailover.after:124 NullPointer

org.apache.hadoop.hbase.regionserver.TestRegionReplicaFailover.testPrimaryRegionKill[0](org.apache.hadoop.hbase.regionserver.TestRegionReplicaFailover)
  Run 1: TestRegionReplicaFailover.before:115 » OutOfMemory unable to create new native...
  Run 2: TestRegionReplicaFailover.after:124 NullPointer
  Run 3: TestRegionReplicaFailover.before:115 » IllegalState A mini-cluster is already ...
  Run 4: TestRegionReplicaFailover.after:124 NullPointer
  Run 5: TestRegionReplicaFailover.before:115 » IllegalState A mini-cluster is already ...
  Run 6: TestRegionReplicaFailover.after:124 NullPointer

org.apache.hadoop.hbase.regionserver.TestRegionReplicaFailover.testPrimaryRegionKill[1](org.apache.hadoop.hbase.regionserver.TestRegionReplicaFailover)
  Run 1: TestRegionReplicaFailover.before:115 » IllegalState A mini-cluster is already ...
  Run 2: TestRegionReplicaFailover.after:124 NullPointer
  Run 3: TestRegionReplicaFailover.before:115 » IllegalState A mini-cluster is already ...
  Run 4: TestRegionReplicaFailover.after:124 NullPointer
  Run 5: TestRegionReplicaFailover.before:115 » IllegalState A mini-cluster is already ...
  Run 6: TestRegionReplicaFailover.after:124 NullPointer

org.apache.hadoop.hbase.regionserver.TestRegionReplicaFailover.testSecondaryRegionKillWhilePrimaryIsAcceptingWrites[0](org.apache.hadoop.hbase.regionserver.TestRegionReplicaFailover)
  Run 1: TestRegionReplicaFailover.before:115 » IllegalState A mini-cluster is already ...
  Run 2: TestRegionReplicaFailover.after:124 NullPointer
  Run 3: TestRegionReplicaFailover.before:115 » IllegalState A mini-cluster is already ...
  Run 4: TestRegionReplicaFailover.after:124 NullPointer
  Run 5: TestRegionReplicaFailover.before:115 » IllegalState A mini-cluster is already ...
  Run 6: TestRegionReplicaFailover.after:124 NullPointer

org.apache.hadoop.hbase.regionserver.TestRegionReplicaFailover.testSecondaryRegionKillWhilePrimaryIsAcceptingWrites[1](org.apache.hadoop.hbase.regionserver.TestRegionReplicaFailover)
  Run 1: TestRegionReplicaFailover.before:115 » IllegalState A mini-cluster is already ...
  Run 2: TestRegionReplicaFailover.after:124 NullPointer
  Run 3: TestRegionReplicaFailover.before:115 » IllegalState A mini-cluster is already ...
  Run 4: TestRegionReplicaFailover.after:124 NullPointer
  Run 5: TestRegionReplicaFailover.before:115 » IllegalState A mini-cluster is already ...
  Run 6: TestRegionReplicaFailover.after:124 NullPointer

org.apache.hadoop.hbase.regionserver.TestRegionReplicaFailover.testSecondaryRegionKill[1](org.apache.hadoop.hbase.regionserver.TestRegionReplicaFailover)
  Run 1: TestRegionReplicaFailover.before:115 » IllegalState A mini-cluster is already ...
  Run 2: TestRegionReplicaFailover.after:124 NullPointer
  Run 3: TestRegionReplicaFailover.before:115 » IllegalState A mini-cluster is already ...
  Run 4: TestRegionReplicaFailover.after:124 NullPointer
  Run 5: TestRegionReplicaFailover.before:115 » IllegalState A mini-cluster is already ...
  Run 6: TestRegionReplicaFailover.after:124 NullPointer

org.apache.hadoop.hbase.regionserver.TestRegionReplicaFailover.testSecondaryRegionWithEmptyRegion[1](org.apache.hadoop.hbase.regionserver.TestRegionReplicaFailover)
  Run 1: TestRegionReplicaFailover.before:115 » IllegalState A mini-cluster is already ...
  Run 2: TestRegionReplicaFailover.after:124 NullPointer
  Run 3: TestRegionReplicaFailover.before:115 » IllegalState A mini-cluster is already ...
  Run 4: TestRegionReplicaFailover.after:124 NullPointer
  Run 5: TestRegionReplicaFailover.before:115 » IllegalState A mini-cluster is already ...
  Run 6: TestRegionReplicaFailover.after:124 NullPointer

org.apache.hadoop.hbase.regionserver.TestRegionReplicaFailover.testSecondaryRegionWithNonEmptyRegion[1](org.apache.hadoop.hbase.regionserver.TestRegionReplicaFailover)
  Run 1: TestRegionReplicaFailover.before:115 » IllegalState A mini-cluster is already ...
  Run 2: TestRegionReplicaFailover.after:124 NullPointer
  Run 3: TestRegionReplicaFailover.before:115 » IllegalState A mini-cluster is already ...
  Run 4: TestRegionReplicaFailover.after:124 NullPointer
  Run 5: TestRegionReplicaFailover.before:115 » IllegalState A mini-cluster is already ...
  Run 6: TestRegionReplicaFailover.after:124 NullPointer

  TestRegionReplicas.before:89 » IO Shutting down
org.apache.hadoop.hbase.regionserver.TestRegionReplicas.testRefreshStoreFiles(org.apache.hadoop.hbase.regionserver.TestRegionReplicas)
  Run 1: TestRegionReplicas.testRefreshStoreFiles:242->restartRegionServer:231->before:89
» OutOfMemory
  Run 2: TestRegionReplicas.after:116 » OutOfMemory unable to create new native thread

org.apache.hadoop.hbase.regionserver.TestSplitWalDataLoss.test(org.apache.hadoop.hbase.regionserver.TestSplitWalDataLoss)
  Run 1: TestSplitWalDataLoss.setUp:79 » OutOfMemory unable to create new native thread
  Run 2: TestSplitWalDataLoss.setUp:79 » OutOfMemory unable to create new native thread
  Run 3: TestSplitWalDataLoss.setUp:79 » OutOfMemory unable to create new native thread

Flaked tests: 
org.apache.hadoop.hbase.master.TestAssignmentManager.testBalanceOnMasterFailoverScenarioWithOpenedNode(org.apache.hadoop.hbase.master.TestAssignmentManager)
  Run 1: TestAssignmentManager.testBalanceOnMasterFailoverScenarioWithOpenedNode:273 » TestTimedOut
  Run 2: PASS


Tests run: 2545, Failures: 0, Errors: 13, Skipped: 20, Flakes: 1

[INFO] ------------------------------------------------------------------------
[INFO] Reactor Summary:
[INFO] 
[INFO] Apache HBase ....................................... SUCCESS [  6.458 s]
[INFO] Apache HBase - Checkstyle .......................... SUCCESS [  0.835 s]
[INFO] Apache HBase - Resource Bundle ..................... SUCCESS [  0.261 s]
[INFO] Apache HBase - Annotations ......................... SUCCESS [  1.038 s]
[INFO] Apache HBase - Protocol ............................ SUCCESS [ 13.622 s]
[INFO] Apache HBase - Common .............................. SUCCESS [01:47 min]
[INFO] Apache HBase - Procedure ........................... SUCCESS [02:50 min]
[INFO] Apache HBase - Client .............................. SUCCESS [05:29 min]
[INFO] Apache HBase - Hadoop Compatibility ................ SUCCESS [  7.431 s]
[INFO] Apache HBase - Hadoop Two Compatibility ............ SUCCESS [  8.051 s]
[INFO] Apache HBase - Prefix Tree ......................... SUCCESS [  9.944 s]
[INFO] Apache HBase - Server .............................. FAILURE [  01:35 h]
[INFO] Apache HBase - Testing Util ........................ SKIPPED
[INFO] Apache HBase - Thrift .............................. SKIPPED
[INFO] Apache HBase - Rest ................................ SKIPPED
[INFO] Apache HBase - Shell ............................... SKIPPED
[INFO] Apache HBase - Integration Tests ................... SKIPPED
[INFO] Apache HBase - Examples ............................ SKIPPED
[INFO] Apache HBase - Assembly ............................ SKIPPED
[INFO] Apache HBase - Shaded .............................. SKIPPED
[INFO] Apache HBase - Shaded - Client ..................... SKIPPED
[INFO] Apache HBase - Shaded - Server ..................... SKIPPED
[INFO] ------------------------------------------------------------------------
[INFO] BUILD FAILURE
[INFO] ------------------------------------------------------------------------
[INFO] Total time: 01:46 h
[INFO] Finished at: 2017-08-17T00:22:26Z
[INFO] Final Memory: 57M/799M
[INFO] ------------------------------------------------------------------------
[ERROR] Failed to execute goal org.apache.maven.plugins:maven-surefire-plugin:2.18.1:test
(secondPartTestsExecution) on project hbase-server: ExecutionException: java.lang.RuntimeException:
There was an error in the forked process
[ERROR] java.lang.ArrayIndexOutOfBoundsException: 1
[ERROR] 	at org.apache.maven.surefire.common.junit4.JUnit4ProviderUtil.generateFailingTests(JUnit4ProviderUtil.java:64)
[ERROR] 	at org.apache.maven.surefire.junitcore.JUnitCoreProvider.invoke(JUnitCoreProvider.java:151)
[ERROR] 	at org.apache.maven.surefire.booter.ForkedBooter.invokeProviderInSameClassLoader(ForkedBooter.java:203)
[ERROR] 	at org.apache.maven.surefire.booter.ForkedBooter.runSuitesInProcess(ForkedBooter.java:155)
[ERROR] 	at org.apache.maven.surefire.booter.ForkedBooter.main(ForkedBooter.java:103)
[ERROR] -> [Help 1]
[ERROR] 
[ERROR] To see the full stack trace of the errors, re-run Maven with the -e switch.
[ERROR] Re-run Maven using the -X switch to enable full debug logging.
[ERROR] 
[ERROR] For more information about the errors and possible solutions, please read the following
articles:
[ERROR] [Help 1] http://cwiki.apache.org/confluence/display/MAVEN/MojoFailureException
[ERROR] 
[ERROR] After correcting the problems, you can resume the build with the command
[ERROR]   mvn <goals> -rf :hbase-server
Build step 'Invoke top-level Maven targets' marked build as failure
Performing Post build task...
Match found for :.* : True
Logical operation result is TRUE
Running script  : # Post-build task script. TODO: Check this in and have all builds reference
check-in.
pwd && ls
# NOTE!!!! The below code has been copied and pasted from ./dev-tools/run-test.sh
# Do not change here without syncing there and vice-versa.
ZOMBIE_TESTS_COUNT=`jps -v | grep surefirebooter | grep -e '-Dhbase.test' | wc -l`
if [[ $ZOMBIE_TESTS_COUNT != 0 ]] ; then
 echo "Suspicious java process found - waiting 30s to see if there are just slow to stop"
 sleep 30
 ZOMBIE_TESTS_COUNT=`jps -v | grep surefirebooter | grep -e '-Dhbase.test' | wc -l`
 if [[ $ZOMBIE_TESTS_COUNT != 0 ]] ; then
   echo " {color:red}There appear to be $ZOMBIE_TESTS_COUNT zombie tests{color}, they should
have been killed by surefire but survived"
   jps -v | grep surefirebooter | grep -e '-Dhbase.test'
   jps -v | grep surefirebooter | grep -e '-Dhbase.test' | cut -d ' ' -f 1 | xargs -n 1 jstack
   # Exit with error
   exit 1
 else
   echo "We're ok: there is no zombie test, but some tests took some time to stop"
 fi
else
  echo "We're ok: there is no zombie test"
fi
[HBase-1.1-JDK7] $ /bin/bash -xe /tmp/jenkins5935729879998605467.sh
+ pwd
<https://builds.apache.org/job/HBase-1.1-JDK7/ws/>
+ ls
bin
CHANGES.txt
conf
dev-support
hbase-annotations
hbase-assembly
hbase-checkstyle
hbase-client
hbase-common
hbase-examples
hbase-hadoop2-compat
hbase-hadoop-compat
hbase-it
hbase-native-client
hbase-prefix-tree
hbase-procedure
hbase-protocol
hbase-resource-bundle
hbase-rest
hbase-server
hbase-shaded
hbase-shell
hbase-testing-util
hbase-thrift
LICENSE.txt
NOTICE.txt
pom.xml
README.txt
src
target
++ jps -v
++ grep surefirebooter
++ grep -e -Dhbase.test
++ wc -l
+ ZOMBIE_TESTS_COUNT=0
+ [[ 0 != 0 ]]
+ echo 'We'\''re ok: there is no zombie test'
We're ok: there is no zombie test
POST BUILD TASK : SUCCESS
END OF POST BUILD TASK : 0
Archiving artifacts
Recording test results
[JIRA] Updating issue HBASE-18125

Mime
View raw message