hbase-builds mailing list archives

Site index · List index
Message view « Date » · « Thread »
Top « Date » · « Thread »
From Apache Jenkins Server <jenk...@builds.apache.org>
Subject Build failed in Jenkins: HBase-1.5 » JDK_1_7,Hadoop&&!H13 #14
Date Thu, 17 Aug 2017 13:00:05 GMT
See <https://builds.apache.org/job/HBase-1.5/jdk=JDK_1_7,label=Hadoop&&!H13/14/display/redirect?page=changes>

Changes:

[chia7712] HBASE-17617 Backport HBASE-16731 (Inconsistent results from the Get/Scan

------------------------------------------
[...truncated 2.31 MB...]
Running org.apache.hadoop.hbase.mapred.TestTableMapReduce
Running org.apache.hadoop.hbase.mapred.TestTableInputFormat
Running org.apache.hadoop.hbase.mapred.TestMultiTableSnapshotInputFormat
Tests run: 2, Failures: 0, Errors: 0, Skipped: 0, Time elapsed: 52.732 sec - in org.apache.hadoop.hbase.mapred.TestTableMapReduce
Running org.apache.hadoop.hbase.TestHColumnDescriptorDefaultVersions
Tests run: 4, Failures: 0, Errors: 0, Skipped: 0, Time elapsed: 98.789 sec - in org.apache.hadoop.hbase.mapred.TestMultiTableSnapshotInputFormat
Tests run: 4, Failures: 0, Errors: 0, Skipped: 0, Time elapsed: 47.639 sec - in org.apache.hadoop.hbase.TestHColumnDescriptorDefaultVersions
Running org.apache.hadoop.hbase.procedure.TestZKProcedureControllers
Running org.apache.hadoop.hbase.procedure.TestZKProcedure
Tests run: 4, Failures: 0, Errors: 0, Skipped: 0, Time elapsed: 5.863 sec - in org.apache.hadoop.hbase.procedure.TestZKProcedureControllers
Tests run: 4, Failures: 0, Errors: 0, Skipped: 0, Time elapsed: 6.967 sec - in org.apache.hadoop.hbase.procedure.TestZKProcedure
Running org.apache.hadoop.hbase.master.TestOpenedRegionHandler
Running org.apache.hadoop.hbase.master.TestCatalogJanitorInMemoryStates
Tests run: 8, Failures: 0, Errors: 0, Skipped: 0, Time elapsed: 153.651 sec - in org.apache.hadoop.hbase.mapred.TestTableInputFormat
Running org.apache.hadoop.hbase.master.TestMasterFailoverBalancerPersistence
Tests run: 2, Failures: 0, Errors: 0, Skipped: 0, Time elapsed: 29.285 sec - in org.apache.hadoop.hbase.master.TestOpenedRegionHandler
Running org.apache.hadoop.hbase.master.TestGetInfoPort
Tests run: 4, Failures: 0, Errors: 0, Skipped: 0, Time elapsed: 176.177 sec - in org.apache.hadoop.hbase.mapred.TestTableMapReduceUtil
Running org.apache.hadoop.hbase.master.TestMasterRestartAfterDisablingTable
Tests run: 1, Failures: 0, Errors: 0, Skipped: 0, Time elapsed: 27.081 sec - in org.apache.hadoop.hbase.master.TestCatalogJanitorInMemoryStates
Tests run: 1, Failures: 0, Errors: 0, Skipped: 0, Time elapsed: 18.948 sec - in org.apache.hadoop.hbase.master.TestGetInfoPort
Tests run: 1, Failures: 0, Errors: 0, Skipped: 0, Time elapsed: 33.402 sec - in org.apache.hadoop.hbase.master.TestMasterFailoverBalancerPersistence
Running org.apache.hadoop.hbase.master.TestMasterBalanceThrottling
Tests run: 1, Failures: 0, Errors: 0, Skipped: 0, Time elapsed: 35.449 sec - in org.apache.hadoop.hbase.master.TestMasterRestartAfterDisablingTable
Running org.apache.hadoop.hbase.master.normalizer.TestSimpleRegionNormalizerOnCluster
Running org.apache.hadoop.hbase.master.TestMasterShutdown
Running org.apache.hadoop.hbase.master.TestAssignmentListener
Tests run: 3, Failures: 0, Errors: 0, Skipped: 0, Time elapsed: 18.869 sec - in org.apache.hadoop.hbase.master.TestAssignmentListener
Running org.apache.hadoop.hbase.master.TestMasterPriorityRpc
Tests run: 3, Failures: 0, Errors: 0, Skipped: 0, Time elapsed: 5.761 sec - in org.apache.hadoop.hbase.master.TestMasterPriorityRpc
Running org.apache.hadoop.hbase.master.TestMasterStatusServlet
Tests run: 4, Failures: 0, Errors: 0, Skipped: 0, Time elapsed: 3.388 sec - in org.apache.hadoop.hbase.master.TestMasterStatusServlet
Tests run: 2, Failures: 0, Errors: 0, Skipped: 0, Time elapsed: 44.427 sec - in org.apache.hadoop.hbase.master.normalizer.TestSimpleRegionNormalizerOnCluster
Tests run: 2, Failures: 0, Errors: 0, Skipped: 0, Time elapsed: 44.015 sec - in org.apache.hadoop.hbase.master.TestMasterShutdown
Running org.apache.hadoop.hbase.master.TestAssignmentManagerOnCluster
Running org.apache.hadoop.hbase.master.procedure.TestDisableTableProcedure
Running org.apache.hadoop.hbase.master.TestDeadServer
Tests run: 4, Failures: 0, Errors: 0, Skipped: 0, Time elapsed: 2.658 sec - in org.apache.hadoop.hbase.master.TestDeadServer
Tests run: 3, Failures: 0, Errors: 0, Skipped: 0, Time elapsed: 20.975 sec - in org.apache.hadoop.hbase.master.procedure.TestDisableTableProcedure
Running org.apache.hadoop.hbase.master.procedure.TestCreateTableProcedure
Running org.apache.hadoop.hbase.master.procedure.TestProcedureAdmin
Tests run: 2, Failures: 0, Errors: 1, Skipped: 0, Time elapsed: 119.165 sec <<< FAILURE!
- in org.apache.hadoop.hbase.master.TestMasterBalanceThrottling
testThrottlingByMaxRitPercent(org.apache.hadoop.hbase.master.TestMasterBalanceThrottling)
 Time elapsed: 61.628 sec  <<< ERROR!
org.junit.runners.model.TestTimedOutException: test timed out after 60000 milliseconds
	at java.lang.Thread.sleep(Native Method)
	at org.apache.hadoop.hbase.client.HBaseAdmin$ProcedureFuture.waitProcedureResult(HBaseAdmin.java:4736)
	at org.apache.hadoop.hbase.client.HBaseAdmin$ProcedureFuture.get(HBaseAdmin.java:4665)
	at org.apache.hadoop.hbase.client.HBaseAdmin.deleteTable(HBaseAdmin.java:900)
	at org.apache.hadoop.hbase.HBaseTestingUtility.deleteTable(HBaseTestingUtility.java:1970)
	at org.apache.hadoop.hbase.master.TestMasterBalanceThrottling.testThrottlingByMaxRitPercent(TestMasterBalanceThrottling.java:105)

Tests run: 5, Failures: 0, Errors: 0, Skipped: 0, Time elapsed: 24.649 sec - in org.apache.hadoop.hbase.master.procedure.TestProcedureAdmin
Tests run: 7, Failures: 0, Errors: 0, Skipped: 0, Time elapsed: 45.691 sec - in org.apache.hadoop.hbase.master.procedure.TestCreateTableProcedure
Running org.apache.hadoop.hbase.master.procedure.TestMasterProcedureEvents
Running org.apache.hadoop.hbase.master.procedure.TestEnableTableProcedure
Running org.apache.hadoop.hbase.master.procedure.TestWALProcedureStoreOnHDFS
Tests run: 3, Failures: 0, Errors: 0, Skipped: 0, Time elapsed: 27.476 sec - in org.apache.hadoop.hbase.master.procedure.TestMasterProcedureEvents
Running org.apache.hadoop.hbase.master.procedure.TestCreateTableProcedure2
Tests run: 4, Failures: 0, Errors: 0, Skipped: 0, Time elapsed: 32.861 sec - in org.apache.hadoop.hbase.master.procedure.TestEnableTableProcedure
Tests run: 1, Failures: 0, Errors: 0, Skipped: 0, Time elapsed: 18.101 sec - in org.apache.hadoop.hbase.master.procedure.TestCreateTableProcedure2
Running org.apache.hadoop.hbase.master.procedure.TestDeleteColumnFamilyProcedureFromClient
Tests run: 3, Failures: 0, Errors: 0, Skipped: 0, Time elapsed: 52.408 sec - in org.apache.hadoop.hbase.master.procedure.TestWALProcedureStoreOnHDFS
Running org.apache.hadoop.hbase.master.procedure.TestAddColumnFamilyProcedure
Running org.apache.hadoop.hbase.master.procedure.TestModifyTableProcedure
Tests run: 2, Failures: 0, Errors: 0, Skipped: 0, Time elapsed: 40.348 sec - in org.apache.hadoop.hbase.master.procedure.TestDeleteColumnFamilyProcedureFromClient
Tests run: 5, Failures: 0, Errors: 0, Skipped: 0, Time elapsed: 37.787 sec - in org.apache.hadoop.hbase.master.procedure.TestAddColumnFamilyProcedure
Running org.apache.hadoop.hbase.master.procedure.TestDeleteTableProcedure
Tests run: 21, Failures: 0, Errors: 0, Skipped: 0, Time elapsed: 209.534 sec - in org.apache.hadoop.hbase.master.TestAssignmentManagerOnCluster
Running org.apache.hadoop.hbase.master.procedure.TestTruncateTableProcedure
Running org.apache.hadoop.hbase.master.procedure.TestDeleteColumnFamilyProcedure
Tests run: 6, Failures: 0, Errors: 0, Skipped: 0, Time elapsed: 26.972 sec - in org.apache.hadoop.hbase.master.procedure.TestDeleteTableProcedure
Tests run: 8, Failures: 0, Errors: 0, Skipped: 0, Time elapsed: 68.271 sec - in org.apache.hadoop.hbase.master.procedure.TestModifyTableProcedure
Running org.apache.hadoop.hbase.master.procedure.TestModifyNamespaceProcedure
Running org.apache.hadoop.hbase.master.procedure.TestSafemodeBringsDownMaster
Tests run: 1, Failures: 0, Errors: 0, Skipped: 0, Time elapsed: 5.863 sec - in org.apache.hadoop.hbase.master.procedure.TestSafemodeBringsDownMaster
Tests run: 6, Failures: 0, Errors: 0, Skipped: 0, Time elapsed: 10.472 sec - in org.apache.hadoop.hbase.master.procedure.TestModifyNamespaceProcedure
Tests run: 7, Failures: 0, Errors: 0, Skipped: 0, Time elapsed: 43.163 sec - in org.apache.hadoop.hbase.master.procedure.TestDeleteColumnFamilyProcedure
Running org.apache.hadoop.hbase.master.procedure.TestServerCrashProcedure
Running org.apache.hadoop.hbase.master.procedure.TestTableDescriptorModificationFromClient
Running org.apache.hadoop.hbase.master.procedure.TestCreateNamespaceProcedure

Results :

Tests in error: 
  TestAdmin2.testCreateTableRPCTimeOut:209 » TimeoutIO java.util.concurrent.Time...
  TestMasterBalanceThrottling.testThrottlingByMaxRitPercent:105 » TestTimedOut t...
Flaked tests: 
org.apache.hadoop.hbase.client.TestClientScannerRPCTimeout.testScannerNextRPCTimesout(org.apache.hadoop.hbase.client.TestClientScannerRPCTimeout)
  Run 1: TestClientScannerRPCTimeout.testScannerNextRPCTimesout:87 » TableExists testSc...
  Run 2: PASS

org.apache.hadoop.hbase.client.TestReplicasClient.testCancelOfMultiGet(org.apache.hadoop.hbase.client.TestReplicasClient)
  Run 1: TestReplicasClient.testCancelOfMultiGet:585 null
  Run 2: PASS

org.apache.hadoop.hbase.regionserver.TestPerColumnFamilyFlush.testCompareStoreFileCount(org.apache.hadoop.hbase.regionserver.TestPerColumnFamilyFlush)
  Run 1: TestPerColumnFamilyFlush.testCompareStoreFileCount:631->Object.wait:-2 » TestTimedOut
  Run 2: PASS

org.apache.hadoop.hbase.regionserver.TestPerColumnFamilyFlush.testFlushingWhenLogRolling(org.apache.hadoop.hbase.regionserver.TestPerColumnFamilyFlush)
  Run 1: TestPerColumnFamilyFlush.testFlushingWhenLogRolling:467 » IllegalState A mini-...
  Run 2: PASS


Tests run: 1838, Failures: 0, Errors: 2, Skipped: 16, Flakes: 4

[INFO] ------------------------------------------------------------------------
[INFO] Reactor Summary:
[INFO] 
[INFO] Apache HBase ...................................... SUCCESS [2:22.974s]
[INFO] Apache HBase - Checkstyle ......................... SUCCESS [21.435s]
[INFO] Apache HBase - Resource Bundle .................... SUCCESS [0.603s]
[INFO] Apache HBase - Annotations ........................ SUCCESS [2.242s]
[INFO] Apache HBase - Protocol ........................... SUCCESS [33.917s]
[INFO] Apache HBase - Common ............................. SUCCESS [4:12.549s]
[INFO] Apache HBase - Procedure .......................... SUCCESS [5:26.345s]
[INFO] Apache HBase - Metrics API ........................ SUCCESS [3.159s]
[INFO] Apache HBase - Hadoop Compatibility ............... SUCCESS [18.321s]
[INFO] Apache HBase - Metrics Implementation ............. SUCCESS [12.477s]
[INFO] Apache HBase - Hadoop Two Compatibility ........... SUCCESS [36.059s]
[INFO] Apache HBase - Client ............................. SUCCESS [2:42.951s]
[INFO] Apache HBase - Prefix Tree ........................ SUCCESS [22.483s]
[INFO] Apache HBase - Server ............................. FAILURE [2:07:32.788s]
[INFO] Apache HBase - Testing Util ....................... SKIPPED
[INFO] Apache HBase - Thrift ............................. SKIPPED
[INFO] Apache HBase - Rest ............................... SKIPPED
[INFO] Apache HBase - Shell .............................. SKIPPED
[INFO] Apache HBase - Integration Tests .................. SKIPPED
[INFO] Apache HBase - Examples ........................... SKIPPED
[INFO] Apache HBase - External Block Cache ............... SKIPPED
[INFO] Apache HBase - Assembly ........................... SKIPPED
[INFO] Apache HBase - Shaded ............................. SKIPPED
[INFO] Apache HBase - Shaded - Client .................... SKIPPED
[INFO] Apache HBase - Shaded - Server .................... SKIPPED
[INFO] Apache HBase - Archetypes ......................... SKIPPED
[INFO] Apache HBase - Exemplar for hbase-client archetype  SKIPPED
[INFO] Apache HBase - Exemplar for hbase-shaded-client archetype  SKIPPED
[INFO] Apache HBase - Archetype builder .................. SKIPPED
[INFO] ------------------------------------------------------------------------
[INFO] BUILD FAILURE
[INFO] ------------------------------------------------------------------------
[INFO] Total time: 2:25:35.198s
[INFO] Finished at: Thu Aug 17 12:58:27 UTC 2017
[INFO] Final Memory: 389M/545M
[INFO] ------------------------------------------------------------------------
[ERROR] Failed to execute goal org.apache.maven.plugins:maven-surefire-plugin:2.18.1:test
(secondPartTestsExecution) on project hbase-server: ExecutionException: java.lang.RuntimeException:
java.lang.RuntimeException: org.apache.maven.surefire.report.ReporterException: When writing
xml report stdout/stderr: /tmp/stderr2550096182256253678deferred (No such file or directory)
-> [Help 1]
[ERROR] 
[ERROR] To see the full stack trace of the errors, re-run Maven with the -e switch.
[ERROR] Re-run Maven using the -X switch to enable full debug logging.
[ERROR] 
[ERROR] For more information about the errors and possible solutions, please read the following
articles:
[ERROR] [Help 1] http://cwiki.apache.org/confluence/display/MAVEN/MojoFailureException
[ERROR] 
[ERROR] After correcting the problems, you can resume the build with the command
[ERROR]   mvn <goals> -rf :hbase-server
Build step 'Invoke top-level Maven targets' marked build as failure
Performing Post build task...
Match found for :.* : True
Logical operation result is TRUE
Running script  : # Post-build task script. TODO: Check this in and have all builds reference
check-in.
pwd && ls
# NOTE!!!! The below code has been copied and pasted from ./dev-tools/run-test.sh
# Do not change here without syncing there and vice-versa.
ZOMBIE_TESTS_COUNT=`jps -v | grep surefirebooter | grep -e '-Dhbase.test' | wc -l`
if [[ $ZOMBIE_TESTS_COUNT != 0 ]] ; then
 echo "Suspicious java process found - waiting 30s to see if there are just slow to stop"
 sleep 30
 ZOMBIE_TESTS_COUNT=`jps -v | grep surefirebooter | grep -e '-Dhbase.test' | wc -l`
 if [[ $ZOMBIE_TESTS_COUNT != 0 ]] ; then
   echo " {color:red}There appear to be $ZOMBIE_TESTS_COUNT zombie tests{color}, they should
have been killed by surefire but survived"
   jps -v | grep surefirebooter | grep -e '-Dhbase.test'
   jps -v | grep surefirebooter | grep -e '-Dhbase.test' | cut -d ' ' -f 1 | xargs -n 1 jstack
   # Exit with error
   exit 1
 else
   echo "We're ok: there is no zombie test, but some tests took some time to stop"
 fi
else
  echo "We're ok: there is no zombie test"
fi
Setting JDK_1_7_LATEST__HOME=/home/jenkins/tools/java/latest1.7
Setting JDK_1_8_LATEST__HOME=/home/jenkins/tools/java/latest1.8
[19ccb43d] $ /bin/bash -xe /tmp/jenkins79595640938638143.sh
+ pwd
<https://builds.apache.org/job/HBase-1.5/jdk=JDK_1_7,label=Hadoop&&!H13/ws/>
+ ls
bin
CHANGES.txt
conf
dev-support
extra_env_var
hbase-annotations
hbase-archetypes
hbase-assembly
hbase-checkstyle
hbase-client
hbase-common
hbase-examples
hbase-external-blockcache
hbase-hadoop2-compat
hbase-hadoop-compat
hbase-it
hbase-metrics
hbase-metrics-api
hbase-native-client
hbase-prefix-tree
hbase-procedure
hbase-protocol
hbase-resource-bundle
hbase-rest
hbase-server
hbase-shaded
hbase-shell
hbase-testing-util
hbase-thrift
LICENSE.txt
NOTICE.txt
pom.xml
README.txt
src
target
++ jps -v
++ grep surefirebooter
++ wc -l
++ grep -e -Dhbase.test
+ ZOMBIE_TESTS_COUNT=1
+ [[ 1 != 0 ]]
+ echo 'Suspicious java process found - waiting 30s to see if there are just slow to stop'
Suspicious java process found - waiting 30s to see if there are just slow to stop
+ sleep 30
++ jps -v
++ grep surefirebooter
++ grep -e -Dhbase.test
++ wc -l
+ ZOMBIE_TESTS_COUNT=0
+ [[ 0 != 0 ]]
+ echo 'We'\''re ok: there is no zombie test, but some tests took some time to stop'
We're ok: there is no zombie test, but some tests took some time to stop
POST BUILD TASK : SUCCESS
END OF POST BUILD TASK : 0
Archiving artifacts
Setting JDK_1_7_LATEST__HOME=/home/jenkins/tools/java/latest1.7
Setting JDK_1_8_LATEST__HOME=/home/jenkins/tools/java/latest1.8
[Fast Archiver] No prior successful build to compare, so performing full copy of artifacts
Recording test results
Setting JDK_1_7_LATEST__HOME=/home/jenkins/tools/java/latest1.7
Setting JDK_1_8_LATEST__HOME=/home/jenkins/tools/java/latest1.8
Setting JDK_1_7_LATEST__HOME=/home/jenkins/tools/java/latest1.7
Setting JDK_1_8_LATEST__HOME=/home/jenkins/tools/java/latest1.8

Mime
View raw message