hbase-builds mailing list archives

Site index · List index
Message view « Date » · « Thread »
Top « Date » · « Thread »
From Apache Jenkins Server <jenk...@builds.apache.org>
Subject Build failed in Jenkins: HBase-1.4 » JDK_1_7,Hadoop&&!H13 #854
Date Mon, 14 Aug 2017 18:05:23 GMT
See <https://builds.apache.org/job/HBase-1.4/jdk=JDK_1_7,label=Hadoop&&!H13/854/display/redirect?page=changes>

Changes:

[apurtell] HBASE-18387: [Thrift] Make principal configurable in DemoClient.java

[apurtell] HBASE-18469 Correct RegionServer metric of totalRequestCount

[apurtell] Revert "HBASE-18520 Add jmx value to determine true Master Start time"

[apurtell] HBASE-18520 Add jmx value to determine true Master Start time; amendment

------------------------------------------
[...truncated 2.39 MB...]
	at org.apache.hadoop.hbase.coprocessor.TestRowProcessorEndpoint.prepareTestData(TestRowProcessorEndpoint.java:139)
	at org.apache.hadoop.hbase.coprocessor.TestRowProcessorEndpoint.testMultipleRows(TestRowProcessorEndpoint.java:244)

Running org.apache.hadoop.hbase.coprocessor.TestRegionServerCoprocessorExceptionWithRemove
Running org.apache.hadoop.hbase.coprocessor.TestBigDecimalColumnInterpreter
Tests run: 38, Failures: 0, Errors: 0, Skipped: 0, Time elapsed: 4.803 sec - in org.apache.hadoop.hbase.coprocessor.TestBigDecimalColumnInterpreter
Tests run: 4, Failures: 0, Errors: 0, Skipped: 0, Time elapsed: 26.738 sec - in org.apache.hadoop.hbase.coprocessor.TestRowProcessorEndpoint
Tests run: 1, Failures: 0, Errors: 0, Skipped: 0, Time elapsed: 18.036 sec - in org.apache.hadoop.hbase.coprocessor.TestRegionServerCoprocessorExceptionWithRemove
Tests run: 9, Failures: 0, Errors: 0, Skipped: 0, Time elapsed: 338.395 sec - in org.apache.hadoop.hbase.snapshot.TestExportSnapshot
Running org.apache.hadoop.hbase.coprocessor.TestMasterObserver
Running org.apache.hadoop.hbase.TestGlobalMemStoreSize
Running org.apache.hadoop.hbase.coprocessor.TestWALObserver
Running org.apache.hadoop.hbase.coprocessor.TestCoprocessorEndpoint
Tests run: 6, Failures: 0, Errors: 0, Skipped: 0, Time elapsed: 1.939 sec - in org.apache.hadoop.hbase.coprocessor.TestCoprocessorEndpoint
Tests run: 1, Failures: 0, Errors: 0, Skipped: 0, Time elapsed: 15.028 sec - in org.apache.hadoop.hbase.TestGlobalMemStoreSize
Running org.apache.hadoop.hbase.TestStochasticBalancerJmxMetrics
Tests run: 1, Failures: 0, Errors: 0, Skipped: 1, Time elapsed: 0.001 sec - in org.apache.hadoop.hbase.TestStochasticBalancerJmxMetrics
Tests run: 7, Failures: 0, Errors: 0, Skipped: 0, Time elapsed: 8.274 sec - in org.apache.hadoop.hbase.coprocessor.TestWALObserver
Running org.apache.hadoop.hbase.TestMetaTableLocator
Tests run: 7, Failures: 0, Errors: 0, Skipped: 0, Time elapsed: 3.942 sec - in org.apache.hadoop.hbase.TestMetaTableLocator
Running org.apache.hadoop.hbase.zookeeper.TestZKTableStateManager
Running org.apache.hadoop.hbase.TestJMXListener
Tests run: 1, Failures: 0, Errors: 0, Skipped: 0, Time elapsed: 1.008 sec - in org.apache.hadoop.hbase.zookeeper.TestZKTableStateManager
Tests run: 3, Failures: 0, Errors: 0, Skipped: 0, Time elapsed: 1.034 sec - in org.apache.hadoop.hbase.TestJMXListener
Running org.apache.hadoop.hbase.zookeeper.TestZooKeeperACL
Tests run: 7, Failures: 0, Errors: 0, Skipped: 0, Time elapsed: 0.317 sec - in org.apache.hadoop.hbase.zookeeper.TestZooKeeperACL
Running org.apache.hadoop.hbase.zookeeper.TestZKMulti
Running org.apache.hadoop.hbase.zookeeper.lock.TestZKInterProcessReadWriteLock
Tests run: 12, Failures: 0, Errors: 0, Skipped: 0, Time elapsed: 1.547 sec - in org.apache.hadoop.hbase.zookeeper.TestZKMulti
Running org.apache.hadoop.hbase.zookeeper.TestZKLeaderManager
Tests run: 1, Failures: 0, Errors: 0, Skipped: 0, Time elapsed: 0.126 sec - in org.apache.hadoop.hbase.zookeeper.TestZKLeaderManager
Running org.apache.hadoop.hbase.zookeeper.TestRecoverableZooKeeper
Running org.apache.hadoop.hbase.zookeeper.TestZooKeeperNodeTracker
Tests run: 9, Failures: 0, Errors: 0, Skipped: 0, Time elapsed: 338.553 sec - in org.apache.hadoop.hbase.snapshot.TestSecureExportSnapshot
Tests run: 1, Failures: 0, Errors: 0, Skipped: 0, Time elapsed: 1.468 sec - in org.apache.hadoop.hbase.zookeeper.TestRecoverableZooKeeper
Tests run: 3, Failures: 0, Errors: 0, Skipped: 0, Time elapsed: 1.104 sec - in org.apache.hadoop.hbase.zookeeper.TestZooKeeperNodeTracker
Running org.apache.hadoop.hbase.zookeeper.TestHQuorumPeer
Running org.apache.hadoop.hbase.TestClusterBootOrder
Tests run: 4, Failures: 0, Errors: 0, Skipped: 0, Time elapsed: 1.002 sec - in org.apache.hadoop.hbase.zookeeper.TestHQuorumPeer
Tests run: 9, Failures: 0, Errors: 0, Skipped: 0, Time elapsed: 42.044 sec - in org.apache.hadoop.hbase.coprocessor.TestMasterObserver
Running org.apache.hadoop.hbase.TestPartialResultsFromClientSide
Running org.apache.hadoop.hbase.TestServerSideScanMetricsFromClientSide
Tests run: 2, Failures: 0, Errors: 0, Skipped: 0, Time elapsed: 2.417 sec - in org.apache.hadoop.hbase.TestServerSideScanMetricsFromClientSide
Tests run: 6, Failures: 0, Errors: 0, Skipped: 0, Time elapsed: 24.543 sec - in org.apache.hadoop.hbase.zookeeper.lock.TestZKInterProcessReadWriteLock
Tests run: 2, Failures: 0, Errors: 0, Skipped: 0, Time elapsed: 26.93 sec - in org.apache.hadoop.hbase.TestClusterBootOrder
Tests run: 19, Failures: 0, Errors: 0, Skipped: 0, Time elapsed: 91.662 sec - in org.apache.hadoop.hbase.TestPartialResultsFromClientSide

Results :

Failed tests: 
  TestReplicator.testReplicatorBatching:95 Waiting timed out after [60,000] msec We waited
too long for expected replication of 10 entries
  TestHBaseFsck.testCheckReplication:2456 expected:<[]> but was:<[SHOULD_NOT_BE_DEPLOYED,
SHOULD_NOT_BE_DEPLOYED]>
  TestHBaseFsck.testFixAssignmentsAndNoHdfsChecking:2135 expected:<[NOT_DEPLOYED, HOLE_IN_REGION_CHAIN]>
but was:<[NOT_DEPLOYED, SHOULD_NOT_BE_DEPLOYED, SHOULD_NOT_BE_DEPLOYED, HOLE_IN_REGION_CHAIN]>
  TestHBaseFsck.testFixAssignmentsWhenMETAinTransition:315 expected:<[]> but was:<[SHOULD_NOT_BE_DEPLOYED,
SHOULD_NOT_BE_DEPLOYED]>
  TestHBaseFsck.testFixByTable:1808 expected:<[NOT_IN_HDFS, NOT_IN_HDFS]> but was:<[NOT_IN_HDFS,
NOT_IN_HDFS, SHOULD_NOT_BE_DEPLOYED, SHOULD_NOT_BE_DEPLOYED]>
  TestHBaseFsck.testHbckAfterRegionMerge:3053 expected:<[]> but was:<[SHOULD_NOT_BE_DEPLOYED,
SHOULD_NOT_BE_DEPLOYED]>
  TestHBaseFsck.testLingeringReferenceFile:2552 expected:<[LINGERING_REFERENCE_HFILE]>
but was:<[SHOULD_NOT_BE_DEPLOYED, SHOULD_NOT_BE_DEPLOYED, LINGERING_REFERENCE_HFILE]>
  TestHBaseFsck.testMetaOffline:2933 expected:<[]> but was:<[SHOULD_NOT_BE_DEPLOYED,
SHOULD_NOT_BE_DEPLOYED]>
  TestHBaseFsck.testSidelineOverlapRegion:1206 expected:<[DUPE_STARTKEYS, DUPE_STARTKEYS,
OVERLAP_IN_REGION_CHAIN]> but was:<[SHOULD_NOT_BE_DEPLOYED, SHOULD_NOT_BE_DEPLOYED,
DUPE_STARTKEYS, DUPE_STARTKEYS, OVERLAP_IN_REGION_CHAIN]>
Tests in error: 
org.apache.hadoop.hbase.client.TestClientScannerRPCTimeout.testScannerNextRPCTimesout(org.apache.hadoop.hbase.client.TestClientScannerRPCTimeout)
  Run 1: TestClientScannerRPCTimeout.testScannerNextRPCTimesout:87 » TableExists testSc...
  Run 2: TestClientScannerRPCTimeout.testScannerNextRPCTimesout:87 » TableExists testSc...
  Run 3: TestClientScannerRPCTimeout.testScannerNextRPCTimesout:87 » TableExists testSc...

  TestSecureLoadIncrementalHFiles.setUpBeforeClass:65->TestLoadIncrementalHFiles.setupNamespace:103
» RetriesExhausted
  TestHBaseFsck.testOrphanedTableZNode:2913 » FileNotFound File does not exist: ...
  TestHBaseFsck.testSplitAndDupeRegion:453->cleanupTable:654->deleteTable:3206 » TestTimedOut
Flaked tests: 
org.apache.hadoop.hbase.client.TestReplicasClient.testCancelOfMultiGet(org.apache.hadoop.hbase.client.TestReplicasClient)
  Run 1: TestReplicasClient.testCancelOfMultiGet:585 null
  Run 2: PASS

org.apache.hadoop.hbase.coprocessor.TestRowProcessorEndpoint.testDoubleScan(org.apache.hadoop.hbase.coprocessor.TestRowProcessorEndpoint)
  Run 1: TestRowProcessorEndpoint.testDoubleScan:157->prepareTestData:139 » RetriesExhausted
  Run 2: PASS

org.apache.hadoop.hbase.coprocessor.TestRowProcessorEndpoint.testMultipleRows(org.apache.hadoop.hbase.coprocessor.TestRowProcessorEndpoint)
  Run 1: TestRowProcessorEndpoint.testMultipleRows:244->prepareTestData:139 » RetriesExhausted
  Run 2: PASS

org.apache.hadoop.hbase.coprocessor.TestRowProcessorEndpoint.testReadModifyWrite(org.apache.hadoop.hbase.coprocessor.TestRowProcessorEndpoint)
  Run 1: TestRowProcessorEndpoint.testReadModifyWrite:179->prepareTestData:139 » RetriesExhausted
  Run 2: PASS

org.apache.hadoop.hbase.coprocessor.TestRowProcessorEndpoint.testTimeout(org.apache.hadoop.hbase.coprocessor.TestRowProcessorEndpoint)
  Run 1: TestRowProcessorEndpoint.testTimeout:289->prepareTestData:139 » RetriesExhausted
  Run 2: PASS

org.apache.hadoop.hbase.mapreduce.TestSecureLoadIncrementalHFilesSplitRecovery.testGroupOrSplitFailure(org.apache.hadoop.hbase.mapreduce.TestSecureLoadIncrementalHFilesSplitRecovery)
  Run 1: TestSecureLoadIncrementalHFilesSplitRecovery>TestLoadIncrementalHFilesSplitRecovery.testGroupOrSplitFailure:462->TestLoadIncrementalHFilesSplitRecovery.setupTable:136->Object.wait:-2
» TestTimedOut
  Run 2: PASS

org.apache.hadoop.hbase.mapreduce.TestSecureLoadIncrementalHFilesSplitRecovery.testGroupOrSplitPresplit(org.apache.hadoop.hbase.mapreduce.TestSecureLoadIncrementalHFilesSplitRecovery)
  Run 1: TestSecureLoadIncrementalHFilesSplitRecovery>TestLoadIncrementalHFilesSplitRecovery.testGroupOrSplitPresplit:389->TestLoadIncrementalHFilesSplitRecovery.setupTable:136->Object.wait:-2
» TestTimedOut
  Run 2: PASS

org.apache.hadoop.hbase.mapreduce.TestSecureLoadIncrementalHFilesSplitRecovery.testGroupOrSplitWhenRegionHoleExistsInMeta(org.apache.hadoop.hbase.mapreduce.TestSecureLoadIncrementalHFilesSplitRecovery)
  Run 1: TestSecureLoadIncrementalHFilesSplitRecovery>TestLoadIncrementalHFilesSplitRecovery.testGroupOrSplitWhenRegionHoleExistsInMeta:502->TestLoadIncrementalHFilesSplitRecovery.setupTableWithSplitkeys:159->Object.wait:-2
» TestTimedOut
  Run 2: PASS

org.apache.hadoop.hbase.mapreduce.TestSecureLoadIncrementalHFilesSplitRecovery.testSplitTmpFileCleanUp(org.apache.hadoop.hbase.mapreduce.TestSecureLoadIncrementalHFilesSplitRecovery)
  Run 1: TestSecureLoadIncrementalHFilesSplitRecovery>TestLoadIncrementalHFilesSplitRecovery.testSplitTmpFileCleanUp:431->TestLoadIncrementalHFilesSplitRecovery.setupTableWithSplitkeys:159->Object.wait:-2
» TestTimedOut
  Run 2: PASS

org.apache.hadoop.hbase.mapreduce.TestSecureLoadIncrementalHFilesSplitRecovery.testSplitWhileBulkLoadPhase(org.apache.hadoop.hbase.mapreduce.TestSecureLoadIncrementalHFilesSplitRecovery)
  Run 1: TestSecureLoadIncrementalHFilesSplitRecovery>TestLoadIncrementalHFilesSplitRecovery.testSplitWhileBulkLoadPhase:346->TestLoadIncrementalHFilesSplitRecovery.setupTable:136->Object.wait:-2
» TestTimedOut
  Run 2: PASS

org.apache.hadoop.hbase.security.visibility.TestVisibilityLabelsWithSLGStack.testWithSAGStack(org.apache.hadoop.hbase.security.visibility.TestVisibilityLabelsWithSLGStack)
  Run 1: TestVisibilityLabelsWithSLGStack.testWithSAGStack:86 » RetriesExhausted Failed...
  Run 2: PASS


Tests run: 2820, Failures: 9, Errors: 4, Skipped: 57, Flakes: 11

[INFO] ------------------------------------------------------------------------
[INFO] Reactor Summary:
[INFO] 
[INFO] Apache HBase ...................................... SUCCESS [2:04.862s]
[INFO] Apache HBase - Checkstyle ......................... SUCCESS [18.860s]
[INFO] Apache HBase - Resource Bundle .................... SUCCESS [0.269s]
[INFO] Apache HBase - Annotations ........................ SUCCESS [1.453s]
[INFO] Apache HBase - Protocol ........................... SUCCESS [19.631s]
[INFO] Apache HBase - Common ............................. SUCCESS [2:54.166s]
[INFO] Apache HBase - Procedure .......................... SUCCESS [3:37.338s]
[INFO] Apache HBase - Metrics API ........................ SUCCESS [1.871s]
[INFO] Apache HBase - Hadoop Compatibility ............... SUCCESS [12.827s]
[INFO] Apache HBase - Metrics Implementation ............. SUCCESS [6.089s]
[INFO] Apache HBase - Hadoop Two Compatibility ........... SUCCESS [21.006s]
[INFO] Apache HBase - Client ............................. SUCCESS [1:48.620s]
[INFO] Apache HBase - Prefix Tree ........................ SUCCESS [9.839s]
[INFO] Apache HBase - Server ............................. FAILURE [1:47:41.436s]
[INFO] Apache HBase - Testing Util ....................... SKIPPED
[INFO] Apache HBase - Thrift ............................. SKIPPED
[INFO] Apache HBase - Rest ............................... SKIPPED
[INFO] Apache HBase - Shell .............................. SKIPPED
[INFO] Apache HBase - Integration Tests .................. SKIPPED
[INFO] Apache HBase - Examples ........................... SKIPPED
[INFO] Apache HBase - External Block Cache ............... SKIPPED
[INFO] Apache HBase - Assembly ........................... SKIPPED
[INFO] Apache HBase - Shaded ............................. SKIPPED
[INFO] Apache HBase - Shaded - Client .................... SKIPPED
[INFO] Apache HBase - Shaded - Server .................... SKIPPED
[INFO] Apache HBase - Archetypes ......................... SKIPPED
[INFO] Apache HBase - Exemplar for hbase-client archetype  SKIPPED
[INFO] Apache HBase - Exemplar for hbase-shaded-client archetype  SKIPPED
[INFO] Apache HBase - Archetype builder .................. SKIPPED
[INFO] ------------------------------------------------------------------------
[INFO] BUILD FAILURE
[INFO] ------------------------------------------------------------------------
[INFO] Total time: 2:00:15.253s
[INFO] Finished at: Mon Aug 14 17:57:56 UTC 2017
[INFO] Final Memory: 102M/1424M
[INFO] ------------------------------------------------------------------------
[ERROR] Failed to execute goal org.apache.maven.plugins:maven-surefire-plugin:2.18.1:test
(secondPartTestsExecution) on project hbase-server: ExecutionException: java.lang.RuntimeException:
java.lang.RuntimeException: org.apache.maven.surefire.report.ReporterException: When writing
xml report stdout/stderr: /tmp/stderr2254524470934880314deferred (No such file or directory)
-> [Help 1]
[ERROR] 
[ERROR] To see the full stack trace of the errors, re-run Maven with the -e switch.
[ERROR] Re-run Maven using the -X switch to enable full debug logging.
[ERROR] 
[ERROR] For more information about the errors and possible solutions, please read the following
articles:
[ERROR] [Help 1] http://cwiki.apache.org/confluence/display/MAVEN/MojoFailureException
[ERROR] 
[ERROR] After correcting the problems, you can resume the build with the command
[ERROR]   mvn <goals> -rf :hbase-server
Build step 'Invoke top-level Maven targets' marked build as failure
Performing Post build task...
Match found for :.* : True
Logical operation result is TRUE
Running script  : # Post-build task script. TODO: Check this in and have all builds reference
check-in.
pwd && ls
# NOTE!!!! The below code has been copied and pasted from ./dev-tools/run-test.sh
# Do not change here without syncing there and vice-versa.
ZOMBIE_TESTS_COUNT=`jps -v | grep surefirebooter | grep -e '-Dhbase.test' | wc -l`
if [[ $ZOMBIE_TESTS_COUNT != 0 ]] ; then
 echo "Suspicious java process found - waiting 30s to see if there are just slow to stop"
 sleep 30
 ZOMBIE_TESTS_COUNT=`jps -v | grep surefirebooter | grep -e '-Dhbase.test' | wc -l`
 if [[ $ZOMBIE_TESTS_COUNT != 0 ]] ; then
   echo " {color:red}There appear to be $ZOMBIE_TESTS_COUNT zombie tests{color}, they should
have been killed by surefire but survived"
   jps -v | grep surefirebooter | grep -e '-Dhbase.test'
   jps -v | grep surefirebooter | grep -e '-Dhbase.test' | cut -d ' ' -f 1 | xargs -n 1 jstack
   # Exit with error
   exit 1
 else
   echo "We're ok: there is no zombie test, but some tests took some time to stop"
 fi
else
  echo "We're ok: there is no zombie test"
fi
Setting JDK_1_7_LATEST__HOME=/home/jenkins/tools/java/latest1.7
Setting JDK_1_8_LATEST__HOME=/home/jenkins/tools/java/latest1.8
[19ccb43d] $ /bin/bash -xe /tmp/jenkins2449229509473136280.sh
+ pwd
<https://builds.apache.org/job/HBase-1.4/jdk=JDK_1_7,label=Hadoop&&!H13/ws/>
+ ls
bin
CHANGES.txt
conf
dev-support
extra_env_var
hbase-annotations
hbase-archetypes
hbase-assembly
hbase-checkstyle
hbase-client
hbase-common
hbase-examples
hbase-external-blockcache
hbase-hadoop2-compat
hbase-hadoop-compat
hbase-it
hbase-metrics
hbase-metrics-api
hbase-native-client
hbase-prefix-tree
hbase-procedure
hbase-protocol
hbase-resource-bundle
hbase-rest
hbase-server
hbase-shaded
hbase-shell
hbase-testing-util
hbase-thrift
LICENSE.txt
NOTICE.txt
pom.xml
README.txt
src
target
++ jps -v
++ grep surefirebooter
++ grep -e -Dhbase.test
++ wc -l
+ ZOMBIE_TESTS_COUNT=0
+ [[ 0 != 0 ]]
+ echo 'We'\''re ok: there is no zombie test'
We're ok: there is no zombie test
POST BUILD TASK : SUCCESS
END OF POST BUILD TASK : 0
Archiving artifacts
Setting JDK_1_7_LATEST__HOME=/home/jenkins/tools/java/latest1.7
Setting JDK_1_8_LATEST__HOME=/home/jenkins/tools/java/latest1.8
Recording test results
Setting JDK_1_7_LATEST__HOME=/home/jenkins/tools/java/latest1.7
Setting JDK_1_8_LATEST__HOME=/home/jenkins/tools/java/latest1.8
Setting JDK_1_7_LATEST__HOME=/home/jenkins/tools/java/latest1.7
Setting JDK_1_8_LATEST__HOME=/home/jenkins/tools/java/latest1.8

Mime
View raw message