hbase-builds mailing list archives

Site index · List index
Message view « Date » · « Thread »
Top « Date » · « Thread »
From Apache Jenkins Server <jenk...@builds.apache.org>
Subject Build failed in Jenkins: HBase-1.4 » JDK_1_7,Hadoop&&!H13 #810
Date Tue, 18 Jul 2017 18:39:27 GMT
See <https://builds.apache.org/job/HBase-1.4/jdk=JDK_1_7,label=Hadoop&&!H13/810/display/redirect?page=changes>

Changes:

[syuanjiangdev] HBASE-16488 Starting namespace and quota services in master startup

------------------------------------------
[...truncated 2.35 MB...]
Tue Jul 18 18:26:39 UTC 2017, RpcRetryingCaller{globalStartTime=1500401968363, pause=100,
retries=35}, org.apache.hadoop.hbase.MasterNotRunningException: java.io.IOException: Can't
get master address from ZooKeeper; znode data == null
Tue Jul 18 18:26:59 UTC 2017, RpcRetryingCaller{globalStartTime=1500401968363, pause=100,
retries=35}, org.apache.hadoop.hbase.MasterNotRunningException: java.io.IOException: Can't
get master address from ZooKeeper; znode data == null
Tue Jul 18 18:27:19 UTC 2017, RpcRetryingCaller{globalStartTime=1500401968363, pause=100,
retries=35}, org.apache.hadoop.hbase.MasterNotRunningException: java.io.IOException: Can't
get master address from ZooKeeper; znode data == null
Tue Jul 18 18:27:40 UTC 2017, RpcRetryingCaller{globalStartTime=1500401968363, pause=100,
retries=35}, org.apache.hadoop.hbase.MasterNotRunningException: java.io.IOException: Can't
get master address from ZooKeeper; znode data == null
Tue Jul 18 18:28:00 UTC 2017, RpcRetryingCaller{globalStartTime=1500401968363, pause=100,
retries=35}, org.apache.hadoop.hbase.MasterNotRunningException: java.io.IOException: Can't
get master address from ZooKeeper; znode data == null

	at org.apache.hadoop.hbase.zookeeper.MasterAddressTracker.getMasterAddress(MasterAddressTracker.java:154)
	at org.apache.hadoop.hbase.client.ConnectionManager$HConnectionImplementation$StubMaker.makeStubNoRetries(ConnectionManager.java:1548)
	at org.apache.hadoop.hbase.client.ConnectionManager$HConnectionImplementation$StubMaker.makeStub(ConnectionManager.java:1589)
	at org.apache.hadoop.hbase.client.ConnectionManager$HConnectionImplementation$MasterServiceStubMaker.makeStub(ConnectionManager.java:1618)
	at org.apache.hadoop.hbase.client.ConnectionManager$HConnectionImplementation.getKeepAliveMasterService(ConnectionManager.java:1775)
	at org.apache.hadoop.hbase.client.MasterCallable.prepare(MasterCallable.java:38)
	at org.apache.hadoop.hbase.client.RpcRetryingCaller.callWithRetries(RpcRetryingCaller.java:139)
	at org.apache.hadoop.hbase.client.HBaseAdmin.executeCallable(HBaseAdmin.java:4443)
	at org.apache.hadoop.hbase.client.HBaseAdmin.executeCallable(HBaseAdmin.java:4435)
	at org.apache.hadoop.hbase.client.HBaseAdmin.createTableAsyncV2(HBaseAdmin.java:754)
	at org.apache.hadoop.hbase.client.HBaseAdmin.createTable(HBaseAdmin.java:675)
	at org.apache.hadoop.hbase.client.HBaseAdmin.createTable(HBaseAdmin.java:652)
	at org.apache.hadoop.hbase.HBaseTestingUtility.createTable(HBaseTestingUtility.java:1462)
	at org.apache.hadoop.hbase.mapreduce.TableSnapshotInputFormatTestBase.createTableAndSnapshot(TableSnapshotInputFormatTestBase.java:206)
	at org.apache.hadoop.hbase.mapreduce.TestTableSnapshotInputFormat.doTestWithMapReduce(TestTableSnapshotInputFormat.java:341)
	at org.apache.hadoop.hbase.mapreduce.TestTableSnapshotInputFormat.testWithMapReduceImpl(TestTableSnapshotInputFormat.java:329)

Tests run: 1, Failures: 0, Errors: 0, Skipped: 0, Time elapsed: 680.964 sec - in org.apache.hadoop.hbase.mapreduce.TestTableSnapshotInputFormat

Results :

Tests in error: 
  TestCoprocessorEndpoint.setupBeforeClass:100 » SocketTimeout callTimeout=5000,...
org.apache.hadoop.hbase.regionserver.TestRSKilledWhenInitializing.testRSTerminationAfterRegisteringToMasterBeforeCreatingEphemeralNode(org.apache.hadoop.hbase.regionserver.TestRSKilledWhenInitializing)
  Run 1: TestRSKilledWhenInitializing.testRSTerminationAfterRegisteringToMasterBeforeCreatingEphemeralNode:142
null
  Run 2: TestRSKilledWhenInitializing.testRSTerminationAfterRegisteringToMasterBeforeCreatingEphemeralNode:115
» TestTimedOut
  Run 3: TestRSKilledWhenInitializing.testRSTerminationAfterRegisteringToMasterBeforeCreatingEphemeralNode
» 
  Run 4: TestRSKilledWhenInitializing.testRSTerminationAfterRegisteringToMasterBeforeCreatingEphemeralNode:115
» TestTimedOut
  Run 5: TestRSKilledWhenInitializing.testRSTerminationAfterRegisteringToMasterBeforeCreatingEphemeralNode
» 

  TestScannerCursor.setUpBeforeClass:93->createTestTable:99 » TableExists TestSc...
Flaked tests: 
org.apache.hadoop.hbase.client.TestReplicasClient.testCancelOfMultiGet(org.apache.hadoop.hbase.client.TestReplicasClient)
  Run 1: TestReplicasClient.testCancelOfMultiGet:585 null
  Run 2: PASS

org.apache.hadoop.hbase.mapreduce.TestTableSnapshotInputFormat.testWithMapReduceMultiRegion(org.apache.hadoop.hbase.mapreduce.TestTableSnapshotInputFormat)
  Run 1: TestTableSnapshotInputFormat>TableSnapshotInputFormatTestBase.testWithMapReduceMultiRegion:109->TableSnapshotInputFormatTestBase.testWithMapReduce:168->testWithMapReduceImpl:329->doTestWithMapReduce:341->TableSnapshotInputFormatTestBase.createTableAndSnapshot:206
» RetriesExhausted
  Run 2: PASS

org.apache.hadoop.hbase.master.TestMasterFailover.testMetaInTransitionWhenMasterFailover(org.apache.hadoop.hbase.master.TestMasterFailover)
  Run 1: TestMasterFailover.testMetaInTransitionWhenMasterFailover:1381 » IO Aborting f...
  Run 2: PASS


Tests run: 2798, Failures: 0, Errors: 3, Skipped: 55, Flakes: 3

[INFO] ------------------------------------------------------------------------
[INFO] Reactor Summary:
[INFO] 
[INFO] Apache HBase ...................................... SUCCESS [1:46.243s]
[INFO] Apache HBase - Checkstyle ......................... SUCCESS [15.361s]
[INFO] Apache HBase - Resource Bundle .................... SUCCESS [0.271s]
[INFO] Apache HBase - Annotations ........................ SUCCESS [1.369s]
[INFO] Apache HBase - Protocol ........................... SUCCESS [19.629s]
[INFO] Apache HBase - Common ............................. SUCCESS [2:49.466s]
[INFO] Apache HBase - Procedure .......................... SUCCESS [3:30.125s]
[INFO] Apache HBase - Metrics API ........................ SUCCESS [1.377s]
[INFO] Apache HBase - Hadoop Compatibility ............... SUCCESS [11.478s]
[INFO] Apache HBase - Metrics Implementation ............. SUCCESS [9.010s]
[INFO] Apache HBase - Hadoop Two Compatibility ........... SUCCESS [19.431s]
[INFO] Apache HBase - Client ............................. SUCCESS [2:00.611s]
[INFO] Apache HBase - Prefix Tree ........................ SUCCESS [9.946s]
[INFO] Apache HBase - Server ............................. FAILURE [2:05:56.512s]
[INFO] Apache HBase - Testing Util ....................... SKIPPED
[INFO] Apache HBase - Thrift ............................. SKIPPED
[INFO] Apache HBase - Rest ............................... SKIPPED
[INFO] Apache HBase - Shell .............................. SKIPPED
[INFO] Apache HBase - Integration Tests .................. SKIPPED
[INFO] Apache HBase - Examples ........................... SKIPPED
[INFO] Apache HBase - External Block Cache ............... SKIPPED
[INFO] Apache HBase - Assembly ........................... SKIPPED
[INFO] Apache HBase - Shaded ............................. SKIPPED
[INFO] Apache HBase - Shaded - Client .................... SKIPPED
[INFO] Apache HBase - Shaded - Server .................... SKIPPED
[INFO] Apache HBase - Archetypes ......................... SKIPPED
[INFO] Apache HBase - Exemplar for hbase-client archetype  SKIPPED
[INFO] Apache HBase - Exemplar for hbase-shaded-client archetype  SKIPPED
[INFO] Apache HBase - Archetype builder .................. SKIPPED
[INFO] ------------------------------------------------------------------------
[INFO] BUILD FAILURE
[INFO] ------------------------------------------------------------------------
[INFO] Total time: 2:18:03.006s
[INFO] Finished at: Tue Jul 18 18:29:25 UTC 2017
[INFO] Final Memory: 101M/722M
[INFO] ------------------------------------------------------------------------
[ERROR] Failed to execute goal org.apache.maven.plugins:maven-surefire-plugin:2.18.1:test
(secondPartTestsExecution) on project hbase-server: ExecutionException: java.lang.RuntimeException:
There was an error in the forked process
[ERROR] java.lang.ArrayIndexOutOfBoundsException: 1
[ERROR] at org.apache.maven.surefire.common.junit4.JUnit4ProviderUtil.generateFailingTests(JUnit4ProviderUtil.java:64)
[ERROR] at org.apache.maven.surefire.junitcore.JUnitCoreProvider.invoke(JUnitCoreProvider.java:151)
[ERROR] at org.apache.maven.surefire.booter.ForkedBooter.invokeProviderInSameClassLoader(ForkedBooter.java:203)
[ERROR] at org.apache.maven.surefire.booter.ForkedBooter.runSuitesInProcess(ForkedBooter.java:155)
[ERROR] at org.apache.maven.surefire.booter.ForkedBooter.main(ForkedBooter.java:103)
[ERROR] -> [Help 1]
[ERROR] 
[ERROR] To see the full stack trace of the errors, re-run Maven with the -e switch.
[ERROR] Re-run Maven using the -X switch to enable full debug logging.
[ERROR] 
[ERROR] For more information about the errors and possible solutions, please read the following
articles:
[ERROR] [Help 1] http://cwiki.apache.org/confluence/display/MAVEN/MojoFailureException
[ERROR] 
[ERROR] After correcting the problems, you can resume the build with the command
[ERROR]   mvn <goals> -rf :hbase-server
Build step 'Invoke top-level Maven targets' marked build as failure
Performing Post build task...
Match found for :.* : True
Logical operation result is TRUE
Running script  : # Post-build task script. TODO: Check this in and have all builds reference
check-in.
pwd && ls
# NOTE!!!! The below code has been copied and pasted from ./dev-tools/run-test.sh
# Do not change here without syncing there and vice-versa.
ZOMBIE_TESTS_COUNT=`jps -v | grep surefirebooter | grep -e '-Dhbase.test' | wc -l`
if [[ $ZOMBIE_TESTS_COUNT != 0 ]] ; then
 echo "Suspicious java process found - waiting 30s to see if there are just slow to stop"
 sleep 30
 ZOMBIE_TESTS_COUNT=`jps -v | grep surefirebooter | grep -e '-Dhbase.test' | wc -l`
 if [[ $ZOMBIE_TESTS_COUNT != 0 ]] ; then
   echo " {color:red}There appear to be $ZOMBIE_TESTS_COUNT zombie tests{color}, they should
have been killed by surefire but survived"
   jps -v | grep surefirebooter | grep -e '-Dhbase.test'
   jps -v | grep surefirebooter | grep -e '-Dhbase.test' | cut -d ' ' -f 1 | xargs -n 1 jstack
   # Exit with error
   exit 1
 else
   echo "We're ok: there is no zombie test, but some tests took some time to stop"
 fi
else
  echo "We're ok: there is no zombie test"
fi
Setting JDK_1_7_LATEST__HOME=/home/jenkins/tools/java/latest1.7
Setting JDK_1_8_LATEST__HOME=/home/jenkins/tools/java/latest1.8
[19ccb43d] $ /bin/bash -xe /tmp/jenkins3201429488670044672.sh
+ pwd
<https://builds.apache.org/job/HBase-1.4/jdk=JDK_1_7,label=Hadoop&&!H13/ws/>
+ ls
bin
CHANGES.txt
conf
dev-support
extra_env_var
hbase-annotations
hbase-archetypes
hbase-assembly
hbase-checkstyle
hbase-client
hbase-common
hbase-examples
hbase-external-blockcache
hbase-hadoop2-compat
hbase-hadoop-compat
hbase-it
hbase-metrics
hbase-metrics-api
hbase-native-client
hbase-prefix-tree
hbase-procedure
hbase-protocol
hbase-resource-bundle
hbase-rest
hbase-server
hbase-shaded
hbase-shell
hbase-testing-util
hbase-thrift
LICENSE.txt
NOTICE.txt
pom.xml
README.txt
src
target
++ jps -v
++ grep surefirebooter
++ grep -e -Dhbase.test
++ wc -l
+ ZOMBIE_TESTS_COUNT=0
+ [[ 0 != 0 ]]
+ echo 'We'\''re ok: there is no zombie test'
We're ok: there is no zombie test
POST BUILD TASK : SUCCESS
END OF POST BUILD TASK : 0
Archiving artifacts
Setting JDK_1_7_LATEST__HOME=/home/jenkins/tools/java/latest1.7
Setting JDK_1_8_LATEST__HOME=/home/jenkins/tools/java/latest1.8
Recording test results
Setting JDK_1_7_LATEST__HOME=/home/jenkins/tools/java/latest1.7
Setting JDK_1_8_LATEST__HOME=/home/jenkins/tools/java/latest1.8
ERROR: Step ?Publish JUnit test result report? aborted due to exception: 
java.lang.OutOfMemoryError: Java heap space
	at java.util.Arrays.copyOf(Arrays.java:3332)
	at java.lang.AbstractStringBuilder.ensureCapacityInternal(AbstractStringBuilder.java:124)
	at java.lang.AbstractStringBuilder.append(AbstractStringBuilder.java:448)
	at java.lang.StringBuffer.append(StringBuffer.java:270)
	at org.dom4j.io.SAXContentHandler.characters(SAXContentHandler.java:293)
	at com.sun.org.apache.xerces.internal.parsers.AbstractSAXParser.characters(AbstractSAXParser.java:546)
	at com.sun.org.apache.xerces.internal.impl.XMLDocumentFragmentScannerImpl.scanDocument(XMLDocumentFragmentScannerImpl.java:483)
	at com.sun.org.apache.xerces.internal.parsers.XML11Configuration.parse(XML11Configuration.java:841)
	at com.sun.org.apache.xerces.internal.parsers.XML11Configuration.parse(XML11Configuration.java:770)
	at com.sun.org.apache.xerces.internal.parsers.XMLParser.parse(XMLParser.java:141)
	at com.sun.org.apache.xerces.internal.parsers.AbstractSAXParser.parse(AbstractSAXParser.java:1213)
	at com.sun.org.apache.xerces.internal.jaxp.SAXParserImpl$JAXPSAXParser.parse(SAXParserImpl.java:643)
	at org.dom4j.io.SAXReader.read(SAXReader.java:465)
	at org.dom4j.io.SAXReader.read(SAXReader.java:264)
	at hudson.tasks.junit.SuiteResult.parse(SuiteResult.java:126)
	at hudson.tasks.junit.TestResult.parse(TestResult.java:302)
	at hudson.tasks.junit.TestResult.parsePossiblyEmpty(TestResult.java:244)
	at hudson.tasks.junit.TestResult.parse(TestResult.java:175)
	at hudson.tasks.junit.TestResult.parse(TestResult.java:154)
	at hudson.tasks.junit.TestResult.<init>(TestResult.java:126)
	at hudson.tasks.junit.JUnitParser$ParseResultCallable.invoke(JUnitParser.java:132)
	at hudson.tasks.junit.JUnitParser$ParseResultCallable.invoke(JUnitParser.java:107)
	at hudson.FilePath$FileCallableWrapper.call(FilePath.java:2739)
	at hudson.remoting.UserRequest.perform(UserRequest.java:153)
	at hudson.remoting.UserRequest.perform(UserRequest.java:50)
	at hudson.remoting.Request$2.run(Request.java:336)
	at hudson.remoting.InterceptingExecutorService$1.call(InterceptingExecutorService.java:68)
	at java.util.concurrent.FutureTask.run(FutureTask.java:266)
	at java.util.concurrent.ThreadPoolExecutor.runWorker(ThreadPoolExecutor.java:1142)
	at java.util.concurrent.ThreadPoolExecutor$Worker.run(ThreadPoolExecutor.java:617)
	at java.lang.Thread.run(Thread.java:748)
	at ......remote call to H9(Native Method)
	at hudson.remoting.Channel.attachCallSiteStackTrace(Channel.java:1545)
	at hudson.remoting.UserResponse.retrieve(UserRequest.java:253)
	at hudson.remoting.Channel.call(Channel.java:830)
Caused: java.io.IOException: Remote call on H9 failed
	at hudson.remoting.Channel.call(Channel.java:838)
	at hudson.FilePath.act(FilePath.java:986)
Caused: java.io.IOException: remote file operation failed: <https://builds.apache.org/job/HBase-1.4/jdk=JDK_1_7,label=Hadoop&&!H13/ws/>
at hudson.remoting.Channel@6340a0a0:H9
	at hudson.FilePath.act(FilePath.java:993)
	at hudson.FilePath.act(FilePath.java:975)
	at hudson.tasks.junit.JUnitParser.parseResult(JUnitParser.java:103)
	at hudson.tasks.junit.JUnitResultArchiver.parse(JUnitResultArchiver.java:128)
	at hudson.tasks.junit.JUnitResultArchiver.perform(JUnitResultArchiver.java:149)
	at hudson.tasks.BuildStepCompatibilityLayer.perform(BuildStepCompatibilityLayer.java:81)
	at hudson.tasks.BuildStepMonitor$1.perform(BuildStepMonitor.java:20)
	at hudson.model.AbstractBuild$AbstractBuildExecution.perform(AbstractBuild.java:735)
	at hudson.model.AbstractBuild$AbstractBuildExecution.performAllBuildSteps(AbstractBuild.java:676)
	at hudson.model.Build$BuildExecution.post2(Build.java:186)
	at hudson.model.AbstractBuild$AbstractBuildExecution.post(AbstractBuild.java:621)
	at hudson.model.Run.execute(Run.java:1760)
	at hudson.matrix.MatrixRun.run(MatrixRun.java:146)
	at hudson.model.ResourceController.execute(ResourceController.java:97)
	at hudson.model.Executor.run(Executor.java:405)
Setting JDK_1_7_LATEST__HOME=/home/jenkins/tools/java/latest1.7
Setting JDK_1_8_LATEST__HOME=/home/jenkins/tools/java/latest1.8

Mime
View raw message