hbase-builds mailing list archives

Site index · List index
Message view « Date » · « Thread »
Top « Date » · « Thread »
From Apache Jenkins Server <jenk...@builds.apache.org>
Subject Build failed in Jenkins: HBase-1.4 » JDK_1_8,Hadoop&&!H13 #798
Date Mon, 03 Jul 2017 05:55:03 GMT
See <https://builds.apache.org/job/HBase-1.4/jdk=JDK_1_8,label=Hadoop&&!H13/798/display/redirect?page=changes>

Changes:

[yangzhe1991] HBASE-17931 Assign system tables to servers with highest version

------------------------------------------
[...truncated 2.51 MB...]
org.apache.hadoop.hbase.master.procedure.TestCreateNamespaceProcedure.testRollbackAndDoubleExecution(org.apache.hadoop.hbase.master.procedure.TestCreateNamespaceProcedure)
  Run 1: TestCreateNamespaceProcedure.testRollbackAndDoubleExecution:219 expected a running
proc
  Run 2: PASS

org.apache.hadoop.hbase.master.procedure.TestCreateTableProcedure.testCreateExisting(org.apache.hadoop.hbase.master.procedure.TestCreateTableProcedure)
  Run 1: TestCreateTableProcedure.setup:77->resetProcExecutorTestingKillFlag:92 expected
executor to be running
  Run 2: TestCreateTableProcedure.tearDown:82->resetProcExecutorTestingKillFlag:92 expected
executor to be running
  Run 3: PASS

org.apache.hadoop.hbase.master.procedure.TestCreateTableProcedure.testRecoveryAndDoubleExecution(org.apache.hadoop.hbase.master.procedure.TestCreateTableProcedure)
  Run 1: TestCreateTableProcedure.testRecoveryAndDoubleExecution:180 expected:<true>
but was:<false>
  Run 2: TestCreateTableProcedure.tearDown:82->resetProcExecutorTestingKillFlag:92 expected
executor to be running
  Run 3: PASS

org.apache.hadoop.hbase.master.procedure.TestCreateTableProcedure.testRollbackAndDoubleExecution(org.apache.hadoop.hbase.master.procedure.TestCreateTableProcedure)
  Run 1: TestCreateTableProcedure.testRollbackAndDoubleExecution:207 expected a running proc
  Run 2: PASS

org.apache.hadoop.hbase.master.procedure.TestDeleteNamespaceProcedure.testDeleteNamespace(org.apache.hadoop.hbase.master.procedure.TestDeleteNamespaceProcedure)
  Run 1: TestDeleteNamespaceProcedure.testDeleteNamespace:92->createNamespaceForTesting:218
» IllegalArgument
  Run 2: PASS

org.apache.hadoop.hbase.master.procedure.TestDeleteNamespaceProcedure.testRecoveryAndDoubleExecution(org.apache.hadoop.hbase.master.procedure.TestDeleteNamespaceProcedure)
  Run 1: TestDeleteNamespaceProcedure.testRecoveryAndDoubleExecution:172 expected:<true>
but was:<false>
  Run 2: PASS

org.apache.hadoop.hbase.master.procedure.TestDeleteNamespaceProcedure.testRollbackAndDoubleExecution(org.apache.hadoop.hbase.master.procedure.TestDeleteNamespaceProcedure)
  Run 1: TestDeleteNamespaceProcedure.testRollbackAndDoubleExecution:198 expected a running
proc
  Run 2: PASS

org.apache.hadoop.hbase.master.procedure.TestDeleteTableProcedure.testDeleteNotDisabledTable(org.apache.hadoop.hbase.master.procedure.TestDeleteTableProcedure)
  Run 1: TestDeleteTableProcedure.setup:74 expected executor to be running
  Run 2: PASS

org.apache.hadoop.hbase.master.procedure.TestDeleteTableProcedure.testRecoveryAndDoubleExecution(org.apache.hadoop.hbase.master.procedure.TestDeleteTableProcedure)
  Run 1: TestDeleteTableProcedure.testRecoveryAndDoubleExecution:193 expected:<true>
but was:<false>
  Run 2: PASS

org.apache.hadoop.hbase.master.procedure.TestDisableTableProcedure.testRecoveryAndDoubleExecution(org.apache.hadoop.hbase.master.procedure.TestDisableTableProcedure)
  Run 1: TestDisableTableProcedure.testRecoveryAndDoubleExecution:168 expected:<true>
but was:<false>
  Run 2: TestDisableTableProcedure.tearDown:79 » RetriesExhausted Failed after attempts...
  Run 3: PASS

org.apache.hadoop.hbase.regionserver.TestScannerHeartbeatMessages.testScannerHeartbeatMessages(org.apache.hadoop.hbase.regionserver.TestScannerHeartbeatMessages)
  Run 1: TestScannerHeartbeatMessages.testScannerHeartbeatMessages:207->testImportanceOfHeartbeats:237
Heartbeats messages are disabled, an exception should be thrown. If an exception  is not thrown,
the test case is not testing the importance of heartbeat messages
  Run 2: TestScannerHeartbeatMessages.testScannerHeartbeatMessages:207->testImportanceOfHeartbeats:237
Heartbeats messages are disabled, an exception should be thrown. If an exception  is not thrown,
the test case is not testing the importance of heartbeat messages
  Run 3: PASS


Tests run: 2797, Failures: 1, Errors: 2, Skipped: 57, Flakes: 12

[INFO] ------------------------------------------------------------------------
[INFO] Reactor Summary:
[INFO] 
[INFO] Apache HBase ...................................... SUCCESS [1:42.913s]
[INFO] Apache HBase - Checkstyle ......................... SUCCESS [15.047s]
[INFO] Apache HBase - Resource Bundle .................... SUCCESS [0.389s]
[INFO] Apache HBase - Annotations ........................ SUCCESS [1.503s]
[INFO] Apache HBase - Protocol ........................... SUCCESS [18.330s]
[INFO] Apache HBase - Common ............................. SUCCESS [2:45.600s]
[INFO] Apache HBase - Procedure .......................... SUCCESS [3:46.083s]
[INFO] Apache HBase - Metrics API ........................ SUCCESS [1.385s]
[INFO] Apache HBase - Hadoop Compatibility ............... SUCCESS [11.065s]
[INFO] Apache HBase - Metrics Implementation ............. SUCCESS [5.576s]
[INFO] Apache HBase - Hadoop Two Compatibility ........... SUCCESS [19.389s]
[INFO] Apache HBase - Client ............................. SUCCESS [1:43.049s]
[INFO] Apache HBase - Prefix Tree ........................ SUCCESS [9.020s]
[INFO] Apache HBase - Server ............................. FAILURE [1:55:06.091s]
[INFO] Apache HBase - Testing Util ....................... SKIPPED
[INFO] Apache HBase - Thrift ............................. SKIPPED
[INFO] Apache HBase - Rest ............................... SKIPPED
[INFO] Apache HBase - Shell .............................. SKIPPED
[INFO] Apache HBase - Integration Tests .................. SKIPPED
[INFO] Apache HBase - Examples ........................... SKIPPED
[INFO] Apache HBase - External Block Cache ............... SKIPPED
[INFO] Apache HBase - Assembly ........................... SKIPPED
[INFO] Apache HBase - Shaded ............................. SKIPPED
[INFO] Apache HBase - Shaded - Client .................... SKIPPED
[INFO] Apache HBase - Shaded - Server .................... SKIPPED
[INFO] Apache HBase - Archetypes ......................... SKIPPED
[INFO] Apache HBase - Exemplar for hbase-client archetype  SKIPPED
[INFO] Apache HBase - Exemplar for hbase-shaded-client archetype  SKIPPED
[INFO] Apache HBase - Archetype builder .................. SKIPPED
[INFO] ------------------------------------------------------------------------
[INFO] BUILD FAILURE
[INFO] ------------------------------------------------------------------------
[INFO] Total time: 2:06:56.707s
[INFO] Finished at: Mon Jul 03 05:48:14 UTC 2017
[INFO] Final Memory: 526M/1513M
[INFO] ------------------------------------------------------------------------
[ERROR] Failed to execute goal org.apache.maven.plugins:maven-surefire-plugin:2.18.1:test
(secondPartTestsExecution) on project hbase-server: There was a timeout or other error in
the fork -> [Help 1]
[ERROR] 
[ERROR] To see the full stack trace of the errors, re-run Maven with the -e switch.
[ERROR] Re-run Maven using the -X switch to enable full debug logging.
[ERROR] 
[ERROR] For more information about the errors and possible solutions, please read the following
articles:
[ERROR] [Help 1] http://cwiki.apache.org/confluence/display/MAVEN/MojoFailureException
[ERROR] 
[ERROR] After correcting the problems, you can resume the build with the command
[ERROR]   mvn <goals> -rf :hbase-server
Build step 'Invoke top-level Maven targets' marked build as failure
Performing Post build task...
Match found for :.* : True
Logical operation result is TRUE
Running script  : # Post-build task script. TODO: Check this in and have all builds reference
check-in.
pwd && ls
# NOTE!!!! The below code has been copied and pasted from ./dev-tools/run-test.sh
# Do not change here without syncing there and vice-versa.
ZOMBIE_TESTS_COUNT=`jps -v | grep surefirebooter | grep -e '-Dhbase.test' | wc -l`
if [[ $ZOMBIE_TESTS_COUNT != 0 ]] ; then
 echo "Suspicious java process found - waiting 30s to see if there are just slow to stop"
 sleep 30
 ZOMBIE_TESTS_COUNT=`jps -v | grep surefirebooter | grep -e '-Dhbase.test' | wc -l`
 if [[ $ZOMBIE_TESTS_COUNT != 0 ]] ; then
   echo " {color:red}There appear to be $ZOMBIE_TESTS_COUNT zombie tests{color}, they should
have been killed by surefire but survived"
   jps -v | grep surefirebooter | grep -e '-Dhbase.test'
   jps -v | grep surefirebooter | grep -e '-Dhbase.test' | cut -d ' ' -f 1 | xargs -n 1 jstack
   # Exit with error
   exit 1
 else
   echo "We're ok: there is no zombie test, but some tests took some time to stop"
 fi
else
  echo "We're ok: there is no zombie test"
fi
Setting JDK_1_7_LATEST__HOME=/home/jenkins/tools/java/latest1.7
Setting JDK_1_8_LATEST__HOME=/home/jenkins/tools/java/latest1.8
[30b16b4c] $ /bin/bash -xe /tmp/hudson755839211166274546.sh
+ pwd
<https://builds.apache.org/job/HBase-1.4/jdk=JDK_1_8,label=Hadoop&&!H13/ws/>
+ ls
bin
CHANGES.txt
conf
dev-support
extra_env_var
hbase-annotations
hbase-archetypes
hbase-assembly
hbase-checkstyle
hbase-client
hbase-common
hbase-examples
hbase-external-blockcache
hbase-hadoop2-compat
hbase-hadoop-compat
hbase-it
hbase-metrics
hbase-metrics-api
hbase-native-client
hbase-prefix-tree
hbase-procedure
hbase-protocol
hbase-resource-bundle
hbase-rest
hbase-server
hbase-shaded
hbase-shell
hbase-testing-util
hbase-thrift
LICENSE.txt
NOTICE.txt
pom.xml
README.txt
src
target
++ jps -v
++ grep surefirebooter
++ grep -e -Dhbase.test
++ wc -l
+ ZOMBIE_TESTS_COUNT=4
+ [[ 4 != 0 ]]
+ echo 'Suspicious java process found - waiting 30s to see if there are just slow to stop'
Suspicious java process found - waiting 30s to see if there are just slow to stop
+ sleep 30
++ jps -v
++ grep surefirebooter
++ grep -e -Dhbase.test
++ wc -l
+ ZOMBIE_TESTS_COUNT=0
+ [[ 0 != 0 ]]
+ echo 'We'\''re ok: there is no zombie test, but some tests took some time to stop'
We're ok: there is no zombie test, but some tests took some time to stop
POST BUILD TASK : SUCCESS
END OF POST BUILD TASK : 0
Archiving artifacts
Setting JDK_1_7_LATEST__HOME=/home/jenkins/tools/java/latest1.7
Setting JDK_1_8_LATEST__HOME=/home/jenkins/tools/java/latest1.8
Recording test results
Setting JDK_1_7_LATEST__HOME=/home/jenkins/tools/java/latest1.7
Setting JDK_1_8_LATEST__HOME=/home/jenkins/tools/java/latest1.8
ERROR: Step ?Publish JUnit test result report? aborted due to exception: 
java.lang.OutOfMemoryError: Java heap space
	at com.sun.org.apache.xerces.internal.util.XMLStringBuffer.append(XMLStringBuffer.java:208)
	at com.sun.org.apache.xerces.internal.impl.XMLEntityScanner.scanData(XMLEntityScanner.java:1507)
	at com.sun.org.apache.xerces.internal.impl.XMLDocumentFragmentScannerImpl.scanCDATASection(XMLDocumentFragmentScannerImpl.java:1648)
	at com.sun.org.apache.xerces.internal.impl.XMLDocumentFragmentScannerImpl$FragmentContentDriver.next(XMLDocumentFragmentScannerImpl.java:3011)
	at com.sun.org.apache.xerces.internal.impl.XMLDocumentScannerImpl.next(XMLDocumentScannerImpl.java:606)
	at com.sun.org.apache.xerces.internal.impl.XMLNSDocumentScannerImpl.next(XMLNSDocumentScannerImpl.java:118)
	at com.sun.org.apache.xerces.internal.impl.XMLDocumentFragmentScannerImpl.scanDocument(XMLDocumentFragmentScannerImpl.java:504)
	at com.sun.org.apache.xerces.internal.parsers.XML11Configuration.parse(XML11Configuration.java:848)
	at com.sun.org.apache.xerces.internal.parsers.XML11Configuration.parse(XML11Configuration.java:777)
	at com.sun.org.apache.xerces.internal.parsers.XMLParser.parse(XMLParser.java:141)
	at com.sun.org.apache.xerces.internal.parsers.AbstractSAXParser.parse(AbstractSAXParser.java:1213)
	at com.sun.org.apache.xerces.internal.jaxp.SAXParserImpl$JAXPSAXParser.parse(SAXParserImpl.java:642)
	at org.dom4j.io.SAXReader.read(SAXReader.java:465)
	at org.dom4j.io.SAXReader.read(SAXReader.java:264)
	at hudson.tasks.junit.SuiteResult.parse(SuiteResult.java:126)
	at hudson.tasks.junit.TestResult.parse(TestResult.java:302)
	at hudson.tasks.junit.TestResult.parsePossiblyEmpty(TestResult.java:244)
	at hudson.tasks.junit.TestResult.parse(TestResult.java:175)
	at hudson.tasks.junit.TestResult.parse(TestResult.java:154)
	at hudson.tasks.junit.TestResult.<init>(TestResult.java:126)
	at hudson.tasks.junit.JUnitParser$ParseResultCallable.invoke(JUnitParser.java:132)
	at hudson.tasks.junit.JUnitParser$ParseResultCallable.invoke(JUnitParser.java:107)
	at hudson.FilePath$FileCallableWrapper.call(FilePath.java:2731)
	at hudson.remoting.UserRequest.perform(UserRequest.java:153)
	at hudson.remoting.UserRequest.perform(UserRequest.java:50)
	at hudson.remoting.Request$2.run(Request.java:336)
	at hudson.remoting.InterceptingExecutorService$1.call(InterceptingExecutorService.java:68)
	at java.util.concurrent.FutureTask.run(FutureTask.java:262)
	at java.util.concurrent.ThreadPoolExecutor.runWorker(ThreadPoolExecutor.java:1145)
	at java.util.concurrent.ThreadPoolExecutor$Worker.run(ThreadPoolExecutor.java:615)
	at java.lang.Thread.run(Thread.java:745)
	at ......remote call to H2(Native Method)
	at hudson.remoting.Channel.attachCallSiteStackTrace(Channel.java:1545)
	at hudson.remoting.UserResponse.retrieve(UserRequest.java:253)
	at hudson.remoting.Channel.call(Channel.java:830)
Caused: java.io.IOException: Remote call on H2 failed
	at hudson.remoting.Channel.call(Channel.java:838)
	at hudson.FilePath.act(FilePath.java:985)
Caused: java.io.IOException: remote file operation failed: <https://builds.apache.org/job/HBase-1.4/jdk=JDK_1_8,label=Hadoop&&!H13/ws/>
at hudson.remoting.Channel@6f6f1f10:H2
	at hudson.FilePath.act(FilePath.java:992)
	at hudson.FilePath.act(FilePath.java:974)
	at hudson.tasks.junit.JUnitParser.parseResult(JUnitParser.java:103)
	at hudson.tasks.junit.JUnitResultArchiver.parse(JUnitResultArchiver.java:128)
	at hudson.tasks.junit.JUnitResultArchiver.perform(JUnitResultArchiver.java:149)
	at hudson.tasks.BuildStepCompatibilityLayer.perform(BuildStepCompatibilityLayer.java:78)
	at hudson.tasks.BuildStepMonitor$1.perform(BuildStepMonitor.java:20)
	at hudson.model.AbstractBuild$AbstractBuildExecution.perform(AbstractBuild.java:779)
	at hudson.model.AbstractBuild$AbstractBuildExecution.performAllBuildSteps(AbstractBuild.java:720)
	at hudson.model.Build$BuildExecution.post2(Build.java:186)
	at hudson.model.AbstractBuild$AbstractBuildExecution.post(AbstractBuild.java:665)
	at hudson.model.Run.execute(Run.java:1753)
	at hudson.matrix.MatrixRun.run(MatrixRun.java:146)
	at hudson.model.ResourceController.execute(ResourceController.java:98)
	at hudson.model.Executor.run(Executor.java:405)
Setting JDK_1_7_LATEST__HOME=/home/jenkins/tools/java/latest1.7
Setting JDK_1_8_LATEST__HOME=/home/jenkins/tools/java/latest1.8

Mime
View raw message