hbase-builds mailing list archives

Site index · List index
Message view « Date » · « Thread »
Top « Date » · « Thread »
From Apache Jenkins Server <jenk...@builds.apache.org>
Subject Build failed in Jenkins: HBase-2.0 » JDK 1.8 (latest),Hadoop #158
Date Wed, 12 Jul 2017 07:42:42 GMT
See <https://builds.apache.org/job/HBase-2.0/jdk=JDK%201.8%20(latest),label=Hadoop/158/display/redirect?page=changes>

Changes:

[zghao] HBASE-18343 (addendum) Track the remaining unimplemented methods for

------------------------------------------
[...truncated 833.59 KB...]
[INFO] Building archetype jar: <https://builds.apache.org/job/HBase-2.0/jdk=JDK%201.8%20(latest),label=Hadoop/ws/hbase-archetypes/hbase-client-project/target/build-archetype/target/generated-sources/archetype/target/hbase-client-project-archetype-2.0.0-alpha-1>
[INFO] 
[INFO] --- maven-archetype-plugin:2.4:integration-test (default-integration-test) @ hbase-client-project-archetype
---
[INFO] Processing Archetype IT project: basic
[INFO] ----------------------------------------------------------------------------
[INFO] Using following parameters for creating project from Archetype: hbase-client-project-archetype:2.0.0-alpha-1
[INFO] ----------------------------------------------------------------------------
[INFO] Parameter: groupId, Value: archetype.it
[INFO] Parameter: artifactId, Value: basic
[INFO] Parameter: version, Value: 0.1-SNAPSHOT
[INFO] Parameter: package, Value: it.pkg
[INFO] Parameter: packageInPathFormat, Value: it/pkg
[INFO] Parameter: version, Value: 0.1-SNAPSHOT
[INFO] Parameter: package, Value: it.pkg
[INFO] Parameter: groupId, Value: archetype.it
[INFO] Parameter: artifactId, Value: basic
[INFO] project created from Archetype in dir: <https://builds.apache.org/job/HBase-2.0/jdk=JDK%201.8%20(latest),label=Hadoop/ws/hbase-archetypes/hbase-client-project/target/build-archetype/target/generated-sources/archetype/target/test-classes/projects/basic/project/basic>
[INFO] 
[INFO] --- maven-install-plugin:2.5.2:install (default-install) @ hbase-client-project-archetype
---
[INFO] Installing <https://builds.apache.org/job/HBase-2.0/jdk=JDK%201.8%20(latest),label=Hadoop/ws/hbase-archetypes/hbase-client-project/target/build-archetype/target/generated-sources/archetype/target/hbase-client-project-archetype-2.0.0-alpha-1.jar>
to /home/jenkins/.m2/repository/org/apache/hbase/hbase-client-project-archetype/2.0.0-alpha-1/hbase-client-project-archetype-2.0.0-alpha-1.jar
[INFO] Installing <https://builds.apache.org/job/HBase-2.0/jdk=JDK%201.8%20(latest),label=Hadoop/158/artifact/hbase-archetypes/hbase-client-project/target/build-archetype/target/generated-sources/archetype/pom.xml>
to /home/jenkins/.m2/repository/org/apache/hbase/hbase-client-project-archetype/2.0.0-alpha-1/hbase-client-project-archetype-2.0.0-alpha-1.pom
[INFO] 
[INFO] --- maven-archetype-plugin:2.4:update-local-catalog (default-update-local-catalog)
@ hbase-client-project-archetype ---
[INFO] ------------------------------------------------------------------------
[INFO] BUILD SUCCESS
[INFO] ------------------------------------------------------------------------
[INFO] Total time: 1.426s
[INFO] Finished at: Wed Jul 12 07:37:00 UTC 2017
[INFO] Final Memory: 21M/724M
[INFO] ------------------------------------------------------------------------
[INFO] Scanning for projects...
[INFO]                                                                         
[INFO] ------------------------------------------------------------------------
[INFO] Building hbase-shaded-client-project-archetype 2.0.0-alpha-1
[INFO] ------------------------------------------------------------------------
[INFO] 
[INFO] --- maven-resources-plugin:3.0.1:resources (default-resources) @ hbase-shaded-client-project-archetype
---
[INFO] Using 'UTF-8' encoding to copy filtered resources.
[INFO] Copying 6 resources
[INFO] 
[INFO] --- maven-resources-plugin:3.0.1:testResources (default-testResources) @ hbase-shaded-client-project-archetype
---
[INFO] Using 'UTF-8' encoding to copy filtered resources.
[INFO] Copying 2 resources
[INFO] 
[INFO] --- maven-archetype-plugin:2.4:jar (default-jar) @ hbase-shaded-client-project-archetype
---
[INFO] Building archetype jar: <https://builds.apache.org/job/HBase-2.0/jdk=JDK%201.8%20(latest),label=Hadoop/ws/hbase-archetypes/hbase-shaded-client-project/target/build-archetype/target/generated-sources/archetype/target/hbase-shaded-client-project-archetype-2.0.0-alpha-1>
[INFO] 
[INFO] --- maven-archetype-plugin:2.4:integration-test (default-integration-test) @ hbase-shaded-client-project-archetype
---
[INFO] Processing Archetype IT project: basic
[INFO] ----------------------------------------------------------------------------
[INFO] Using following parameters for creating project from Archetype: hbase-shaded-client-project-archetype:2.0.0-alpha-1
[INFO] ----------------------------------------------------------------------------
[INFO] Parameter: groupId, Value: archetype.it
[INFO] Parameter: artifactId, Value: basic
[INFO] Parameter: version, Value: 0.1-SNAPSHOT
[INFO] Parameter: package, Value: it.pkg
[INFO] Parameter: packageInPathFormat, Value: it/pkg
[INFO] Parameter: version, Value: 0.1-SNAPSHOT
[INFO] Parameter: package, Value: it.pkg
[INFO] Parameter: groupId, Value: archetype.it
[INFO] Parameter: artifactId, Value: basic
[INFO] project created from Archetype in dir: <https://builds.apache.org/job/HBase-2.0/jdk=JDK%201.8%20(latest),label=Hadoop/ws/hbase-archetypes/hbase-shaded-client-project/target/build-archetype/target/generated-sources/archetype/target/test-classes/projects/basic/project/basic>
[INFO] 
[INFO] --- maven-install-plugin:2.5.2:install (default-install) @ hbase-shaded-client-project-archetype
---
[INFO] Installing <https://builds.apache.org/job/HBase-2.0/jdk=JDK%201.8%20(latest),label=Hadoop/ws/hbase-archetypes/hbase-shaded-client-project/target/build-archetype/target/generated-sources/archetype/target/hbase-shaded-client-project-archetype-2.0.0-alpha-1.jar>
to /home/jenkins/.m2/repository/org/apache/hbase/hbase-shaded-client-project-archetype/2.0.0-alpha-1/hbase-shaded-client-project-archetype-2.0.0-alpha-1.jar
[INFO] Installing <https://builds.apache.org/job/HBase-2.0/jdk=JDK%201.8%20(latest),label=Hadoop/158/artifact/hbase-archetypes/hbase-shaded-client-project/target/build-archetype/target/generated-sources/archetype/pom.xml>
to /home/jenkins/.m2/repository/org/apache/hbase/hbase-shaded-client-project-archetype/2.0.0-alpha-1/hbase-shaded-client-project-archetype-2.0.0-alpha-1.pom
[INFO] 
[INFO] --- maven-archetype-plugin:2.4:update-local-catalog (default-update-local-catalog)
@ hbase-shaded-client-project-archetype ---
[INFO] ------------------------------------------------------------------------
[INFO] BUILD SUCCESS
[INFO] ------------------------------------------------------------------------
[INFO] Total time: 1.453s
[INFO] Finished at: Wed Jul 12 07:37:03 UTC 2017
[INFO] Final Memory: 21M/724M
[INFO] ------------------------------------------------------------------------
[INFO] ------------------------------------------------------------------------
[INFO] Reactor Summary:
[INFO] 
[INFO] Apache HBase ...................................... SUCCESS [2.206s]
[INFO] Apache HBase - Checkstyle ......................... SUCCESS [0.649s]
[INFO] Apache HBase - Resource Bundle .................... SUCCESS [0.227s]
[INFO] Apache HBase - Annotations ........................ SUCCESS [0.543s]
[INFO] Apache HBase - Common ............................. SUCCESS [2:00.453s]
[INFO] Apache HBase - Shaded Protocol .................... SUCCESS [1.260s]
[INFO] Apache HBase - Metrics API ........................ SUCCESS [1.645s]
[INFO] Apache HBase - Procedure .......................... SUCCESS [2:46.003s]
[INFO] Apache HBase - Hadoop Compatibility ............... SUCCESS [12.555s]
[INFO] Apache HBase - Metrics Implementation ............. SUCCESS [6.866s]
[INFO] Apache HBase - Hadoop Two Compatibility ........... SUCCESS [15.112s]
[INFO] Apache HBase - Protocol ........................... SUCCESS [0.651s]
[INFO] Apache HBase - Client ............................. SUCCESS [2:21.700s]
[INFO] Apache HBase - Prefix Tree ........................ SUCCESS [15.830s]
[INFO] Apache HBase - Server ............................. FAILURE [1:48:30.313s]
[INFO] Apache HBase - Testing Util ....................... SKIPPED
[INFO] Apache HBase - Thrift ............................. SKIPPED
[INFO] Apache HBase - RSGroup ............................ SKIPPED
[INFO] Apache HBase - Shell .............................. SKIPPED
[INFO] Apache HBase - Coprocessor Endpoint ............... SKIPPED
[INFO] Apache HBase - Integration Tests .................. SKIPPED
[INFO] Apache HBase - Examples ........................... SKIPPED
[INFO] Apache HBase - Rest ............................... SKIPPED
[INFO] Apache HBase - External Block Cache ............... SKIPPED
[INFO] Apache HBase - Spark .............................. SKIPPED
[INFO] Apache HBase - Assembly ........................... SKIPPED
[INFO] Apache HBase - Shaded ............................. SUCCESS [0.289s]
[INFO] Apache HBase - Shaded - Client .................... SUCCESS [1.380s]
[INFO] Apache HBase - Shaded - Server .................... SKIPPED
[INFO] Apache HBase - Archetypes ......................... SUCCESS [0.071s]
[INFO] Apache HBase - Exemplar for hbase-client archetype  SKIPPED
[INFO] Apache HBase - Exemplar for hbase-shaded-client archetype  SKIPPED
[INFO] Apache HBase - Archetype builder .................. SUCCESS [17.214s]
[INFO] ------------------------------------------------------------------------
[INFO] BUILD FAILURE
[INFO] ------------------------------------------------------------------------
[INFO] Total time: 1:56:56.307s
[INFO] Finished at: Wed Jul 12 07:37:03 UTC 2017
[INFO] Final Memory: 79M/3805M
[INFO] ------------------------------------------------------------------------
[ERROR] Failed to execute goal org.apache.maven.plugins:maven-surefire-plugin:2.20:test (secondPartTestsExecution)
on project hbase-server: There are test failures.
[ERROR] 
[ERROR] Please refer to <https://builds.apache.org/job/HBase-2.0/jdk=JDK%201.8%20(latest),label=Hadoop/ws/hbase-server/target/surefire-reports>
for the individual test results.
[ERROR] Please refer to dump files (if any exist) [date]-jvmRun[N].dump, [date].dumpstream
and [date]-jvmRun[N].dumpstream.
[ERROR] ExecutionException The forked VM terminated without properly saying goodbye. VM crash
or System.exit called?
[ERROR] Command was /bin/sh -c cd <https://builds.apache.org/job/HBase-2.0/jdk=JDK%201.8%20(latest),label=Hadoop/ws/hbase-server>
&& /usr/local/asfpackages/java/jdk1.8.0_131/jre/bin/java -enableassertions -Dhbase.build.id=158
-Xmx2800m -Djava.security.egd=file:/dev/./urandom -Djava.net.preferIPv4Stack=true -Djava.awt.headless=true
-jar <https://builds.apache.org/job/HBase-2.0/jdk=JDK%201.8%20(latest),label=Hadoop/ws/hbase-server/target/surefire/surefirebooter1064361958389485748.jar>
<https://builds.apache.org/job/HBase-2.0/jdk=JDK%201.8%20(latest),label=Hadoop/ws/hbase-server/target/surefire>
2017-07-12T05-40-10_879-jvmRun5 surefire7598354852517648253tmp surefire_17637209217480266659102tmp
[ERROR] Error occurred in starting fork, check output in log
[ERROR] Process Exit Code: 137
[ERROR] Crashed tests:
[ERROR] org.apache.hadoop.hbase.backup.TestRestoreBoundaryTests
[ERROR] ExecutionException The forked VM terminated without properly saying goodbye. VM crash
or System.exit called?
[ERROR] Command was /bin/sh -c cd <https://builds.apache.org/job/HBase-2.0/jdk=JDK%201.8%20(latest),label=Hadoop/ws/hbase-server>
&& /usr/local/asfpackages/java/jdk1.8.0_131/jre/bin/java -enableassertions -Dhbase.build.id=158
-Xmx2800m -Djava.security.egd=file:/dev/./urandom -Djava.net.preferIPv4Stack=true -Djava.awt.headless=true
-jar <https://builds.apache.org/job/HBase-2.0/jdk=JDK%201.8%20(latest),label=Hadoop/ws/hbase-server/target/surefire/surefirebooter1815446385642271238.jar>
<https://builds.apache.org/job/HBase-2.0/jdk=JDK%201.8%20(latest),label=Hadoop/ws/hbase-server/target/surefire>
2017-07-12T05-40-10_879-jvmRun1 surefire2445384304239561285tmp surefire_17646554239454607189940tmp
[ERROR] Error occurred in starting fork, check output in log
[ERROR] Process Exit Code: 137
[ERROR] Crashed tests:
[ERROR] org.apache.hadoop.hbase.backup.TestBackupMultipleDeletes
[ERROR] ExecutionException The forked VM terminated without properly saying goodbye. VM crash
or System.exit called?
[ERROR] Command was /bin/sh -c cd <https://builds.apache.org/job/HBase-2.0/jdk=JDK%201.8%20(latest),label=Hadoop/ws/hbase-server>
&& /usr/local/asfpackages/java/jdk1.8.0_131/jre/bin/java -enableassertions -Dhbase.build.id=158
-Xmx2800m -Djava.security.egd=file:/dev/./urandom -Djava.net.preferIPv4Stack=true -Djava.awt.headless=true
-jar <https://builds.apache.org/job/HBase-2.0/jdk=JDK%201.8%20(latest),label=Hadoop/ws/hbase-server/target/surefire/surefirebooter5896222418739501654.jar>
<https://builds.apache.org/job/HBase-2.0/jdk=JDK%201.8%20(latest),label=Hadoop/ws/hbase-server/target/surefire>
2017-07-12T05-40-10_879-jvmRun2 surefire6986723449615834888tmp surefire_17652326503879680928297tmp
[ERROR] Error occurred in starting fork, check output in log
[ERROR] Process Exit Code: 137
[ERROR] ExecutionException The forked VM terminated without properly saying goodbye. VM crash
or System.exit called?
[ERROR] Command was /bin/sh -c cd <https://builds.apache.org/job/HBase-2.0/jdk=JDK%201.8%20(latest),label=Hadoop/ws/hbase-server>
&& /usr/local/asfpackages/java/jdk1.8.0_131/jre/bin/java -enableassertions -Dhbase.build.id=158
-Xmx2800m -Djava.security.egd=file:/dev/./urandom -Djava.net.preferIPv4Stack=true -Djava.awt.headless=true
-jar <https://builds.apache.org/job/HBase-2.0/jdk=JDK%201.8%20(latest),label=Hadoop/ws/hbase-server/target/surefire/surefirebooter6504822974808147701.jar>
<https://builds.apache.org/job/HBase-2.0/jdk=JDK%201.8%20(latest),label=Hadoop/ws/hbase-server/target/surefire>
2017-07-12T05-40-10_879-jvmRun3 surefire329324084461850776tmp surefire_17664631882280496660157tmp
[ERROR] Error occurred in starting fork, check output in log
[ERROR] Process Exit Code: 137
[ERROR] Crashed tests:
[ERROR] org.apache.hadoop.hbase.backup.TestRepairAfterFailedDelete
[ERROR] ExecutionException The forked VM terminated without properly saying goodbye. VM crash
or System.exit called?
[ERROR] Command was /bin/sh -c cd <https://builds.apache.org/job/HBase-2.0/jdk=JDK%201.8%20(latest),label=Hadoop/ws/hbase-server>
&& /usr/local/asfpackages/java/jdk1.8.0_131/jre/bin/java -enableassertions -Dhbase.build.id=158
-Xmx2800m -Djava.security.egd=file:/dev/./urandom -Djava.net.preferIPv4Stack=true -Djava.awt.headless=true
-jar <https://builds.apache.org/job/HBase-2.0/jdk=JDK%201.8%20(latest),label=Hadoop/ws/hbase-server/target/surefire/surefirebooter2012983105912875946.jar>
<https://builds.apache.org/job/HBase-2.0/jdk=JDK%201.8%20(latest),label=Hadoop/ws/hbase-server/target/surefire>
2017-07-12T05-40-10_879-jvmRun4 surefire7207102001534033500tmp surefire_17683352650306313135383tmp
[ERROR] Error occurred in starting fork, check output in log
[ERROR] Process Exit Code: 137
[ERROR] Crashed tests:
[ERROR] org.apache.hadoop.hbase.backup.TestIncrementalBackupWithFailures
[ERROR] org.apache.maven.surefire.booter.SurefireBooterForkException: ExecutionException The
forked VM terminated without properly saying goodbye. VM crash or System.exit called?
[ERROR] Command was /bin/sh -c cd <https://builds.apache.org/job/HBase-2.0/jdk=JDK%201.8%20(latest),label=Hadoop/ws/hbase-server>
&& /usr/local/asfpackages/java/jdk1.8.0_131/jre/bin/java -enableassertions -Dhbase.build.id=158
-Xmx2800m -Djava.security.egd=file:/dev/./urandom -Djava.net.preferIPv4Stack=true -Djava.awt.headless=true
-jar <https://builds.apache.org/job/HBase-2.0/jdk=JDK%201.8%20(latest),label=Hadoop/ws/hbase-server/target/surefire/surefirebooter1064361958389485748.jar>
<https://builds.apache.org/job/HBase-2.0/jdk=JDK%201.8%20(latest),label=Hadoop/ws/hbase-server/target/surefire>
2017-07-12T05-40-10_879-jvmRun5 surefire7598354852517648253tmp surefire_17637209217480266659102tmp
[ERROR] Error occurred in starting fork, check output in log
[ERROR] Process Exit Code: 137
[ERROR] Crashed tests:
[ERROR] org.apache.hadoop.hbase.backup.TestRestoreBoundaryTests
[ERROR] ExecutionException The forked VM terminated without properly saying goodbye. VM crash
or System.exit called?
[ERROR] Command was /bin/sh -c cd <https://builds.apache.org/job/HBase-2.0/jdk=JDK%201.8%20(latest),label=Hadoop/ws/hbase-server>
&& /usr/local/asfpackages/java/jdk1.8.0_131/jre/bin/java -enableassertions -Dhbase.build.id=158
-Xmx2800m -Djava.security.egd=file:/dev/./urandom -Djava.net.preferIPv4Stack=true -Djava.awt.headless=true
-jar <https://builds.apache.org/job/HBase-2.0/jdk=JDK%201.8%20(latest),label=Hadoop/ws/hbase-server/target/surefire/surefirebooter1815446385642271238.jar>
<https://builds.apache.org/job/HBase-2.0/jdk=JDK%201.8%20(latest),label=Hadoop/ws/hbase-server/target/surefire>
2017-07-12T05-40-10_879-jvmRun1 surefire2445384304239561285tmp surefire_17646554239454607189940tmp
[ERROR] Error occurred in starting fork, check output in log
[ERROR] Process Exit Code: 137
[ERROR] Crashed tests:
[ERROR] org.apache.hadoop.hbase.backup.TestBackupMultipleDeletes
[ERROR] ExecutionException The forked VM terminated without properly saying goodbye. VM crash
or System.exit called?
[ERROR] Command was /bin/sh -c cd <https://builds.apache.org/job/HBase-2.0/jdk=JDK%201.8%20(latest),label=Hadoop/ws/hbase-server>
&& /usr/local/asfpackages/java/jdk1.8.0_131/jre/bin/java -enableassertions -Dhbase.build.id=158
-Xmx2800m -Djava.security.egd=file:/dev/./urandom -Djava.net.preferIPv4Stack=true -Djava.awt.headless=true
-jar <https://builds.apache.org/job/HBase-2.0/jdk=JDK%201.8%20(latest),label=Hadoop/ws/hbase-server/target/surefire/surefirebooter5896222418739501654.jar>
<https://builds.apache.org/job/HBase-2.0/jdk=JDK%201.8%20(latest),label=Hadoop/ws/hbase-server/target/surefire>
2017-07-12T05-40-10_879-jvmRun2 surefire6986723449615834888tmp surefire_17652326503879680928297tmp
[ERROR] Error occurred in starting fork, check output in log
[ERROR] Process Exit Code: 137
[ERROR] ExecutionException The forked VM terminated without properly saying goodbye. VM crash
or System.exit called?
[ERROR] Command was /bin/sh -c cd <https://builds.apache.org/job/HBase-2.0/jdk=JDK%201.8%20(latest),label=Hadoop/ws/hbase-server>
&& /usr/local/asfpackages/java/jdk1.8.0_131/jre/bin/java -enableassertions -Dhbase.build.id=158
-Xmx2800m -Djava.security.egd=file:/dev/./urandom -Djava.net.preferIPv4Stack=true -Djava.awt.headless=true
-jar <https://builds.apache.org/job/HBase-2.0/jdk=JDK%201.8%20(latest),label=Hadoop/ws/hbase-server/target/surefire/surefirebooter6504822974808147701.jar>
<https://builds.apache.org/job/HBase-2.0/jdk=JDK%201.8%20(latest),label=Hadoop/ws/hbase-server/target/surefire>
2017-07-12T05-40-10_879-jvmRun3 surefire329324084461850776tmp surefire_17664631882280496660157tmp
[ERROR] Error occurred in starting fork, check output in log
[ERROR] Process Exit Code: 137
[ERROR] Crashed tests:
[ERROR] org.apache.hadoop.hbase.backup.TestRepairAfterFailedDelete
[ERROR] ExecutionException The forked VM terminated without properly saying goodbye. VM crash
or System.exit called?
[ERROR] Command was /bin/sh -c cd <https://builds.apache.org/job/HBase-2.0/jdk=JDK%201.8%20(latest),label=Hadoop/ws/hbase-server>
&& /usr/local/asfpackages/java/jdk1.8.0_131/jre/bin/java -enableassertions -Dhbase.build.id=158
-Xmx2800m -Djava.security.egd=file:/dev/./urandom -Djava.net.preferIPv4Stack=true -Djava.awt.headless=true
-jar <https://builds.apache.org/job/HBase-2.0/jdk=JDK%201.8%20(latest),label=Hadoop/ws/hbase-server/target/surefire/surefirebooter2012983105912875946.jar>
<https://builds.apache.org/job/HBase-2.0/jdk=JDK%201.8%20(latest),label=Hadoop/ws/hbase-server/target/surefire>
2017-07-12T05-40-10_879-jvmRun4 surefire7207102001534033500tmp surefire_17683352650306313135383tmp
[ERROR] Error occurred in starting fork, check output in log
[ERROR] Process Exit Code: 137
[ERROR] Crashed tests:
[ERROR] org.apache.hadoop.hbase.backup.TestIncrementalBackupWithFailures
[ERROR] at org.apache.maven.plugin.surefire.booterclient.ForkStarter.awaitResultsDone(ForkStarter.java:494)
[ERROR] at org.apache.maven.plugin.surefire.booterclient.ForkStarter.runSuitesForkPerTestSet(ForkStarter.java:441)
[ERROR] at org.apache.maven.plugin.surefire.booterclient.ForkStarter.run(ForkStarter.java:292)
[ERROR] at org.apache.maven.plugin.surefire.booterclient.ForkStarter.run(ForkStarter.java:243)
[ERROR] at org.apache.maven.plugin.surefire.AbstractSurefireMojo.executeProvider(AbstractSurefireMojo.java:1077)
[ERROR] at org.apache.maven.plugin.surefire.AbstractSurefireMojo.executeAfterPreconditionsChecked(AbstractSurefireMojo.java:907)
[ERROR] at org.apache.maven.plugin.surefire.AbstractSurefireMojo.execute(AbstractSurefireMojo.java:785)
[ERROR] at org.apache.maven.plugin.DefaultBuildPluginManager.executeMojo(DefaultBuildPluginManager.java:101)
[ERROR] at org.apache.maven.lifecycle.internal.MojoExecutor.execute(MojoExecutor.java:209)
[ERROR] at org.apache.maven.lifecycle.internal.MojoExecutor.execute(MojoExecutor.java:153)
[ERROR] at org.apache.maven.lifecycle.internal.MojoExecutor.execute(MojoExecutor.java:145)
[ERROR] at org.apache.maven.lifecycle.internal.LifecycleModuleBuilder.buildProject(LifecycleModuleBuilder.java:84)
[ERROR] at org.apache.maven.lifecycle.internal.LifecycleModuleBuilder.buildProject(LifecycleModuleBuilder.java:59)
[ERROR] at org.apache.maven.lifecycle.internal.LifecycleStarter.singleThreadedBuild(LifecycleStarter.java:183)
[ERROR] at org.apache.maven.lifecycle.internal.LifecycleStarter.execute(LifecycleStarter.java:161)
[ERROR] at org.apache.maven.DefaultMaven.doExecute(DefaultMaven.java:320)
[ERROR] at org.apache.maven.DefaultMaven.execute(DefaultMaven.java:156)
[ERROR] at org.apache.maven.cli.MavenCli.execute(MavenCli.java:537)
[ERROR] at org.apache.maven.cli.MavenCli.doMain(MavenCli.java:196)
[ERROR] at org.apache.maven.cli.MavenCli.main(MavenCli.java:141)
[ERROR] at sun.reflect.NativeMethodAccessorImpl.invoke0(Native Method)
[ERROR] at sun.reflect.NativeMethodAccessorImpl.invoke(NativeMethodAccessorImpl.java:62)
[ERROR] at sun.reflect.DelegatingMethodAccessorImpl.invoke(DelegatingMethodAccessorImpl.java:43)
[ERROR] at java.lang.reflect.Method.invoke(Method.java:498)
[ERROR] at org.codehaus.plexus.classworlds.launcher.Launcher.launchEnhanced(Launcher.java:290)
[ERROR] at org.codehaus.plexus.classworlds.launcher.Launcher.launch(Launcher.java:230)
[ERROR] at org.codehaus.plexus.classworlds.launcher.Launcher.mainWithExitCode(Launcher.java:409)
[ERROR] at org.codehaus.plexus.classworlds.launcher.Launcher.main(Launcher.java:352)
[ERROR] Caused by: org.apache.maven.surefire.booter.SurefireBooterForkException: The forked
VM terminated without properly saying goodbye. VM crash or System.exit called?
[ERROR] Command was /bin/sh -c cd <https://builds.apache.org/job/HBase-2.0/jdk=JDK%201.8%20(latest),label=Hadoop/ws/hbase-server>
&& /usr/local/asfpackages/java/jdk1.8.0_131/jre/bin/java -enableassertions -Dhbase.build.id=158
-Xmx2800m -Djava.security.egd=file:/dev/./urandom -Djava.net.preferIPv4Stack=true -Djava.awt.headless=true
-jar <https://builds.apache.org/job/HBase-2.0/jdk=JDK%201.8%20(latest),label=Hadoop/ws/hbase-server/target/surefire/surefirebooter2012983105912875946.jar>
<https://builds.apache.org/job/HBase-2.0/jdk=JDK%201.8%20(latest),label=Hadoop/ws/hbase-server/target/surefire>
2017-07-12T05-40-10_879-jvmRun4 surefire7207102001534033500tmp surefire_17683352650306313135383tmp
[ERROR] Error occurred in starting fork, check output in log
[ERROR] Process Exit Code: 137
[ERROR] Crashed tests:
[ERROR] org.apache.hadoop.hbase.backup.TestIncrementalBackupWithFailures
[ERROR] at org.apache.maven.plugin.surefire.booterclient.ForkStarter.fork(ForkStarter.java:679)
[ERROR] at org.apache.maven.plugin.surefire.booterclient.ForkStarter.fork(ForkStarter.java:533)
[ERROR] at org.apache.maven.plugin.surefire.booterclient.ForkStarter.access$600(ForkStarter.java:117)
[ERROR] at org.apache.maven.plugin.surefire.booterclient.ForkStarter$2.call(ForkStarter.java:429)
[ERROR] at org.apache.maven.plugin.surefire.booterclient.ForkStarter$2.call(ForkStarter.java:406)
[ERROR] at java.util.concurrent.FutureTask.run(FutureTask.java:266)
[ERROR] at java.util.concurrent.ThreadPoolExecutor.runWorker(ThreadPoolExecutor.java:1142)
[ERROR] at java.util.concurrent.ThreadPoolExecutor$Worker.run(ThreadPoolExecutor.java:617)
[ERROR] at java.lang.Thread.run(Thread.java:748)
[ERROR] -> [Help 1]
[ERROR] 
[ERROR] To see the full stack trace of the errors, re-run Maven with the -e switch.
[ERROR] Re-run Maven using the -X switch to enable full debug logging.
[ERROR] 
[ERROR] For more information about the errors and possible solutions, please read the following
articles:
[ERROR] [Help 1] http://cwiki.apache.org/confluence/display/MAVEN/MojoExecutionException
[ERROR] 
[ERROR] After correcting the problems, you can resume the build with the command
[ERROR]   mvn <goals> -rf :hbase-server
Build step 'Invoke top-level Maven targets' marked build as failure
Performing Post build task...
Match found for :.* : True
Logical operation result is TRUE
Running script  : # Run zombie detector script
./dev-support/zombie-detector.sh --jenkins ${BUILD_ID}
[a3159d73] $ /bin/bash -xe /tmp/hudson4850115845384039601.sh
+ ./dev-support/zombie-detector.sh --jenkins 158
Wed Jul 12 07:37:04 UTC 2017 We're ok: there is no zombie test


    {color:green}+1 zombies{color}. No zombie tests found running at the end of the build.
POST BUILD TASK : SUCCESS
END OF POST BUILD TASK : 0
Archiving artifacts
Recording test results
[FINDBUGS] Skipping publisher since build result is FAILURE
[CHECKSTYLE] Skipping publisher since build result is FAILURE

Mime
View raw message