hbase-builds mailing list archives

Site index · List index
Message view « Date » · « Thread »
Top « Date » · « Thread »
From Apache Jenkins Server <jenk...@builds.apache.org>
Subject Build failed in Jenkins: HBase-1.4 » JDK_1_7,Hadoop&&!H13 #819
Date Wed, 26 Jul 2017 04:51:32 GMT
See <https://builds.apache.org/job/HBase-1.4/jdk=JDK_1_7,label=Hadoop&&!H13/819/display/redirect?page=changes>

Changes:

[apurtell] HBASE-18054 log when we add/remove failed servers in client (Ali)

------------------------------------------
[...truncated 3.47 MB...]
	at org.mortbay.io.nio.SelectorManager.doSelect(SelectorManager.java:192)
	at org.mortbay.jetty.nio.SelectChannelConnector.accept(SelectChannelConnector.java:124)
	at org.mortbay.jetty.AbstractConnector$Acceptor.run(AbstractConnector.java:708)
	at org.mortbay.thread.QueuedThreadPool$PoolThread.run(QueuedThreadPool.java:582)

"187457031@qtp-691098155-0" #28 daemon prio=5 os_prio=0 tid=0x00007f015ccc5800 nid=0x6c24
in Object.wait() [0x00007f011644b000]
   java.lang.Thread.State: TIMED_WAITING (on object monitor)
	at java.lang.Object.wait(Native Method)
	- waiting on <0x00000007173e1f70> (a org.mortbay.thread.QueuedThreadPool$PoolThread)
	at org.mortbay.thread.QueuedThreadPool$PoolThread.run(QueuedThreadPool.java:626)
	- locked <0x00000007173e1f70> (a org.mortbay.thread.QueuedThreadPool$PoolThread)

"process reaper" #18 daemon prio=10 os_prio=0 tid=0x00007f015ccb6000 nid=0x6aef waiting on
condition [0x00007f0116f71000]
   java.lang.Thread.State: TIMED_WAITING (parking)
	at sun.misc.Unsafe.park(Native Method)
	- parking to wait for  <0x0000000711036578> (a java.util.concurrent.SynchronousQueue$TransferStack)
	at java.util.concurrent.locks.LockSupport.parkNanos(LockSupport.java:215)
	at java.util.concurrent.SynchronousQueue$TransferStack.awaitFulfill(SynchronousQueue.java:460)
	at java.util.concurrent.SynchronousQueue$TransferStack.transfer(SynchronousQueue.java:362)
	at java.util.concurrent.SynchronousQueue.poll(SynchronousQueue.java:941)
	at java.util.concurrent.ThreadPoolExecutor.getTask(ThreadPoolExecutor.java:1066)
	at java.util.concurrent.ThreadPoolExecutor.runWorker(ThreadPoolExecutor.java:1127)
	at java.util.concurrent.ThreadPoolExecutor$Worker.run(ThreadPoolExecutor.java:617)
	at java.lang.Thread.run(Thread.java:748)

"Service Thread" #17 daemon prio=9 os_prio=0 tid=0x00007f015c2db800 nid=0x6aa7 runnable [0x0000000000000000]
   java.lang.Thread.State: RUNNABLE

"C1 CompilerThread11" #16 daemon prio=9 os_prio=0 tid=0x00007f015c2d0800 nid=0x6aa6 waiting
on condition [0x0000000000000000]
   java.lang.Thread.State: RUNNABLE

"C1 CompilerThread10" #15 daemon prio=9 os_prio=0 tid=0x00007f015c2ce800 nid=0x6aa5 runnable
[0x0000000000000000]
   java.lang.Thread.State: RUNNABLE

"C1 CompilerThread9" #14 daemon prio=9 os_prio=0 tid=0x00007f015c2cc800 nid=0x6aa4 waiting
on condition [0x0000000000000000]
   java.lang.Thread.State: RUNNABLE

"C1 CompilerThread8" #13 daemon prio=9 os_prio=0 tid=0x00007f015c2ca800 nid=0x6aa3 runnable
[0x0000000000000000]
   java.lang.Thread.State: RUNNABLE

"C2 CompilerThread7" #12 daemon prio=9 os_prio=0 tid=0x00007f015c2c8000 nid=0x6aa2 waiting
on condition [0x0000000000000000]
   java.lang.Thread.State: RUNNABLE

"C2 CompilerThread6" #11 daemon prio=9 os_prio=0 tid=0x00007f015c2c6000 nid=0x6aa1 runnable
[0x0000000000000000]
   java.lang.Thread.State: RUNNABLE

"C2 CompilerThread5" #10 daemon prio=9 os_prio=0 tid=0x00007f015c2c4000 nid=0x6aa0 waiting
on condition [0x0000000000000000]
   java.lang.Thread.State: RUNNABLE

"C2 CompilerThread4" #9 daemon prio=9 os_prio=0 tid=0x00007f015c2b9800 nid=0x6a9f waiting
on condition [0x0000000000000000]
   java.lang.Thread.State: RUNNABLE

"C2 CompilerThread3" #8 daemon prio=9 os_prio=0 tid=0x00007f015c2b7800 nid=0x6a9e runnable
[0x0000000000000000]
   java.lang.Thread.State: RUNNABLE

"C2 CompilerThread2" #7 daemon prio=9 os_prio=0 tid=0x00007f015c2b5800 nid=0x6a9d waiting
on condition [0x0000000000000000]
   java.lang.Thread.State: RUNNABLE

"C2 CompilerThread1" #6 daemon prio=9 os_prio=0 tid=0x00007f015c2b3800 nid=0x6a9c waiting
on condition [0x0000000000000000]
   java.lang.Thread.State: RUNNABLE

"C2 CompilerThread0" #5 daemon prio=9 os_prio=0 tid=0x00007f015c2b0800 nid=0x6a9b waiting
on condition [0x0000000000000000]
   java.lang.Thread.State: RUNNABLE

"Signal Dispatcher" #4 daemon prio=9 os_prio=0 tid=0x00007f015c2af800 nid=0x6a9a runnable
[0x0000000000000000]
   java.lang.Thread.State: RUNNABLE

"Finalizer" #3 daemon prio=8 os_prio=0 tid=0x00007f015c27c800 nid=0x6a95 in Object.wait()
[0x00007f01249f9000]
   java.lang.Thread.State: WAITING (on object monitor)
	at java.lang.Object.wait(Native Method)
	- waiting on <0x0000000711039418> (a java.lang.ref.ReferenceQueue$Lock)
	at java.lang.ref.ReferenceQueue.remove(ReferenceQueue.java:143)
	- locked <0x0000000711039418> (a java.lang.ref.ReferenceQueue$Lock)
	at java.lang.ref.ReferenceQueue.remove(ReferenceQueue.java:164)
	at java.lang.ref.Finalizer$FinalizerThread.run(Finalizer.java:209)

"Reference Handler" #2 daemon prio=10 os_prio=0 tid=0x00007f015c278000 nid=0x6a93 in Object.wait()
[0x00007f0124afa000]
   java.lang.Thread.State: WAITING (on object monitor)
	at java.lang.Object.wait(Native Method)
	- waiting on <0x00000007110488a8> (a java.lang.ref.Reference$Lock)
	at java.lang.Object.wait(Object.java:502)
	at java.lang.ref.Reference.tryHandlePending(Reference.java:191)
	- locked <0x00000007110488a8> (a java.lang.ref.Reference$Lock)
	at java.lang.ref.Reference$ReferenceHandler.run(Reference.java:153)

"main" #1 prio=5 os_prio=0 tid=0x00007f015c009000 nid=0x6a83 in Object.wait() [0x00007f01639e5000]
   java.lang.Thread.State: WAITING (on object monitor)
	at java.lang.Object.wait(Native Method)
	at java.lang.Object.wait(Object.java:502)
	at org.apache.zookeeper.ClientCnxn.submitRequest(ClientCnxn.java:1342)
	- locked <0x00000007931f75a8> (a org.apache.zookeeper.ClientCnxn$Packet)
	at org.apache.zookeeper.ClientCnxn.close(ClientCnxn.java:1314)
	at org.apache.zookeeper.ZooKeeper.close(ZooKeeper.java:677)
	- locked <0x00000007931b0248> (a org.apache.zookeeper.ZooKeeper)
	at org.apache.hadoop.hbase.zookeeper.RecoverableZooKeeper.close(RecoverableZooKeeper.java:864)
	- locked <0x00000007931a8430> (a org.apache.hadoop.hbase.zookeeper.RecoverableZooKeeper)
	at org.apache.hadoop.hbase.zookeeper.ZooKeeperWatcher.close(ZooKeeperWatcher.java:763)
	at org.apache.hadoop.hbase.client.ZooKeeperKeepAliveConnection.internalClose(ZooKeeperKeepAliveConnection.java:54)
	at org.apache.hadoop.hbase.client.ConnectionManager$HConnectionImplementation.closeZooKeeperWatcher(ConnectionManager.java:1750)
	- locked <0x00000007931a2dc8> (a java.lang.Object)
	at org.apache.hadoop.hbase.client.ConnectionManager$HConnectionImplementation.internalClose(ConnectionManager.java:2522)
	at org.apache.hadoop.hbase.client.ConnectionManager.deleteConnection(ConnectionManager.java:514)
	- locked <0x00000007114b56a0> (a org.apache.hadoop.hbase.client.ConnectionManager$1)
	at org.apache.hadoop.hbase.client.ConnectionManager.deleteConnection(ConnectionManager.java:499)
	- locked <0x00000007114b56a0> (a org.apache.hadoop.hbase.client.ConnectionManager$1)
	at org.apache.hadoop.hbase.client.ConnectionManager.access$1100(ConnectionManager.java:215)
	at org.apache.hadoop.hbase.client.ConnectionManager$HConnectionImplementation.close(ConnectionManager.java:2538)
	at org.apache.hadoop.hbase.client.HTable.close(HTable.java:1525)
	at org.apache.hadoop.hbase.HBaseTestingUtility.waitUntilAllRegionsAssigned(HBaseTestingUtility.java:3544)
	at org.apache.hadoop.hbase.HBaseTestingUtility.waitUntilAllRegionsAssigned(HBaseTestingUtility.java:3502)
	at org.apache.hadoop.hbase.HBaseTestingUtility.createTable(HBaseTestingUtility.java:1503)
	at org.apache.hadoop.hbase.HBaseTestingUtility.createTable(HBaseTestingUtility.java:1547)
	at org.apache.hadoop.hbase.HBaseTestingUtility.createTable(HBaseTestingUtility.java:1438)
	at org.apache.hadoop.hbase.HBaseTestingUtility.createMultiRegionTable(HBaseTestingUtility.java:1388)
	at org.apache.hadoop.hbase.TestGlobalMemStoreSize.testGlobalMemStore(TestGlobalMemStoreSize.java:78)
	at sun.reflect.NativeMethodAccessorImpl.invoke0(Native Method)
	at sun.reflect.NativeMethodAccessorImpl.invoke(NativeMethodAccessorImpl.java:62)
	at sun.reflect.DelegatingMethodAccessorImpl.invoke(DelegatingMethodAccessorImpl.java:43)
	at java.lang.reflect.Method.invoke(Method.java:498)
	at org.junit.runners.model.FrameworkMethod$1.runReflectiveCall(FrameworkMethod.java:50)
	at org.junit.internal.runners.model.ReflectiveCallable.run(ReflectiveCallable.java:12)
	at org.junit.runners.model.FrameworkMethod.invokeExplosively(FrameworkMethod.java:47)
	at org.junit.internal.runners.statements.InvokeMethod.evaluate(InvokeMethod.java:17)
	at org.junit.runners.ParentRunner.runLeaf(ParentRunner.java:325)
	at org.junit.runners.BlockJUnit4ClassRunner.runChild(BlockJUnit4ClassRunner.java:78)
	at org.junit.runners.BlockJUnit4ClassRunner.runChild(BlockJUnit4ClassRunner.java:57)
	at org.junit.runners.ParentRunner$3.run(ParentRunner.java:290)
	at org.junit.runners.ParentRunner$1.schedule(ParentRunner.java:71)
	at org.junit.runners.ParentRunner.runChildren(ParentRunner.java:288)
	at org.junit.runners.ParentRunner.access$000(ParentRunner.java:58)
	at org.junit.runners.ParentRunner$2.evaluate(ParentRunner.java:268)
	at org.junit.runners.ParentRunner.run(ParentRunner.java:363)
	at org.junit.runners.Suite.runChild(Suite.java:128)
	at org.junit.runners.Suite.runChild(Suite.java:27)
	at org.junit.runners.ParentRunner$3.run(ParentRunner.java:290)
	at org.junit.runners.ParentRunner$1.schedule(ParentRunner.java:71)
	at org.junit.runners.ParentRunner.runChildren(ParentRunner.java:288)
	at org.junit.runners.ParentRunner.access$000(ParentRunner.java:58)
	at org.junit.runners.ParentRunner$2.evaluate(ParentRunner.java:268)
	at org.junit.runners.ParentRunner.run(ParentRunner.java:363)
	at org.junit.runner.JUnitCore.run(JUnitCore.java:137)
	at org.junit.runner.JUnitCore.run(JUnitCore.java:115)
	at org.apache.maven.surefire.junitcore.JUnitCoreWrapper.createRequestAndRun(JUnitCoreWrapper.java:108)
	at org.apache.maven.surefire.junitcore.JUnitCoreWrapper.executeEager(JUnitCoreWrapper.java:78)
	at org.apache.maven.surefire.junitcore.JUnitCoreWrapper.execute(JUnitCoreWrapper.java:54)
	at org.apache.maven.surefire.junitcore.JUnitCoreProvider.invoke(JUnitCoreProvider.java:144)
	at org.apache.maven.surefire.booter.ForkedBooter.invokeProviderInSameClassLoader(ForkedBooter.java:203)
	at org.apache.maven.surefire.booter.ForkedBooter.runSuitesInProcess(ForkedBooter.java:155)
	at org.apache.maven.surefire.booter.ForkedBooter.main(ForkedBooter.java:103)

"VM Thread" os_prio=0 tid=0x00007f015c270000 nid=0x6a92 runnable 

"GC task thread#0 (ParallelGC)" os_prio=0 tid=0x00007f015c01e000 nid=0x6a84 runnable 

"GC task thread#1 (ParallelGC)" os_prio=0 tid=0x00007f015c020000 nid=0x6a85 runnable 

"GC task thread#2 (ParallelGC)" os_prio=0 tid=0x00007f015c021800 nid=0x6a86 runnable 

"GC task thread#3 (ParallelGC)" os_prio=0 tid=0x00007f015c023800 nid=0x6a87 runnable 

"GC task thread#4 (ParallelGC)" os_prio=0 tid=0x00007f015c025000 nid=0x6a88 runnable 

"GC task thread#5 (ParallelGC)" os_prio=0 tid=0x00007f015c027000 nid=0x6a89 runnable 

"GC task thread#6 (ParallelGC)" os_prio=0 tid=0x00007f015c028800 nid=0x6a8a runnable 

"GC task thread#7 (ParallelGC)" os_prio=0 tid=0x00007f015c02a800 nid=0x6a8b runnable 

"GC task thread#8 (ParallelGC)" os_prio=0 tid=0x00007f015c02c000 nid=0x6a8c runnable 

"GC task thread#9 (ParallelGC)" os_prio=0 tid=0x00007f015c02e000 nid=0x6a8d runnable 

"GC task thread#10 (ParallelGC)" os_prio=0 tid=0x00007f015c02f800 nid=0x6a8e runnable 

"GC task thread#11 (ParallelGC)" os_prio=0 tid=0x00007f015c031800 nid=0x6a8f runnable 

"GC task thread#12 (ParallelGC)" os_prio=0 tid=0x00007f015c033000 nid=0x6a90 runnable 

"VM Periodic Task Thread" os_prio=0 tid=0x00007f015c2de800 nid=0x6aa8 waiting on condition


JNI global references: 404

27058: No such process
POST BUILD TASK : FAILURE
END OF POST BUILD TASK : 0
Archiving artifacts
Setting JDK_1_7_LATEST__HOME=/home/jenkins/tools/java/latest1.7
Setting JDK_1_8_LATEST__HOME=/home/jenkins/tools/java/latest1.8
Recording test results
Setting JDK_1_7_LATEST__HOME=/home/jenkins/tools/java/latest1.7
Setting JDK_1_8_LATEST__HOME=/home/jenkins/tools/java/latest1.8
ERROR: Step ?Publish JUnit test result report? aborted due to exception: 
java.lang.OutOfMemoryError: Java heap space
	at com.sun.org.apache.xerces.internal.util.XMLStringBuffer.append(XMLStringBuffer.java:208)
	at com.sun.org.apache.xerces.internal.impl.XMLEntityScanner.scanData(XMLEntityScanner.java:1515)
	at com.sun.org.apache.xerces.internal.impl.XMLDocumentFragmentScannerImpl.scanCDATASection(XMLDocumentFragmentScannerImpl.java:1654)
	at com.sun.org.apache.xerces.internal.impl.XMLDocumentFragmentScannerImpl$FragmentContentDriver.next(XMLDocumentFragmentScannerImpl.java:3014)
	at com.sun.org.apache.xerces.internal.impl.XMLDocumentScannerImpl.next(XMLDocumentScannerImpl.java:602)
	at com.sun.org.apache.xerces.internal.impl.XMLNSDocumentScannerImpl.next(XMLNSDocumentScannerImpl.java:112)
	at com.sun.org.apache.xerces.internal.impl.XMLDocumentFragmentScannerImpl.scanDocument(XMLDocumentFragmentScannerImpl.java:505)
	at com.sun.org.apache.xerces.internal.parsers.XML11Configuration.parse(XML11Configuration.java:841)
	at com.sun.org.apache.xerces.internal.parsers.XML11Configuration.parse(XML11Configuration.java:770)
	at com.sun.org.apache.xerces.internal.parsers.XMLParser.parse(XMLParser.java:141)
	at com.sun.org.apache.xerces.internal.parsers.AbstractSAXParser.parse(AbstractSAXParser.java:1213)
	at com.sun.org.apache.xerces.internal.jaxp.SAXParserImpl$JAXPSAXParser.parse(SAXParserImpl.java:643)
	at org.dom4j.io.SAXReader.read(SAXReader.java:465)
	at org.dom4j.io.SAXReader.read(SAXReader.java:264)
	at hudson.tasks.junit.SuiteResult.parse(SuiteResult.java:126)
	at hudson.tasks.junit.TestResult.parse(TestResult.java:302)
	at hudson.tasks.junit.TestResult.parsePossiblyEmpty(TestResult.java:244)
	at hudson.tasks.junit.TestResult.parse(TestResult.java:175)
	at hudson.tasks.junit.TestResult.parse(TestResult.java:154)
	at hudson.tasks.junit.TestResult.<init>(TestResult.java:126)
	at hudson.tasks.junit.JUnitParser$ParseResultCallable.invoke(JUnitParser.java:132)
	at hudson.tasks.junit.JUnitParser$ParseResultCallable.invoke(JUnitParser.java:107)
	at hudson.FilePath$FileCallableWrapper.call(FilePath.java:2739)
	at hudson.remoting.UserRequest.perform(UserRequest.java:153)
	at hudson.remoting.UserRequest.perform(UserRequest.java:50)
	at hudson.remoting.Request$2.run(Request.java:336)
	at hudson.remoting.InterceptingExecutorService$1.call(InterceptingExecutorService.java:68)
	at java.util.concurrent.FutureTask.run(FutureTask.java:266)
	at java.util.concurrent.ThreadPoolExecutor.runWorker(ThreadPoolExecutor.java:1142)
	at java.util.concurrent.ThreadPoolExecutor$Worker.run(ThreadPoolExecutor.java:617)
	at java.lang.Thread.run(Thread.java:748)
	at ......remote call to H0(Native Method)
	at hudson.remoting.Channel.attachCallSiteStackTrace(Channel.java:1545)
	at hudson.remoting.UserResponse.retrieve(UserRequest.java:253)
	at hudson.remoting.Channel.call(Channel.java:830)
Caused: java.io.IOException: Remote call on H0 failed
	at hudson.remoting.Channel.call(Channel.java:838)
	at hudson.FilePath.act(FilePath.java:986)
Caused: java.io.IOException: remote file operation failed: <https://builds.apache.org/job/HBase-1.4/jdk=JDK_1_7,label=Hadoop&&!H13/ws/>
at hudson.remoting.Channel@4dd53dd8:H0
	at hudson.FilePath.act(FilePath.java:993)
	at hudson.FilePath.act(FilePath.java:975)
	at hudson.tasks.junit.JUnitParser.parseResult(JUnitParser.java:103)
	at hudson.tasks.junit.JUnitResultArchiver.parse(JUnitResultArchiver.java:128)
	at hudson.tasks.junit.JUnitResultArchiver.perform(JUnitResultArchiver.java:149)
	at hudson.tasks.BuildStepCompatibilityLayer.perform(BuildStepCompatibilityLayer.java:81)
	at hudson.tasks.BuildStepMonitor$1.perform(BuildStepMonitor.java:20)
	at hudson.model.AbstractBuild$AbstractBuildExecution.perform(AbstractBuild.java:735)
	at hudson.model.AbstractBuild$AbstractBuildExecution.performAllBuildSteps(AbstractBuild.java:676)
	at hudson.model.Build$BuildExecution.post2(Build.java:186)
	at hudson.model.AbstractBuild$AbstractBuildExecution.post(AbstractBuild.java:621)
	at hudson.model.Run.execute(Run.java:1760)
	at hudson.matrix.MatrixRun.run(MatrixRun.java:146)
	at hudson.model.ResourceController.execute(ResourceController.java:97)
	at hudson.model.Executor.run(Executor.java:405)
Setting JDK_1_7_LATEST__HOME=/home/jenkins/tools/java/latest1.7
Setting JDK_1_8_LATEST__HOME=/home/jenkins/tools/java/latest1.8

Mime
View raw message