hbase-builds mailing list archives

Site index · List index
Message view « Date » · « Thread »
Top « Date » · « Thread »
From Apache Jenkins Server <jenk...@builds.apache.org>
Subject Build failed in Jenkins: HBase-1.4 » JDK_1_8,Hadoop&&!H13 #814
Date Thu, 20 Jul 2017 19:55:17 GMT
See <https://builds.apache.org/job/HBase-1.4/jdk=JDK_1_8,label=Hadoop&&!H13/814/display/redirect?page=changes>

Changes:

[anoopsamjohn] HBASE-16993 BucketCache throw java.io.IOException: Invalid HFile block

------------------------------------------
[...truncated 2.39 MB...]
Tests run: 1, Failures: 0, Errors: 0, Skipped: 0, Time elapsed: 6.464 sec - in org.apache.hadoop.hbase.replication.TestReplicationChangingPeerRegionservers
Tests run: 3, Failures: 0, Errors: 0, Skipped: 0, Time elapsed: 45.29 sec - in org.apache.hadoop.hbase.replication.TestPerTableCFReplication
Running org.apache.hadoop.hbase.replication.TestMultiSlaveReplication
Tests run: 9, Failures: 0, Errors: 0, Skipped: 0, Time elapsed: 134.132 sec - in org.apache.hadoop.hbase.replication.regionserver.TestRegionReplicaReplicationEndpoint
Running org.apache.hadoop.hbase.replication.TestReplicationWithTags
Tests run: 1, Failures: 0, Errors: 0, Skipped: 0, Time elapsed: 3.993 sec - in org.apache.hadoop.hbase.replication.TestReplicationWithTags
Running org.apache.hadoop.hbase.replication.TestReplicationSyncUpTool
Running org.apache.hadoop.hbase.replication.TestReplicationKillSlaveRS
Tests run: 8, Failures: 0, Errors: 0, Skipped: 0, Time elapsed: 291.859 sec - in org.apache.hadoop.hbase.replication.regionserver.TestWALEntryStream
Tests run: 2, Failures: 0, Errors: 0, Skipped: 0, Time elapsed: 90.63 sec - in org.apache.hadoop.hbase.replication.TestMultiSlaveReplication
Running org.apache.hadoop.hbase.TestStochasticBalancerJmxMetrics
Tests run: 1, Failures: 0, Errors: 0, Skipped: 1, Time elapsed: 0.001 sec - in org.apache.hadoop.hbase.TestStochasticBalancerJmxMetrics
Running org.apache.hadoop.hbase.replication.TestReplicationStateZKImpl
Running org.apache.hadoop.hbase.TestLocalHBaseCluster
Tests run: 1, Failures: 0, Errors: 0, Skipped: 0, Time elapsed: 13.925 sec - in org.apache.hadoop.hbase.replication.TestReplicationKillSlaveRS
Tests run: 9, Failures: 0, Errors: 0, Skipped: 0, Time elapsed: 4.719 sec - in org.apache.hadoop.hbase.replication.TestReplicationStateZKImpl
Running org.apache.hadoop.hbase.TestJMXConnectorServer
Tests run: 1, Failures: 0, Errors: 0, Skipped: 0, Time elapsed: 13.686 sec - in org.apache.hadoop.hbase.TestLocalHBaseCluster
Running org.apache.hadoop.hbase.TestMetaTableAccessor
Running org.apache.hadoop.hbase.TestMultiVersions
Tests run: 3, Failures: 0, Errors: 0, Skipped: 0, Time elapsed: 29.807 sec - in org.apache.hadoop.hbase.TestJMXConnectorServer
Running org.apache.hadoop.hbase.fs.TestBlockReorder
Tests run: 1, Failures: 0, Errors: 0, Skipped: 0, Time elapsed: 85.419 sec - in org.apache.hadoop.hbase.replication.TestReplicationSyncUpTool
Tests run: 3, Failures: 0, Errors: 0, Skipped: 0, Time elapsed: 21.776 sec - in org.apache.hadoop.hbase.TestMultiVersions
Tests run: 14, Failures: 0, Errors: 0, Skipped: 0, Time elapsed: 39.028 sec - in org.apache.hadoop.hbase.TestMetaTableAccessor
Running org.apache.hadoop.hbase.filter.TestFilterListOrOperatorWithBlkCnt
Running org.apache.hadoop.hbase.filter.TestFilterWithScanLimits
Running org.apache.hadoop.hbase.filter.TestFuzzyRowAndColumnRangeFilter
Tests run: 1, Failures: 0, Errors: 0, Skipped: 0, Time elapsed: 6.563 sec - in org.apache.hadoop.hbase.filter.TestFilterWithScanLimits
Tests run: 1, Failures: 0, Errors: 0, Skipped: 0, Time elapsed: 9.145 sec - in org.apache.hadoop.hbase.filter.TestFuzzyRowAndColumnRangeFilter
Tests run: 1, Failures: 0, Errors: 0, Skipped: 0, Time elapsed: 15.895 sec - in org.apache.hadoop.hbase.filter.TestFilterListOrOperatorWithBlkCnt
Tests run: 3, Failures: 0, Errors: 0, Skipped: 0, Time elapsed: 41.689 sec - in org.apache.hadoop.hbase.fs.TestBlockReorder
Running org.apache.hadoop.hbase.filter.TestScanRowPrefix
Running org.apache.hadoop.hbase.filter.TestColumnRangeFilter
Running org.apache.hadoop.hbase.filter.TestFuzzyRowFilterEndToEnd
Running org.apache.hadoop.hbase.filter.TestFilterWrapper
Tests run: 1, Failures: 0, Errors: 0, Skipped: 0, Time elapsed: 12.849 sec - in org.apache.hadoop.hbase.filter.TestScanRowPrefix
Tests run: 1, Failures: 0, Errors: 0, Skipped: 0, Time elapsed: 13.313 sec - in org.apache.hadoop.hbase.filter.TestColumnRangeFilter
Running org.apache.hadoop.hbase.tool.TestCanaryTool
Tests run: 1, Failures: 0, Errors: 0, Skipped: 0, Time elapsed: 6.849 sec - in org.apache.hadoop.hbase.filter.TestFilterWrapper
Tests run: 8, Failures: 0, Errors: 0, Skipped: 0, Time elapsed: 291.444 sec - in org.apache.hadoop.hbase.replication.TestMasterReplication
Running org.apache.hadoop.hbase.filter.TestMultiRowRangeFilter
Running org.apache.hadoop.hbase.mapreduce.TestHFileOutputFormat
Running org.apache.hadoop.hbase.mapreduce.TestLoadIncrementalHFilesUseSecurityEndPoint
Tests run: 21, Failures: 0, Errors: 0, Skipped: 0, Time elapsed: 31.792 sec - in org.apache.hadoop.hbase.filter.TestMultiRowRangeFilter
Running org.apache.hadoop.hbase.mapreduce.TestWALPlayer
Tests run: 4, Failures: 0, Errors: 0, Skipped: 0, Time elapsed: 12.85 sec - in org.apache.hadoop.hbase.mapreduce.TestWALPlayer
Running org.apache.hadoop.hbase.mapreduce.TestHLogRecordReader
Tests run: 2, Failures: 0, Errors: 0, Skipped: 0, Time elapsed: 1.238 sec - in org.apache.hadoop.hbase.mapreduce.TestHLogRecordReader
Running org.apache.hadoop.hbase.mapreduce.TestMultiTableInputFormat
Tests run: 13, Failures: 0, Errors: 0, Skipped: 1, Time elapsed: 86.383 sec - in org.apache.hadoop.hbase.mapreduce.TestHFileOutputFormat
Tests run: 7, Failures: 0, Errors: 0, Skipped: 0, Time elapsed: 100.478 sec - in org.apache.hadoop.hbase.tool.TestCanaryTool
Running org.apache.hadoop.hbase.mapreduce.TestHashTable
Running org.apache.hadoop.hbase.mapreduce.TestImportTSVWithOperationAttributes
Tests run: 4, Failures: 0, Errors: 0, Skipped: 0, Time elapsed: 30.161 sec - in org.apache.hadoop.hbase.mapreduce.TestMultiTableInputFormat
Tests run: 1, Failures: 0, Errors: 0, Skipped: 0, Time elapsed: 16.671 sec - in org.apache.hadoop.hbase.mapreduce.TestHashTable
Running org.apache.hadoop.hbase.mapreduce.TestWALRecordReader
Tests run: 2, Failures: 0, Errors: 0, Skipped: 0, Time elapsed: 1.879 sec - in org.apache.hadoop.hbase.mapreduce.TestWALRecordReader
Running org.apache.hadoop.hbase.mapreduce.TestSyncTable
Tests run: 2, Failures: 0, Errors: 0, Skipped: 0, Time elapsed: 26.832 sec - in org.apache.hadoop.hbase.mapreduce.TestImportTSVWithOperationAttributes
Running org.apache.hadoop.hbase.mapreduce.TestSecureLoadIncrementalHFilesSplitRecovery
Running org.apache.hadoop.hbase.mapreduce.TestTimeRangeMapRed
Tests run: 1, Failures: 0, Errors: 0, Skipped: 0, Time elapsed: 9.913 sec - in org.apache.hadoop.hbase.mapreduce.TestTimeRangeMapRed
Running org.apache.hadoop.hbase.mapreduce.TestTableSnapshotInputFormat
Tests run: 1, Failures: 0, Errors: 0, Skipped: 0, Time elapsed: 27.084 sec - in org.apache.hadoop.hbase.mapreduce.TestSyncTable
Running org.apache.hadoop.hbase.mapreduce.TestImportTSVWithTTLs
Tests run: 6, Failures: 0, Errors: 0, Skipped: 0, Time elapsed: 41.64 sec - in org.apache.hadoop.hbase.mapreduce.TestSecureLoadIncrementalHFilesSplitRecovery
Tests run: 4, Failures: 0, Errors: 0, Skipped: 0, Time elapsed: 196.333 sec - in org.apache.hadoop.hbase.filter.TestFuzzyRowFilterEndToEnd
Tests run: 1, Failures: 0, Errors: 0, Skipped: 0, Time elapsed: 14.933 sec - in org.apache.hadoop.hbase.mapreduce.TestImportTSVWithTTLs
Running org.apache.hadoop.hbase.mapreduce.TestCellCounter
Running org.apache.hadoop.hbase.mapreduce.TestHRegionPartitioner
Running org.apache.hadoop.hbase.mapreduce.TestTableInputFormatScan1
Tests run: 1, Failures: 0, Errors: 0, Skipped: 0, Time elapsed: 4.973 sec - in org.apache.hadoop.hbase.mapreduce.TestHRegionPartitioner
Running org.apache.hadoop.hbase.mapreduce.TestLoadIncrementalHFiles
Tests run: 7, Failures: 0, Errors: 0, Skipped: 0, Time elapsed: 34.668 sec - in org.apache.hadoop.hbase.mapreduce.TestTableInputFormatScan1
Running org.apache.hadoop.hbase.mapreduce.TestSecureLoadIncrementalHFiles
Tests run: 8, Failures: 0, Errors: 0, Skipped: 0, Time elapsed: 61.806 sec - in org.apache.hadoop.hbase.mapreduce.TestCellCounter
Running org.apache.hadoop.hbase.mapreduce.TestTableInputFormat
Tests run: 8, Failures: 0, Errors: 0, Skipped: 0, Time elapsed: 18.77 sec - in org.apache.hadoop.hbase.mapreduce.TestTableInputFormat
Tests run: 9, Failures: 0, Errors: 0, Skipped: 0, Time elapsed: 140.025 sec - in org.apache.hadoop.hbase.mapreduce.TestTableSnapshotInputFormat
Running org.apache.hadoop.hbase.mapreduce.TestTableInputFormatScan2
Running org.apache.hadoop.hbase.mapreduce.TestImportExport
Tests run: 22, Failures: 0, Errors: 0, Skipped: 0, Time elapsed: 293.124 sec - in org.apache.hadoop.hbase.mapreduce.TestLoadIncrementalHFilesUseSecurityEndPoint

Results :

Failed tests: 
org.apache.hadoop.hbase.regionserver.TestScannerHeartbeatMessages.testScannerHeartbeatMessages(org.apache.hadoop.hbase.regionserver.TestScannerHeartbeatMessages)
  Run 1: TestScannerHeartbeatMessages.testScannerHeartbeatMessages:207->testImportanceOfHeartbeats:237
Heartbeats messages are disabled, an exception should be thrown. If an exception  is not thrown,
the test case is not testing the importance of heartbeat messages
  Run 2: TestScannerHeartbeatMessages.testScannerHeartbeatMessages:207->testImportanceOfHeartbeats:237
Heartbeats messages are disabled, an exception should be thrown. If an exception  is not thrown,
the test case is not testing the importance of heartbeat messages
  Run 3: TestScannerHeartbeatMessages.testScannerHeartbeatMessages:207->testImportanceOfHeartbeats:237
Heartbeats messages are disabled, an exception should be thrown. If an exception  is not thrown,
the test case is not testing the importance of heartbeat messages

Tests in error: 
  TestMasterBalanceThrottling.testThrottlingByBalanceInterval:81 » TestTimedOut ...
  TestMasterBalanceThrottling.testThrottlingByMaxRitPercent:105 » TestTimedOut t...
Flaked tests: 
org.apache.hadoop.hbase.client.TestReplicasClient.testCancelOfMultiGet(org.apache.hadoop.hbase.client.TestReplicasClient)
  Run 1: TestReplicasClient.testCancelOfMultiGet:585 null
  Run 2: PASS

org.apache.hadoop.hbase.replication.TestSerialReplication.testRegionSplit(org.apache.hadoop.hbase.replication.TestSerialReplication)
  Run 1: TestSerialReplication.testRegionSplit:256 expected:<9> but was:<4>
  Run 2: PASS


Tests run: 2693, Failures: 1, Errors: 2, Skipped: 42, Flakes: 2

[INFO] ------------------------------------------------------------------------
[INFO] Reactor Summary:
[INFO] 
[INFO] Apache HBase ...................................... SUCCESS [1:49.585s]
[INFO] Apache HBase - Checkstyle ......................... SUCCESS [16.092s]
[INFO] Apache HBase - Resource Bundle .................... SUCCESS [0.340s]
[INFO] Apache HBase - Annotations ........................ SUCCESS [1.133s]
[INFO] Apache HBase - Protocol ........................... SUCCESS [20.333s]
[INFO] Apache HBase - Common ............................. SUCCESS [2:57.531s]
[INFO] Apache HBase - Procedure .......................... SUCCESS [4:03.582s]
[INFO] Apache HBase - Metrics API ........................ SUCCESS [1.486s]
[INFO] Apache HBase - Hadoop Compatibility ............... SUCCESS [12.507s]
[INFO] Apache HBase - Metrics Implementation ............. SUCCESS [7.110s]
[INFO] Apache HBase - Hadoop Two Compatibility ........... SUCCESS [20.434s]
[INFO] Apache HBase - Client ............................. SUCCESS [1:51.507s]
[INFO] Apache HBase - Prefix Tree ........................ SUCCESS [9.353s]
[INFO] Apache HBase - Server ............................. FAILURE [2:01:51.076s]
[INFO] Apache HBase - Testing Util ....................... SKIPPED
[INFO] Apache HBase - Thrift ............................. SKIPPED
[INFO] Apache HBase - Rest ............................... SKIPPED
[INFO] Apache HBase - Shell .............................. SKIPPED
[INFO] Apache HBase - Integration Tests .................. SKIPPED
[INFO] Apache HBase - Examples ........................... SKIPPED
[INFO] Apache HBase - External Block Cache ............... SKIPPED
[INFO] Apache HBase - Assembly ........................... SKIPPED
[INFO] Apache HBase - Shaded ............................. SKIPPED
[INFO] Apache HBase - Shaded - Client .................... SKIPPED
[INFO] Apache HBase - Shaded - Server .................... SKIPPED
[INFO] Apache HBase - Archetypes ......................... SKIPPED
[INFO] Apache HBase - Exemplar for hbase-client archetype  SKIPPED
[INFO] Apache HBase - Exemplar for hbase-shaded-client archetype  SKIPPED
[INFO] Apache HBase - Archetype builder .................. SKIPPED
[INFO] ------------------------------------------------------------------------
[INFO] BUILD FAILURE
[INFO] ------------------------------------------------------------------------
[INFO] Total time: 2:14:34.774s
[INFO] Finished at: Thu Jul 20 19:46:54 UTC 2017
[INFO] Final Memory: 563M/702M
[INFO] ------------------------------------------------------------------------
[ERROR] Failed to execute goal org.apache.maven.plugins:maven-surefire-plugin:2.18.1:test
(secondPartTestsExecution) on project hbase-server: ExecutionException: java.lang.RuntimeException:
java.lang.RuntimeException: org.apache.maven.surefire.report.ReporterException: When writing
xml report stdout/stderr: /tmp/stderr5317541334948647371deferred (No such file or directory)
-> [Help 1]
[ERROR] 
[ERROR] To see the full stack trace of the errors, re-run Maven with the -e switch.
[ERROR] Re-run Maven using the -X switch to enable full debug logging.
[ERROR] 
[ERROR] For more information about the errors and possible solutions, please read the following
articles:
[ERROR] [Help 1] http://cwiki.apache.org/confluence/display/MAVEN/MojoFailureException
[ERROR] 
[ERROR] After correcting the problems, you can resume the build with the command
[ERROR]   mvn <goals> -rf :hbase-server
Build step 'Invoke top-level Maven targets' marked build as failure
Performing Post build task...
Match found for :.* : True
Logical operation result is TRUE
Running script  : # Post-build task script. TODO: Check this in and have all builds reference
check-in.
pwd && ls
# NOTE!!!! The below code has been copied and pasted from ./dev-tools/run-test.sh
# Do not change here without syncing there and vice-versa.
ZOMBIE_TESTS_COUNT=`jps -v | grep surefirebooter | grep -e '-Dhbase.test' | wc -l`
if [[ $ZOMBIE_TESTS_COUNT != 0 ]] ; then
 echo "Suspicious java process found - waiting 30s to see if there are just slow to stop"
 sleep 30
 ZOMBIE_TESTS_COUNT=`jps -v | grep surefirebooter | grep -e '-Dhbase.test' | wc -l`
 if [[ $ZOMBIE_TESTS_COUNT != 0 ]] ; then
   echo " {color:red}There appear to be $ZOMBIE_TESTS_COUNT zombie tests{color}, they should
have been killed by surefire but survived"
   jps -v | grep surefirebooter | grep -e '-Dhbase.test'
   jps -v | grep surefirebooter | grep -e '-Dhbase.test' | cut -d ' ' -f 1 | xargs -n 1 jstack
   # Exit with error
   exit 1
 else
   echo "We're ok: there is no zombie test, but some tests took some time to stop"
 fi
else
  echo "We're ok: there is no zombie test"
fi
Setting JDK_1_7_LATEST__HOME=/home/jenkins/tools/java/latest1.7
Setting JDK_1_8_LATEST__HOME=/home/jenkins/tools/java/latest1.8
[30b16b4c] $ /bin/bash -xe /tmp/jenkins4862694563383919286.sh
+ pwd
<https://builds.apache.org/job/HBase-1.4/jdk=JDK_1_8,label=Hadoop&&!H13/ws/>
+ ls
bin
CHANGES.txt
conf
dev-support
extra_env_var
hbase-annotations
hbase-archetypes
hbase-assembly
hbase-checkstyle
hbase-client
hbase-common
hbase-examples
hbase-external-blockcache
hbase-hadoop2-compat
hbase-hadoop-compat
hbase-it
hbase-metrics
hbase-metrics-api
hbase-native-client
hbase-prefix-tree
hbase-procedure
hbase-protocol
hbase-resource-bundle
hbase-rest
hbase-server
hbase-shaded
hbase-shell
hbase-testing-util
hbase-thrift
LICENSE.txt
NOTICE.txt
pom.xml
README.txt
src
target
++ jps -v
++ grep surefirebooter
++ grep -e -Dhbase.test
++ wc -l
+ ZOMBIE_TESTS_COUNT=3
+ [[ 3 != 0 ]]
+ echo 'Suspicious java process found - waiting 30s to see if there are just slow to stop'
Suspicious java process found - waiting 30s to see if there are just slow to stop
+ sleep 30
++ jps -v
++ grep surefirebooter
++ wc -l
++ grep -e -Dhbase.test
+ ZOMBIE_TESTS_COUNT=0
+ [[ 0 != 0 ]]
+ echo 'We'\''re ok: there is no zombie test, but some tests took some time to stop'
We're ok: there is no zombie test, but some tests took some time to stop
POST BUILD TASK : SUCCESS
END OF POST BUILD TASK : 0
Archiving artifacts
Setting JDK_1_7_LATEST__HOME=/home/jenkins/tools/java/latest1.7
Setting JDK_1_8_LATEST__HOME=/home/jenkins/tools/java/latest1.8
Recording test results
Setting JDK_1_7_LATEST__HOME=/home/jenkins/tools/java/latest1.7
Setting JDK_1_8_LATEST__HOME=/home/jenkins/tools/java/latest1.8
Setting JDK_1_7_LATEST__HOME=/home/jenkins/tools/java/latest1.7
Setting JDK_1_8_LATEST__HOME=/home/jenkins/tools/java/latest1.8

Mime
View raw message