hbase-builds mailing list archives

Site index · List index
Message view « Date » · « Thread »
Top « Date » · « Thread »
From Apache Jenkins Server <jenk...@builds.apache.org>
Subject Build failed in Jenkins: HBase-1.4 » JDK_1_8,Hadoop&&!H13 #829
Date Mon, 31 Jul 2017 09:27:47 GMT
See <https://builds.apache.org/job/HBase-1.4/jdk=JDK_1_8,label=Hadoop&&!H13/829/display/redirect?page=changes>

Changes:

[achouhan] HBASE-18374 RegionServer Metrics improvements

------------------------------------------
[...truncated 2.38 MB...]
Tests run: 1, Failures: 0, Errors: 0, Skipped: 0, Time elapsed: 0.623 sec - in org.apache.hadoop.hbase.wal.TestWALRootDir
Tests run: 6, Failures: 0, Errors: 0, Skipped: 0, Time elapsed: 10.784 sec - in org.apache.hadoop.hbase.util.TestRegionSplitter
Running org.apache.hadoop.hbase.wal.TestWALOpenAfterDNRollingStart
Running org.apache.hadoop.hbase.wal.TestBoundedRegionGroupingStrategy
Running org.apache.hadoop.hbase.wal.TestDefaultWALProviderWithHLogKey
Tests run: 5, Failures: 0, Errors: 0, Skipped: 0, Time elapsed: 7.283 sec - in org.apache.hadoop.hbase.wal.TestDefaultWALProviderWithHLogKey
Running org.apache.hadoop.hbase.wal.TestWALReaderOnSecureWAL
Tests run: 1, Failures: 0, Errors: 0, Skipped: 0, Time elapsed: 28.509 sec - in org.apache.hadoop.hbase.wal.TestWALFiltering
Tests run: 2, Failures: 0, Errors: 0, Skipped: 0, Time elapsed: 1.785 sec - in org.apache.hadoop.hbase.wal.TestWALReaderOnSecureWAL
Running org.apache.hadoop.hbase.wal.TestSecureWAL
Tests run: 1, Failures: 0, Errors: 0, Skipped: 0, Time elapsed: 1.795 sec - in org.apache.hadoop.hbase.wal.TestSecureWAL
Running org.apache.hadoop.hbase.wal.TestWALSplit
Running org.apache.hadoop.hbase.wal.TestWALSplitCompressed
Tests run: 5, Failures: 0, Errors: 0, Skipped: 0, Time elapsed: 23.468 sec - in org.apache.hadoop.hbase.wal.TestBoundedRegionGroupingStrategy
Running org.apache.hadoop.hbase.wal.TestDefaultWALProvider
Tests run: 5, Failures: 0, Errors: 0, Skipped: 0, Time elapsed: 6.812 sec - in org.apache.hadoop.hbase.wal.TestDefaultWALProvider
Running org.apache.hadoop.hbase.wal.TestWALFactory
Tests run: 1, Failures: 0, Errors: 0, Skipped: 0, Time elapsed: 46.097 sec - in org.apache.hadoop.hbase.wal.TestWALOpenAfterDNRollingStart
Tests run: 9, Failures: 0, Errors: 0, Skipped: 0, Time elapsed: 11.252 sec - in org.apache.hadoop.hbase.wal.TestWALFactory
Running org.apache.hadoop.hbase.namespace.TestNamespaceAuditor
Running org.apache.hadoop.hbase.constraint.TestConstraint
Tests run: 5, Failures: 0, Errors: 0, Skipped: 0, Time elapsed: 23.965 sec - in org.apache.hadoop.hbase.constraint.TestConstraint
Tests run: 33, Failures: 0, Errors: 0, Skipped: 0, Time elapsed: 76.571 sec - in org.apache.hadoop.hbase.wal.TestWALSplit
Running org.apache.hadoop.hbase.TestNamespace
Tests run: 33, Failures: 0, Errors: 0, Skipped: 0, Time elapsed: 77.357 sec - in org.apache.hadoop.hbase.wal.TestWALSplitCompressed
Running org.apache.hadoop.hbase.TestRegionRebalancing
Running org.apache.hadoop.hbase.TestInfoServers
Tests run: 3, Failures: 0, Errors: 0, Skipped: 0, Time elapsed: 5.748 sec - in org.apache.hadoop.hbase.TestInfoServers
Running org.apache.hadoop.hbase.filter.TestMultiRowRangeFilter
Tests run: 8, Failures: 0, Errors: 0, Skipped: 0, Time elapsed: 39.827 sec - in org.apache.hadoop.hbase.TestNamespace
Running org.apache.hadoop.hbase.filter.TestScanRowPrefix
Tests run: 21, Failures: 0, Errors: 0, Skipped: 0, Time elapsed: 25.414 sec - in org.apache.hadoop.hbase.filter.TestMultiRowRangeFilter
Tests run: 2, Failures: 0, Errors: 0, Skipped: 0, Time elapsed: 47.263 sec - in org.apache.hadoop.hbase.TestRegionRebalancing
Tests run: 1, Failures: 0, Errors: 0, Skipped: 0, Time elapsed: 9.564 sec - in org.apache.hadoop.hbase.filter.TestScanRowPrefix
Running org.apache.hadoop.hbase.filter.TestFuzzyRowFilterEndToEnd
Running org.apache.hadoop.hbase.filter.TestFilterWrapper
Tests run: 12, Failures: 0, Errors: 0, Skipped: 1, Time elapsed: 106.747 sec - in org.apache.hadoop.hbase.namespace.TestNamespaceAuditor
Running org.apache.hadoop.hbase.filter.TestFuzzyRowAndColumnRangeFilter
Tests run: 1, Failures: 0, Errors: 0, Skipped: 0, Time elapsed: 4.79 sec - in org.apache.hadoop.hbase.filter.TestFilterWrapper
Tests run: 1, Failures: 0, Errors: 0, Skipped: 0, Time elapsed: 6.086 sec - in org.apache.hadoop.hbase.filter.TestFuzzyRowAndColumnRangeFilter
Running org.apache.hadoop.hbase.filter.TestColumnRangeFilter
Running org.apache.hadoop.hbase.filter.TestFilterListOrOperatorWithBlkCnt
Running org.apache.hadoop.hbase.filter.TestFilterWithScanLimits
Tests run: 1, Failures: 0, Errors: 0, Skipped: 0, Time elapsed: 9.477 sec - in org.apache.hadoop.hbase.filter.TestColumnRangeFilter
Tests run: 1, Failures: 0, Errors: 0, Skipped: 0, Time elapsed: 4.61 sec - in org.apache.hadoop.hbase.filter.TestFilterWithScanLimits
Running org.apache.hadoop.hbase.io.TestFileLink
Running org.apache.hadoop.hbase.io.hfile.TestScannerSelectionUsingTTL
Tests run: 1, Failures: 0, Errors: 0, Skipped: 0, Time elapsed: 13.134 sec - in org.apache.hadoop.hbase.filter.TestFilterListOrOperatorWithBlkCnt
Running org.apache.hadoop.hbase.io.hfile.TestCacheConfig
Tests run: 7, Failures: 0, Errors: 0, Skipped: 0, Time elapsed: 1.82 sec - in org.apache.hadoop.hbase.io.hfile.TestCacheConfig
Running org.apache.hadoop.hbase.io.hfile.TestHFileSeek
Tests run: 6, Failures: 0, Errors: 0, Skipped: 0, Time elapsed: 13.795 sec - in org.apache.hadoop.hbase.io.TestFileLink
Tests run: 1, Failures: 0, Errors: 0, Skipped: 0, Time elapsed: 1.857 sec - in org.apache.hadoop.hbase.io.hfile.TestHFileSeek
Running org.apache.hadoop.hbase.io.hfile.TestSeekBeforeWithInlineBlocks
Running org.apache.hadoop.hbase.io.hfile.TestForceCacheImportantBlocks
Tests run: 1, Failures: 0, Errors: 0, Skipped: 0, Time elapsed: 10.952 sec - in org.apache.hadoop.hbase.io.hfile.TestSeekBeforeWithInlineBlocks
Running org.apache.hadoop.hbase.io.hfile.TestCacheOnWrite
Tests run: 4, Failures: 0, Errors: 0, Skipped: 0, Time elapsed: 30.229 sec - in org.apache.hadoop.hbase.io.hfile.TestForceCacheImportantBlocks
Running org.apache.hadoop.hbase.io.hfile.TestHFileBlock
Tests run: 6, Failures: 0, Errors: 0, Skipped: 0, Time elapsed: 63.037 sec - in org.apache.hadoop.hbase.io.hfile.TestScannerSelectionUsingTTL
Running org.apache.hadoop.hbase.io.hfile.TestHFileBlockIndex
Tests run: 16, Failures: 0, Errors: 0, Skipped: 0, Time elapsed: 5.478 sec - in org.apache.hadoop.hbase.io.hfile.TestHFileBlockIndex
Running org.apache.hadoop.hbase.io.encoding.TestLoadAndSwitchEncodeOnDisk
Tests run: 1, Failures: 0, Errors: 0, Skipped: 0, Time elapsed: 31.161 sec - in org.apache.hadoop.hbase.io.encoding.TestLoadAndSwitchEncodeOnDisk
Running org.apache.hadoop.hbase.io.encoding.TestBufferedDataBlockEncoder
Tests run: 1, Failures: 0, Errors: 0, Skipped: 0, Time elapsed: 13.714 sec - in org.apache.hadoop.hbase.io.encoding.TestBufferedDataBlockEncoder
Running org.apache.hadoop.hbase.io.encoding.TestEncodedSeekers
Tests run: 59, Failures: 0, Errors: 0, Skipped: 1, Time elapsed: 382.27 sec - in org.apache.hadoop.hbase.util.TestHBaseFsck
Running org.apache.hadoop.hbase.io.encoding.TestDataBlockEncoders
Tests run: 28, Failures: 0, Errors: 0, Skipped: 0, Time elapsed: 89.683 sec - in org.apache.hadoop.hbase.io.hfile.TestHFileBlock
Tests run: 72, Failures: 0, Errors: 0, Skipped: 0, Time elapsed: 114.451 sec - in org.apache.hadoop.hbase.io.hfile.TestCacheOnWrite
Running org.apache.hadoop.hbase.TestClusterBootOrder
Running org.apache.hadoop.hbase.io.encoding.TestChangingEncoding
Tests run: 28, Failures: 0, Errors: 0, Skipped: 0, Time elapsed: 27.88 sec - in org.apache.hadoop.hbase.io.encoding.TestDataBlockEncoders
Tests run: 4, Failures: 0, Errors: 0, Skipped: 0, Time elapsed: 204.034 sec - in org.apache.hadoop.hbase.filter.TestFuzzyRowFilterEndToEnd
Tests run: 2, Failures: 0, Errors: 0, Skipped: 0, Time elapsed: 37.379 sec - in org.apache.hadoop.hbase.TestClusterBootOrder
Tests run: 24, Failures: 0, Errors: 0, Skipped: 0, Time elapsed: 87.836 sec - in org.apache.hadoop.hbase.io.encoding.TestEncodedSeekers
Tests run: 3, Failures: 0, Errors: 0, Skipped: 0, Time elapsed: 147.264 sec - in org.apache.hadoop.hbase.io.encoding.TestChangingEncoding

Results :

Failed tests: 
  TestVisibilityLabelsWithACL.setupBeforeClass:103 Waiting timed out after [10,000] msec
Tests in error: 
org.apache.hadoop.hbase.client.TestClientScannerRPCTimeout.testScannerNextRPCTimesout(org.apache.hadoop.hbase.client.TestClientScannerRPCTimeout)
  Run 1: TestClientScannerRPCTimeout.testScannerNextRPCTimesout:87 » TableExists testSc...
  Run 2: TestClientScannerRPCTimeout.testScannerNextRPCTimesout:87 » TableExists testSc...
  Run 3: TestClientScannerRPCTimeout.testScannerNextRPCTimesout:87 » TableExists testSc...

org.apache.hadoop.hbase.regionserver.TestRSKilledWhenInitializing.testRSTerminationAfterRegisteringToMasterBeforeCreatingEphemeralNode(org.apache.hadoop.hbase.regionserver.TestRSKilledWhenInitializing)
  Run 1: TestRSKilledWhenInitializing.testRSTerminationAfterRegisteringToMasterBeforeCreatingEphemeralNode:142
null
  Run 2: TestRSKilledWhenInitializing.testRSTerminationAfterRegisteringToMasterBeforeCreatingEphemeralNode:115
» TestTimedOut
  Run 3: TestRSKilledWhenInitializing.testRSTerminationAfterRegisteringToMasterBeforeCreatingEphemeralNode
» 
  Run 4: TestRSKilledWhenInitializing.testRSTerminationAfterRegisteringToMasterBeforeCreatingEphemeralNode:115
» TestTimedOut
  Run 5: TestRSKilledWhenInitializing.testRSTerminationAfterRegisteringToMasterBeforeCreatingEphemeralNode
» 

Flaked tests: 
org.apache.hadoop.hbase.mapred.TestTableSnapshotInputFormat.testWithMapReduceAndOfflineHBaseMultiRegion(org.apache.hadoop.hbase.mapred.TestTableSnapshotInputFormat)
  Run 1: TestTableSnapshotInputFormat.testWithMapReduceAndOfflineHBaseMultiRegion:147->TableSnapshotInputFormatTestBase.testWithMapReduce:168->testWithMapReduceImpl:224->doTestWithMapReduce:234->TableSnapshotInputFormatTestBase.createTableAndSnapshot:206
» RetriesExhausted
  Run 2: PASS

org.apache.hadoop.hbase.master.TestTableLockManager.testReapAllTableLocks(org.apache.hadoop.hbase.master.TestTableLockManager)
  Run 1: TestTableLockManager.testReapAllTableLocks:283 » LockTimeout Timed out acquiri...
  Run 2: TestTableLockManager.testReapAllTableLocks:283 » LockTimeout Timed out acquiri...
  Run 3: PASS


Tests run: 2828, Failures: 1, Errors: 2, Skipped: 57, Flakes: 2

[INFO] ------------------------------------------------------------------------
[INFO] Reactor Summary:
[INFO] 
[INFO] Apache HBase ...................................... SUCCESS [1:43.166s]
[INFO] Apache HBase - Checkstyle ......................... SUCCESS [14.927s]
[INFO] Apache HBase - Resource Bundle .................... SUCCESS [0.184s]
[INFO] Apache HBase - Annotations ........................ SUCCESS [1.236s]
[INFO] Apache HBase - Protocol ........................... SUCCESS [16.902s]
[INFO] Apache HBase - Common ............................. SUCCESS [2:35.571s]
[INFO] Apache HBase - Procedure .......................... SUCCESS [3:34.663s]
[INFO] Apache HBase - Metrics API ........................ SUCCESS [1.355s]
[INFO] Apache HBase - Hadoop Compatibility ............... SUCCESS [11.039s]
[INFO] Apache HBase - Metrics Implementation ............. SUCCESS [5.087s]
[INFO] Apache HBase - Hadoop Two Compatibility ........... SUCCESS [18.308s]
[INFO] Apache HBase - Client ............................. SUCCESS [1:43.073s]
[INFO] Apache HBase - Prefix Tree ........................ SUCCESS [7.898s]
[INFO] Apache HBase - Server ............................. FAILURE [1:38:53.611s]
[INFO] Apache HBase - Testing Util ....................... SKIPPED
[INFO] Apache HBase - Thrift ............................. SKIPPED
[INFO] Apache HBase - Rest ............................... SKIPPED
[INFO] Apache HBase - Shell .............................. SKIPPED
[INFO] Apache HBase - Integration Tests .................. SKIPPED
[INFO] Apache HBase - Examples ........................... SKIPPED
[INFO] Apache HBase - External Block Cache ............... SKIPPED
[INFO] Apache HBase - Assembly ........................... SKIPPED
[INFO] Apache HBase - Shaded ............................. SKIPPED
[INFO] Apache HBase - Shaded - Client .................... SKIPPED
[INFO] Apache HBase - Shaded - Server .................... SKIPPED
[INFO] Apache HBase - Archetypes ......................... SKIPPED
[INFO] Apache HBase - Exemplar for hbase-client archetype  SKIPPED
[INFO] Apache HBase - Exemplar for hbase-shaded-client archetype  SKIPPED
[INFO] Apache HBase - Archetype builder .................. SKIPPED
[INFO] ------------------------------------------------------------------------
[INFO] BUILD FAILURE
[INFO] ------------------------------------------------------------------------
[INFO] Total time: 1:50:17.960s
[INFO] Finished at: Mon Jul 31 09:12:06 UTC 2017
[INFO] Final Memory: 103M/2877M
[INFO] ------------------------------------------------------------------------
[ERROR] Failed to execute goal org.apache.maven.plugins:maven-surefire-plugin:2.18.1:test
(secondPartTestsExecution) on project hbase-server: ExecutionException: java.lang.RuntimeException:
There was an error in the forked process
[ERROR] java.lang.ArrayIndexOutOfBoundsException: 1
[ERROR] at org.apache.maven.surefire.common.junit4.JUnit4ProviderUtil.generateFailingTests(JUnit4ProviderUtil.java:64)
[ERROR] at org.apache.maven.surefire.junitcore.JUnitCoreProvider.invoke(JUnitCoreProvider.java:151)
[ERROR] at org.apache.maven.surefire.booter.ForkedBooter.invokeProviderInSameClassLoader(ForkedBooter.java:203)
[ERROR] at org.apache.maven.surefire.booter.ForkedBooter.runSuitesInProcess(ForkedBooter.java:155)
[ERROR] at org.apache.maven.surefire.booter.ForkedBooter.main(ForkedBooter.java:103)
[ERROR] -> [Help 1]
[ERROR] 
[ERROR] To see the full stack trace of the errors, re-run Maven with the -e switch.
[ERROR] Re-run Maven using the -X switch to enable full debug logging.
[ERROR] 
[ERROR] For more information about the errors and possible solutions, please read the following
articles:
[ERROR] [Help 1] http://cwiki.apache.org/confluence/display/MAVEN/MojoFailureException
[ERROR] 
[ERROR] After correcting the problems, you can resume the build with the command
[ERROR]   mvn <goals> -rf :hbase-server
Build step 'Invoke top-level Maven targets' marked build as failure
Performing Post build task...
Match found for :.* : True
Logical operation result is TRUE
Running script  : # Post-build task script. TODO: Check this in and have all builds reference
check-in.
pwd && ls
# NOTE!!!! The below code has been copied and pasted from ./dev-tools/run-test.sh
# Do not change here without syncing there and vice-versa.
ZOMBIE_TESTS_COUNT=`jps -v | grep surefirebooter | grep -e '-Dhbase.test' | wc -l`
if [[ $ZOMBIE_TESTS_COUNT != 0 ]] ; then
 echo "Suspicious java process found - waiting 30s to see if there are just slow to stop"
 sleep 30
 ZOMBIE_TESTS_COUNT=`jps -v | grep surefirebooter | grep -e '-Dhbase.test' | wc -l`
 if [[ $ZOMBIE_TESTS_COUNT != 0 ]] ; then
   echo " {color:red}There appear to be $ZOMBIE_TESTS_COUNT zombie tests{color}, they should
have been killed by surefire but survived"
   jps -v | grep surefirebooter | grep -e '-Dhbase.test'
   jps -v | grep surefirebooter | grep -e '-Dhbase.test' | cut -d ' ' -f 1 | xargs -n 1 jstack
   # Exit with error
   exit 1
 else
   echo "We're ok: there is no zombie test, but some tests took some time to stop"
 fi
else
  echo "We're ok: there is no zombie test"
fi
Setting JDK_1_7_LATEST__HOME=/home/jenkins/tools/java/latest1.7
Setting JDK_1_8_LATEST__HOME=/home/jenkins/tools/java/latest1.8
[30b16b4c] $ /bin/bash -xe /tmp/jenkins486613547298633256.sh
+ pwd
<https://builds.apache.org/job/HBase-1.4/jdk=JDK_1_8,label=Hadoop&&!H13/ws/>
+ ls
bin
CHANGES.txt
conf
dev-support
extra_env_var
hbase-annotations
hbase-archetypes
hbase-assembly
hbase-checkstyle
hbase-client
hbase-common
hbase-examples
hbase-external-blockcache
hbase-hadoop2-compat
hbase-hadoop-compat
hbase-it
hbase-metrics
hbase-metrics-api
hbase-native-client
hbase-prefix-tree
hbase-procedure
hbase-protocol
hbase-resource-bundle
hbase-rest
hbase-server
hbase-shaded
hbase-shell
hbase-testing-util
hbase-thrift
LICENSE.txt
NOTICE.txt
pom.xml
README.txt
src
target
++ jps -v
++ grep surefirebooter
++ grep -e -Dhbase.test
++ wc -l
+ ZOMBIE_TESTS_COUNT=0
+ [[ 0 != 0 ]]
+ echo 'We'\''re ok: there is no zombie test'
We're ok: there is no zombie test
POST BUILD TASK : SUCCESS
END OF POST BUILD TASK : 0
Archiving artifacts
Setting JDK_1_7_LATEST__HOME=/home/jenkins/tools/java/latest1.7
Setting JDK_1_8_LATEST__HOME=/home/jenkins/tools/java/latest1.8
Recording test results
Setting JDK_1_7_LATEST__HOME=/home/jenkins/tools/java/latest1.7
Setting JDK_1_8_LATEST__HOME=/home/jenkins/tools/java/latest1.8
Setting JDK_1_7_LATEST__HOME=/home/jenkins/tools/java/latest1.7
Setting JDK_1_8_LATEST__HOME=/home/jenkins/tools/java/latest1.8

Mime
View raw message