hbase-builds mailing list archives

Site index · List index
Message view « Date » · « Thread »
Top « Date » · « Thread »
From Apache Jenkins Server <jenk...@builds.apache.org>
Subject Build failed in Jenkins: HBase-2.0 » JDK 1.8 (latest),Hadoop #23
Date Sat, 10 Jun 2017 21:42:27 GMT
See <https://builds.apache.org/job/HBase-2.0/jdk=JDK%201.8%20(latest),label=Hadoop/23/display/redirect?page=changes>

Changes:

[apurtell] HBASE-18137 Replication gets stuck for empty WALs

------------------------------------------
[...truncated 335.67 KB...]
[WARNING] Some problems were encountered while building the effective model for org.apache.hbase:hbase-shell:jar:2.0.0-alpha-1
[WARNING] 'reporting.plugins.plugin.version' for org.scala-tools:maven-scala-plugin is missing.
@ org.apache.hbase:hbase:2.0.0-alpha-1, <https://builds.apache.org/job/HBase-2.0/jdk=JDK%201.8%20(latest),label=Hadoop/ws/pom.xml,>
line 3213, column 15
[WARNING] 
[WARNING] Some problems were encountered while building the effective model for org.apache.hbase:hbase-protocol-shaded:jar:2.0.0-alpha-1
[WARNING] 'reporting.plugins.plugin.version' for org.scala-tools:maven-scala-plugin is missing.
@ org.apache.hbase:hbase:2.0.0-alpha-1, <https://builds.apache.org/job/HBase-2.0/jdk=JDK%201.8%20(latest),label=Hadoop/ws/pom.xml,>
line 3213, column 15
[WARNING] 
[WARNING] Some problems were encountered while building the effective model for org.apache.hbase:hbase-protocol:jar:2.0.0-alpha-1
[WARNING] 'reporting.plugins.plugin.version' for org.scala-tools:maven-scala-plugin is missing.
@ org.apache.hbase:hbase:2.0.0-alpha-1, <https://builds.apache.org/job/HBase-2.0/jdk=JDK%201.8%20(latest),label=Hadoop/ws/pom.xml,>
line 3213, column 15
[WARNING] 
[WARNING] Some problems were encountered while building the effective model for org.apache.hbase:hbase-client:jar:2.0.0-alpha-1
[WARNING] 'reporting.plugins.plugin.version' for org.scala-tools:maven-scala-plugin is missing.
@ org.apache.hbase:hbase:2.0.0-alpha-1, <https://builds.apache.org/job/HBase-2.0/jdk=JDK%201.8%20(latest),label=Hadoop/ws/pom.xml,>
line 3213, column 15
[WARNING] 
[WARNING] Some problems were encountered while building the effective model for org.apache.hbase:hbase-hadoop-compat:jar:2.0.0-alpha-1
[WARNING] 'reporting.plugins.plugin.version' for org.scala-tools:maven-scala-plugin is missing.
@ org.apache.hbase:hbase:2.0.0-alpha-1, <https://builds.apache.org/job/HBase-2.0/jdk=JDK%201.8%20(latest),label=Hadoop/ws/pom.xml,>
line 3213, column 15
[WARNING] 
[WARNING] Some problems were encountered while building the effective model for org.apache.hbase:hbase-common:jar:2.0.0-alpha-1
[WARNING] 'reporting.plugins.plugin.version' for org.scala-tools:maven-scala-plugin is missing.
@ org.apache.hbase:hbase:2.0.0-alpha-1, <https://builds.apache.org/job/HBase-2.0/jdk=JDK%201.8%20(latest),label=Hadoop/ws/pom.xml,>
line 3213, column 15
[WARNING] 
[WARNING] Some problems were encountered while building the effective model for org.apache.hbase:hbase-procedure:jar:2.0.0-alpha-1
[WARNING] 'reporting.plugins.plugin.version' for org.scala-tools:maven-scala-plugin is missing.
@ org.apache.hbase:hbase:2.0.0-alpha-1, <https://builds.apache.org/job/HBase-2.0/jdk=JDK%201.8%20(latest),label=Hadoop/ws/pom.xml,>
line 3213, column 15
[WARNING] 
[WARNING] Some problems were encountered while building the effective model for org.apache.hbase:hbase-endpoint:jar:2.0.0-alpha-1
[WARNING] 'reporting.plugins.plugin.version' for org.scala-tools:maven-scala-plugin is missing.
@ org.apache.hbase:hbase:2.0.0-alpha-1, <https://builds.apache.org/job/HBase-2.0/jdk=JDK%201.8%20(latest),label=Hadoop/ws/pom.xml,>
line 3213, column 15
[WARNING] 
[WARNING] Some problems were encountered while building the effective model for org.apache.hbase:hbase-it:jar:2.0.0-alpha-1
[WARNING] 'reporting.plugins.plugin.version' for org.scala-tools:maven-scala-plugin is missing.
@ org.apache.hbase:hbase:2.0.0-alpha-1, <https://builds.apache.org/job/HBase-2.0/jdk=JDK%201.8%20(latest),label=Hadoop/ws/pom.xml,>
line 3213, column 15
[WARNING] 
[WARNING] Some problems were encountered while building the effective model for org.apache.hbase:hbase-examples:jar:2.0.0-alpha-1
[WARNING] 'reporting.plugins.plugin.version' for org.scala-tools:maven-scala-plugin is missing.
@ org.apache.hbase:hbase:2.0.0-alpha-1, <https://builds.apache.org/job/HBase-2.0/jdk=JDK%201.8%20(latest),label=Hadoop/ws/pom.xml,>
line 3213, column 15
[WARNING] 
[WARNING] Some problems were encountered while building the effective model for org.apache.hbase:hbase-prefix-tree:jar:2.0.0-alpha-1
[WARNING] 'reporting.plugins.plugin.version' for org.scala-tools:maven-scala-plugin is missing.
@ org.apache.hbase:hbase:2.0.0-alpha-1, <https://builds.apache.org/job/HBase-2.0/jdk=JDK%201.8%20(latest),label=Hadoop/ws/pom.xml,>
line 3213, column 15
[WARNING] 
[WARNING] Some problems were encountered while building the effective model for org.apache.hbase:hbase-assembly:pom:2.0.0-alpha-1
[WARNING] 'reporting.plugins.plugin.version' for org.scala-tools:maven-scala-plugin is missing.
@ org.apache.hbase:hbase:2.0.0-alpha-1, <https://builds.apache.org/job/HBase-2.0/jdk=JDK%201.8%20(latest),label=Hadoop/ws/pom.xml,>
line 3213, column 15
[WARNING] 
[WARNING] Some problems were encountered while building the effective model for org.apache.hbase:hbase-testing-util:jar:2.0.0-alpha-1
[WARNING] 'reporting.plugins.plugin.version' for org.scala-tools:maven-scala-plugin is missing.
@ org.apache.hbase:hbase:2.0.0-alpha-1, <https://builds.apache.org/job/HBase-2.0/jdk=JDK%201.8%20(latest),label=Hadoop/ws/pom.xml,>
line 3213, column 15
[WARNING] 
[WARNING] Some problems were encountered while building the effective model for org.apache.hbase:hbase-annotations:jar:2.0.0-alpha-1
[WARNING] 'reporting.plugins.plugin.version' for org.scala-tools:maven-scala-plugin is missing.
@ org.apache.hbase:hbase:2.0.0-alpha-1, <https://builds.apache.org/job/HBase-2.0/jdk=JDK%201.8%20(latest),label=Hadoop/ws/pom.xml,>
line 3213, column 15
[WARNING] 
[WARNING] Some problems were encountered while building the effective model for org.apache.hbase:hbase-rest:jar:2.0.0-alpha-1
[WARNING] 'reporting.plugins.plugin.version' for org.scala-tools:maven-scala-plugin is missing.
@ org.apache.hbase:hbase:2.0.0-alpha-1, <https://builds.apache.org/job/HBase-2.0/jdk=JDK%201.8%20(latest),label=Hadoop/ws/pom.xml,>
line 3213, column 15
[WARNING] 
[WARNING] Some problems were encountered while building the effective model for org.apache.hbase:hbase-checkstyle:jar:2.0.0-alpha-1
[WARNING] 'reporting.plugins.plugin.version' for org.scala-tools:maven-scala-plugin is missing.
@ org.apache.hbase:hbase:2.0.0-alpha-1, <https://builds.apache.org/job/HBase-2.0/jdk=JDK%201.8%20(latest),label=Hadoop/ws/pom.xml,>
line 3213, column 15
[WARNING] 
[WARNING] Some problems were encountered while building the effective model for org.apache.hbase:hbase-external-blockcache:jar:2.0.0-alpha-1
[WARNING] 'reporting.plugins.plugin.version' for org.scala-tools:maven-scala-plugin is missing.
@ org.apache.hbase:hbase:2.0.0-alpha-1, <https://builds.apache.org/job/HBase-2.0/jdk=JDK%201.8%20(latest),label=Hadoop/ws/pom.xml,>
line 3213, column 15
[WARNING] 
[WARNING] Some problems were encountered while building the effective model for org.apache.hbase:hbase-shaded-client:jar:2.0.0-alpha-1
[WARNING] 'reporting.plugins.plugin.version' for org.scala-tools:maven-scala-plugin is missing.
@ org.apache.hbase:hbase:2.0.0-alpha-1, <https://builds.apache.org/job/HBase-2.0/jdk=JDK%201.8%20(latest),label=Hadoop/ws/pom.xml,>
line 3213, column 15
[WARNING] 
[WARNING] Some problems were encountered while building the effective model for org.apache.hbase:hbase-shaded-server:jar:2.0.0-alpha-1
[WARNING] 'reporting.plugins.plugin.version' for org.scala-tools:maven-scala-plugin is missing.
@ org.apache.hbase:hbase:2.0.0-alpha-1, <https://builds.apache.org/job/HBase-2.0/jdk=JDK%201.8%20(latest),label=Hadoop/ws/pom.xml,>
line 3213, column 15
[WARNING] 
[WARNING] Some problems were encountered while building the effective model for org.apache.hbase:hbase-shaded:pom:2.0.0-alpha-1
[WARNING] 'reporting.plugins.plugin.version' for org.scala-tools:maven-scala-plugin is missing.
@ org.apache.hbase:hbase:2.0.0-alpha-1, <https://builds.apache.org/job/HBase-2.0/jdk=JDK%201.8%20(latest),label=Hadoop/ws/pom.xml,>
line 3213, column 15
[WARNING] 
[WARNING] Some problems were encountered while building the effective model for org.apache.hbase:hbase-spark:jar:2.0.0-alpha-1
[WARNING] 'reporting.plugins.plugin.version' for org.scala-tools:maven-scala-plugin is missing.
@ org.apache.hbase:hbase:2.0.0-alpha-1, <https://builds.apache.org/job/HBase-2.0/jdk=JDK%201.8%20(latest),label=Hadoop/ws/pom.xml,>
line 3213, column 15
[WARNING] 
[WARNING] Some problems were encountered while building the effective model for org.apache.hbase:hbase-client-project:jar:2.0.0-alpha-1
[WARNING] 'reporting.plugins.plugin.version' for org.scala-tools:maven-scala-plugin is missing.
@ org.apache.hbase:hbase:2.0.0-alpha-1, <https://builds.apache.org/job/HBase-2.0/jdk=JDK%201.8%20(latest),label=Hadoop/ws/pom.xml,>
line 3213, column 15
[WARNING] 
[WARNING] Some problems were encountered while building the effective model for org.apache.hbase:hbase-shaded-client-project:jar:2.0.0-alpha-1
[WARNING] 'reporting.plugins.plugin.version' for org.scala-tools:maven-scala-plugin is missing.
@ org.apache.hbase:hbase:2.0.0-alpha-1, <https://builds.apache.org/job/HBase-2.0/jdk=JDK%201.8%20(latest),label=Hadoop/ws/pom.xml,>
line 3213, column 15
[WARNING] 
[WARNING] Some problems were encountered while building the effective model for org.apache.hbase:hbase-archetype-builder:pom:2.0.0-alpha-1
[WARNING] 'reporting.plugins.plugin.version' for org.scala-tools:maven-scala-plugin is missing.
@ org.apache.hbase:hbase:2.0.0-alpha-1, <https://builds.apache.org/job/HBase-2.0/jdk=JDK%201.8%20(latest),label=Hadoop/ws/pom.xml,>
line 3213, column 15
[WARNING] 
[WARNING] Some problems were encountered while building the effective model for org.apache.hbase:hbase-archetypes:pom:2.0.0-alpha-1
[WARNING] 'reporting.plugins.plugin.version' for org.scala-tools:maven-scala-plugin is missing.
@ org.apache.hbase:hbase:2.0.0-alpha-1, <https://builds.apache.org/job/HBase-2.0/jdk=JDK%201.8%20(latest),label=Hadoop/ws/pom.xml,>
line 3213, column 15
[WARNING] 
[WARNING] Some problems were encountered while building the effective model for org.apache.hbase:hbase-metrics-api:jar:2.0.0-alpha-1
[WARNING] 'reporting.plugins.plugin.version' for org.scala-tools:maven-scala-plugin is missing.
@ org.apache.hbase:hbase:2.0.0-alpha-1, <https://builds.apache.org/job/HBase-2.0/jdk=JDK%201.8%20(latest),label=Hadoop/ws/pom.xml,>
line 3213, column 15
[WARNING] 
[WARNING] Some problems were encountered while building the effective model for org.apache.hbase:hbase-metrics:jar:2.0.0-alpha-1
[WARNING] 'reporting.plugins.plugin.version' for org.scala-tools:maven-scala-plugin is missing.
@ org.apache.hbase:hbase:2.0.0-alpha-1, <https://builds.apache.org/job/HBase-2.0/jdk=JDK%201.8%20(latest),label=Hadoop/ws/pom.xml,>
line 3213, column 15
[WARNING] 
[WARNING] Some problems were encountered while building the effective model for org.apache.hbase:hbase-rsgroup:jar:2.0.0-alpha-1
[WARNING] 'reporting.plugins.plugin.version' for org.scala-tools:maven-scala-plugin is missing.
@ org.apache.hbase:hbase:2.0.0-alpha-1, <https://builds.apache.org/job/HBase-2.0/jdk=JDK%201.8%20(latest),label=Hadoop/ws/pom.xml,>
line 3213, column 15
[WARNING] 
[WARNING] Some problems were encountered while building the effective model for org.apache.hbase:hbase-hadoop2-compat:jar:2.0.0-alpha-1
[WARNING] 'reporting.plugins.plugin.version' for org.scala-tools:maven-scala-plugin is missing.
@ org.apache.hbase:hbase:2.0.0-alpha-1, <https://builds.apache.org/job/HBase-2.0/jdk=JDK%201.8%20(latest),label=Hadoop/ws/pom.xml,>
line 3213, column 15
[WARNING] 
[WARNING] Some problems were encountered while building the effective model for org.apache.hbase:hbase:pom:2.0.0-alpha-1
[WARNING] 'reporting.plugins.plugin.version' for org.scala-tools:maven-scala-plugin is missing.
@ line 3213, column 15
[WARNING] 
[WARNING] It is highly recommended to fix these problems because they threaten the stability
of your build.
[WARNING] 
[WARNING] For this reason, future Maven versions might no longer support building such malformed
projects.
[WARNING] 
[INFO] ------------------------------------------------------------------------
[INFO] Detecting the operating system and CPU architecture
[INFO] ------------------------------------------------------------------------
[INFO] os.detected.name: linux
[INFO] os.detected.arch: x86_64
[INFO] os.detected.version: 4.4
[INFO] os.detected.version.major: 4
[INFO] os.detected.version.minor: 4
[INFO] os.detected.release: ubuntu
[INFO] os.detected.release.version: 16.04
[INFO] os.detected.release.like.ubuntu: true
[INFO] os.detected.release.like.debian: true
[INFO] os.detected.classifier: linux-x86_64
[WARNING] Failed to inject repository session properties.
java.lang.NoSuchMethodError: org.apache.maven.execution.MavenSession.getRepositorySession()Lorg/eclipse/aether/RepositorySystemSession;
	at kr.motd.maven.os.RepositorySessionInjector.injectRepositorySession(RepositorySessionInjector.java:22)
	at kr.motd.maven.os.DetectExtension.injectSession(DetectExtension.java:151)
	at kr.motd.maven.os.DetectExtension.afterProjectsRead(DetectExtension.java:110)
	at org.apache.maven.DefaultMaven.doExecute(DefaultMaven.java:274)
	at org.apache.maven.DefaultMaven.execute(DefaultMaven.java:156)
	at org.apache.maven.cli.MavenCli.execute(MavenCli.java:537)
	at org.apache.maven.cli.MavenCli.doMain(MavenCli.java:196)
	at org.apache.maven.cli.MavenCli.main(MavenCli.java:141)
	at sun.reflect.NativeMethodAccessorImpl.invoke0(Native Method)
	at sun.reflect.NativeMethodAccessorImpl.invoke(NativeMethodAccessorImpl.java:62)
	at sun.reflect.DelegatingMethodAccessorImpl.invoke(DelegatingMethodAccessorImpl.java:43)
	at java.lang.reflect.Method.invoke(Method.java:498)
	at org.codehaus.plexus.classworlds.launcher.Launcher.launchEnhanced(Launcher.java:290)
	at org.codehaus.plexus.classworlds.launcher.Launcher.launch(Launcher.java:230)
	at org.codehaus.plexus.classworlds.launcher.Launcher.mainWithExitCode(Launcher.java:409)
	at org.codehaus.plexus.classworlds.launcher.Launcher.main(Launcher.java:352)
[INFO] ------------------------------------------------------------------------
[INFO] Reactor Build Order:
[INFO] 
[INFO] Apache HBase
[INFO] Apache HBase - Checkstyle
[INFO] Apache HBase - Resource Bundle
[INFO] Apache HBase - Annotations
[INFO] Apache HBase - Common
[INFO] Apache HBase - Shaded Protocol
[INFO] Apache HBase - Metrics API
[INFO] Apache HBase - Procedure
[INFO] Apache HBase - Hadoop Compatibility
[INFO] Apache HBase - Metrics Implementation
[INFO] Apache HBase - Hadoop Two Compatibility
[INFO] Apache HBase - Protocol
[INFO] Apache HBase - Client
[INFO] Apache HBase - Prefix Tree
[INFO] Apache HBase - Server
[INFO] Apache HBase - Testing Util
[INFO] Apache HBase - Thrift
[INFO] Apache HBase - RSGroup
[INFO] Apache HBase - Shell
[INFO] Apache HBase - Coprocessor Endpoint
[INFO] Apache HBase - Integration Tests
[INFO] Apache HBase - Examples
[INFO] Apache HBase - Rest
[INFO] Apache HBase - External Block Cache
[INFO] Apache HBase - Spark
[INFO] Apache HBase - Assembly
[INFO] Apache HBase - Shaded
[INFO] Apache HBase - Shaded - Client
[INFO] Apache HBase - Shaded - Server
[INFO] Apache HBase - Archetypes
[INFO] Apache HBase - Exemplar for hbase-client archetype
[INFO] Apache HBase - Exemplar for hbase-shaded-client archetype
[INFO] Apache HBase - Archetype builder
[INFO]                                                                         
[INFO] ------------------------------------------------------------------------
[INFO] Building Apache HBase 2.0.0-alpha-1
[INFO] ------------------------------------------------------------------------
[INFO] 
[INFO] --- maven-enforcer-plugin:1.4:enforce (min-maven-min-java-banned-xerces) @ hbase ---
[INFO] 
[INFO] --- maven-enforcer-plugin:1.4:enforce (banned-jsr305) @ hbase ---
[INFO] 
[INFO] --- buildnumber-maven-plugin:1.3:create-timestamp (default) @ hbase ---
[INFO] 
[INFO] --- maven-remote-resources-plugin:1.5:process (process-resource-bundles) @ hbase ---
[INFO] 
[INFO] --- findbugs-maven-plugin:3.0.0:findbugs (default) @ hbase ---
[INFO] 
[INFO] --- maven-site-plugin:3.4:attach-descriptor (attach-descriptor) @ hbase ---
[INFO] 
[INFO] --- maven-checkstyle-plugin:2.17:checkstyle (default-cli) @ hbase ---
[INFO] ------------------------------------------------------------------------
[INFO] Reactor Summary:
[INFO] 
[INFO] Apache HBase ...................................... FAILURE [1.933s]
[INFO] Apache HBase - Checkstyle ......................... SKIPPED
[INFO] Apache HBase - Resource Bundle .................... SKIPPED
[INFO] Apache HBase - Annotations ........................ SKIPPED
[INFO] Apache HBase - Common ............................. SKIPPED
[INFO] Apache HBase - Shaded Protocol .................... SKIPPED
[INFO] Apache HBase - Metrics API ........................ SKIPPED
[INFO] Apache HBase - Procedure .......................... SKIPPED
[INFO] Apache HBase - Hadoop Compatibility ............... SKIPPED
[INFO] Apache HBase - Metrics Implementation ............. SKIPPED
[INFO] Apache HBase - Hadoop Two Compatibility ........... SKIPPED
[INFO] Apache HBase - Protocol ........................... SKIPPED
[INFO] Apache HBase - Client ............................. SKIPPED
[INFO] Apache HBase - Prefix Tree ........................ SKIPPED
[INFO] Apache HBase - Server ............................. SKIPPED
[INFO] Apache HBase - Testing Util ....................... SKIPPED
[INFO] Apache HBase - Thrift ............................. SKIPPED
[INFO] Apache HBase - RSGroup ............................ SKIPPED
[INFO] Apache HBase - Shell .............................. SKIPPED
[INFO] Apache HBase - Coprocessor Endpoint ............... SKIPPED
[INFO] Apache HBase - Integration Tests .................. SKIPPED
[INFO] Apache HBase - Examples ........................... SKIPPED
[INFO] Apache HBase - Rest ............................... SKIPPED
[INFO] Apache HBase - External Block Cache ............... SKIPPED
[INFO] Apache HBase - Spark .............................. SKIPPED
[INFO] Apache HBase - Assembly ........................... SKIPPED
[INFO] Apache HBase - Shaded ............................. SKIPPED
[INFO] Apache HBase - Shaded - Client .................... SKIPPED
[INFO] Apache HBase - Shaded - Server .................... SKIPPED
[INFO] Apache HBase - Archetypes ......................... SKIPPED
[INFO] Apache HBase - Exemplar for hbase-client archetype  SKIPPED
[INFO] Apache HBase - Exemplar for hbase-shaded-client archetype  SKIPPED
[INFO] Apache HBase - Archetype builder .................. SKIPPED
[INFO] ------------------------------------------------------------------------
[INFO] BUILD FAILURE
[INFO] ------------------------------------------------------------------------
[INFO] Total time: 3.442s
[INFO] Finished at: Sat Jun 10 21:40:38 UTC 2017
[INFO] Final Memory: 47M/1825M
[INFO] ------------------------------------------------------------------------
[ERROR] Failed to execute goal org.apache.maven.plugins:maven-checkstyle-plugin:2.17:checkstyle
(default-cli) on project hbase: Execution default-cli of goal org.apache.maven.plugins:maven-checkstyle-plugin:2.17:checkstyle
failed: Plugin org.apache.maven.plugins:maven-checkstyle-plugin:2.17 or one of its dependencies
could not be resolved: Failure to find org.apache.hbase:hbase-checkstyle:jar:2.0.0-alpha-1
in http://repository.apache.org/snapshots was cached in the local repository, resolution will
not be reattempted until the update interval of Nexus has elapsed or updates are forced ->
[Help 1]
[ERROR] 
[ERROR] To see the full stack trace of the errors, re-run Maven with the -e switch.
[ERROR] Re-run Maven using the -X switch to enable full debug logging.
[ERROR] 
[ERROR] For more information about the errors and possible solutions, please read the following
articles:
[ERROR] [Help 1] http://cwiki.apache.org/confluence/display/MAVEN/PluginResolutionException
Build step 'Invoke top-level Maven targets' marked build as failure
Performing Post build task...
Match found for :.* : True
Logical operation result is TRUE
Running script  : # Run zombie detector script
./dev-support/zombie-detector.sh --jenkins ${BUILD_ID}
[a3159d73] $ /bin/bash -xe /tmp/hudson5877329887733477816.sh
+ ./dev-support/zombie-detector.sh --jenkins 23
Sat Jun 10 21:40:39 UTC 2017 We're ok: there is no zombie test


    {color:green}+1 zombies{color}. No zombie tests found running at the end of the build.
POST BUILD TASK : SUCCESS
END OF POST BUILD TASK : 0
Archiving artifacts
Compressed 4.52 MB of artifacts by 42.2% relative to #5
Recording test results
ERROR: Step ?Publish JUnit test result report? failed: No test report files were found. Configuration
error?
[FINDBUGS] Skipping publisher since build result is FAILURE
[CHECKSTYLE] Skipping publisher since build result is FAILURE

Mime
View raw message