hbase-builds mailing list archives

Site index · List index
Message view « Date » · « Thread »
Top « Date » · « Thread »
From Apache Jenkins Server <jenk...@builds.apache.org>
Subject Build failed in Jenkins: HBase-HBASE-14614 » JDK 1.8 (latest),Hadoop #167
Date Sun, 23 Apr 2017 13:23:29 GMT
See <https://builds.apache.org/job/HBase-HBASE-14614/jdk=JDK%201.8%20(latest),label=Hadoop/167/display/redirect>

------------------------------------------
Started by upstream project "HBase-HBASE-14614" build number 167
originally caused by:
 Started by timer
[EnvInject] - Loading node environment variables.
Building remotely on H10 (Hadoop) in workspace <https://builds.apache.org/job/HBase-HBASE-14614/jdk=JDK%201.8%20(latest),label=Hadoop/ws/>
Cloning the remote Git repository
Cloning repository https://git-wip-us.apache.org/repos/asf/hbase.git
 > git init <https://builds.apache.org/job/HBase-HBASE-14614/jdk=JDK%201.8%20(latest),label=Hadoop/ws/>
# timeout=10
Fetching upstream changes from https://git-wip-us.apache.org/repos/asf/hbase.git
 > git --version # timeout=10
 > git fetch --tags --progress https://git-wip-us.apache.org/repos/asf/hbase.git +refs/heads/*:refs/remotes/origin/*
 > git config remote.origin.url https://git-wip-us.apache.org/repos/asf/hbase.git # timeout=10
 > git config --add remote.origin.fetch +refs/heads/*:refs/remotes/origin/* # timeout=10
 > git config remote.origin.url https://git-wip-us.apache.org/repos/asf/hbase.git # timeout=10
Cleaning workspace
 > git rev-parse --verify HEAD # timeout=10
No valid HEAD. Skipping the resetting
 > git clean -fdx # timeout=10
Fetching upstream changes from https://git-wip-us.apache.org/repos/asf/hbase.git
 > git fetch --tags --progress https://git-wip-us.apache.org/repos/asf/hbase.git +refs/heads/*:refs/remotes/origin/*
Checking out Revision 8faab93a9c5a25ea141d6d750aa31776ef078f66 (refs/remotes/origin/HBASE-14614)
 > git config core.sparsecheckout # timeout=10
 > git checkout -f 8faab93a9c5a25ea141d6d750aa31776ef078f66
FATAL: Could not checkout 8faab93a9c5a25ea141d6d750aa31776ef078f66
hudson.plugins.git.GitException: Could not checkout 8faab93a9c5a25ea141d6d750aa31776ef078f66
	at org.jenkinsci.plugins.gitclient.CliGitAPIImpl$9.execute(CliGitAPIImpl.java:2107)
	at org.jenkinsci.plugins.gitclient.RemoteGitImpl$CommandInvocationHandler$1.call(RemoteGitImpl.java:153)
	at org.jenkinsci.plugins.gitclient.RemoteGitImpl$CommandInvocationHandler$1.call(RemoteGitImpl.java:146)
	at hudson.remoting.UserRequest.perform(UserRequest.java:153)
	at hudson.remoting.UserRequest.perform(UserRequest.java:50)
	at hudson.remoting.Request$2.run(Request.java:336)
	at hudson.remoting.InterceptingExecutorService$1.call(InterceptingExecutorService.java:68)
	at java.util.concurrent.FutureTask.run(FutureTask.java:262)
	at java.util.concurrent.ThreadPoolExecutor.runWorker(ThreadPoolExecutor.java:1145)
	at java.util.concurrent.ThreadPoolExecutor$Worker.run(ThreadPoolExecutor.java:615)
	at java.lang.Thread.run(Thread.java:745)
	at ......remote call to H10(Native Method)
	at hudson.remoting.Channel.attachCallSiteStackTrace(Channel.java:1537)
	at hudson.remoting.UserResponse.retrieve(UserRequest.java:253)
	at hudson.remoting.Channel.call(Channel.java:822)
	at org.jenkinsci.plugins.gitclient.RemoteGitImpl$CommandInvocationHandler.execute(RemoteGitImpl.java:146)
	at sun.reflect.GeneratedMethodAccessor862.invoke(Unknown Source)
	at sun.reflect.DelegatingMethodAccessorImpl.invoke(DelegatingMethodAccessorImpl.java:43)
	at java.lang.reflect.Method.invoke(Method.java:498)
	at org.jenkinsci.plugins.gitclient.RemoteGitImpl$CommandInvocationHandler.invoke(RemoteGitImpl.java:132)
	at com.sun.proxy.$Proxy127.execute(Unknown Source)
	at hudson.plugins.git.GitSCM.checkout(GitSCM.java:1149)
	at hudson.scm.SCM.checkout(SCM.java:495)
	at hudson.model.AbstractProject.checkout(AbstractProject.java:1278)
	at hudson.model.AbstractBuild$AbstractBuildExecution.defaultCheckout(AbstractBuild.java:604)
	at jenkins.scm.SCMCheckoutStrategy.checkout(SCMCheckoutStrategy.java:86)
	at hudson.model.AbstractBuild$AbstractBuildExecution.run(AbstractBuild.java:529)
	at hudson.model.Run.execute(Run.java:1728)
	at hudson.matrix.MatrixRun.run(MatrixRun.java:146)
	at hudson.model.ResourceController.execute(ResourceController.java:98)
	at hudson.model.Executor.run(Executor.java:404)
Caused by: hudson.plugins.git.GitException: Command "git checkout -f 8faab93a9c5a25ea141d6d750aa31776ef078f66"
returned status code 128:
stdout: 
stderr: fatal: reference is not a tree: 8faab93a9c5a25ea141d6d750aa31776ef078f66

	at org.jenkinsci.plugins.gitclient.CliGitAPIImpl.launchCommandIn(CliGitAPIImpl.java:1799)
	at org.jenkinsci.plugins.gitclient.CliGitAPIImpl.access$800(CliGitAPIImpl.java:65)
	at org.jenkinsci.plugins.gitclient.CliGitAPIImpl$9.execute(CliGitAPIImpl.java:2084)
	at org.jenkinsci.plugins.gitclient.RemoteGitImpl$CommandInvocationHandler$1.call(RemoteGitImpl.java:153)
	at org.jenkinsci.plugins.gitclient.RemoteGitImpl$CommandInvocationHandler$1.call(RemoteGitImpl.java:146)
	at hudson.remoting.UserRequest.perform(UserRequest.java:153)
	at hudson.remoting.UserRequest.perform(UserRequest.java:50)
	at hudson.remoting.Request$2.run(Request.java:336)
	at hudson.remoting.InterceptingExecutorService$1.call(InterceptingExecutorService.java:68)
	at java.util.concurrent.FutureTask.run(FutureTask.java:262)
	at java.util.concurrent.ThreadPoolExecutor.runWorker(ThreadPoolExecutor.java:1145)
	at java.util.concurrent.ThreadPoolExecutor$Worker.run(ThreadPoolExecutor.java:615)
	at java.lang.Thread.run(Thread.java:745)
Performing Post build task...
Match found for :.* : True
Logical operation result is TRUE
Running script  : # Run zombie detector script
./dev-support/zombie-detector.sh --jenkins ${BUILD_ID}
[a3159d73] $ /bin/bash -xe /tmp/hudson2075272264290657745.sh
+ ./dev-support/zombie-detector.sh --jenkins 167
/tmp/hudson2075272264290657745.sh: line 3: ./dev-support/zombie-detector.sh: No such file
or directory
POST BUILD TASK : FAILURE
END OF POST BUILD TASK : 0
Archiving artifacts
Recording test results
ERROR: Step ?Publish JUnit test result report? failed: No test report files were found. Configuration
error?
[FINDBUGS] Skipping publisher since build result is FAILURE
[CHECKSTYLE] Skipping publisher since build result is FAILURE

Mime
View raw message