hbase-builds mailing list archives

Site index · List index
Message view « Date » · « Thread »
Top « Date » · « Thread »
From Apache Jenkins Server <jenk...@builds.apache.org>
Subject Build failed in Jenkins: HBase-HBASE-14614 » JDK 1.8 (latest),Hadoop #159
Date Thu, 20 Apr 2017 19:19:11 GMT
See <https://builds.apache.org/job/HBase-HBASE-14614/jdk=JDK%201.8%20(latest),label=Hadoop/159/display/redirect>

------------------------------------------
[...truncated 880.66 KB...]
[INFO] --- maven-archetype-plugin:2.4:jar (default-jar) @ hbase-client-project-archetype ---
[INFO] Building archetype jar: <https://builds.apache.org/job/HBase-HBASE-14614/jdk=JDK%201.8%20(latest),label=Hadoop/ws/hbase-archetypes/hbase-client-project/target/build-archetype/target/generated-sources/archetype/target/hbase-client-project-archetype-2.0.0-SNAPSHOT>
[INFO] ------------------------------------------------------------------------
[INFO] BUILD SUCCESS
[INFO] ------------------------------------------------------------------------
[INFO] Total time: 1.876s
[INFO] Finished at: Thu Apr 20 19:17:36 UTC 2017
[INFO] Final Memory: 20M/724M
[INFO] ------------------------------------------------------------------------
[INFO] Archetype project created in <https://builds.apache.org/job/HBase-HBASE-14614/jdk=JDK%201.8%20(latest),label=Hadoop/ws/hbase-archetypes/hbase-client-project/target/build-archetype/target/generated-sources/archetype>
[INFO] ------------------------------------------------------------------------
[INFO] BUILD SUCCESS
[INFO] ------------------------------------------------------------------------
[INFO] Total time: 6.354s
[INFO] Finished at: Thu Apr 20 19:17:36 UTC 2017
[INFO] Final Memory: 21M/724M
[INFO] ------------------------------------------------------------------------
[INFO] Scanning for projects...
[INFO]                                                                         
[INFO] ------------------------------------------------------------------------
[INFO] Building Apache HBase - Exemplar for hbase-shaded-client archetype 2.0.0-SNAPSHOT
[INFO] ------------------------------------------------------------------------
[INFO] 
[INFO] >>> maven-archetype-plugin:2.4:create-from-project (default-cli) @ hbase-shaded-client-project
>>>
[INFO] 
[INFO] <<< maven-archetype-plugin:2.4:create-from-project (default-cli) @ hbase-shaded-client-project
<<<
[INFO] 
[INFO] --- maven-archetype-plugin:2.4:create-from-project (default-cli) @ hbase-shaded-client-project
---
[INFO] Setting default groupId: org.apache.hbase
[INFO] Setting default artifactId: hbase-shaded-client-project
[INFO] Setting default version: 2.0.0-SNAPSHOT
[INFO] Setting default package: org.apache.hbase.archetypes.exemplars.shaded_client
[INFO] Scanning for projects...
[INFO]                                                                         
[INFO] ------------------------------------------------------------------------
[INFO] Building hbase-shaded-client-project-archetype 2.0.0-SNAPSHOT
[INFO] ------------------------------------------------------------------------
[INFO] 
[INFO] --- maven-resources-plugin:3.0.1:resources (default-resources) @ hbase-shaded-client-project-archetype
---
[WARNING] Using platform encoding (ISO-8859-1 actually) to copy filtered resources, i.e. build
is platform dependent!
[INFO] Copying 6 resources
[INFO] 
[INFO] --- maven-resources-plugin:3.0.1:testResources (default-testResources) @ hbase-shaded-client-project-archetype
---
[WARNING] Using platform encoding (ISO-8859-1 actually) to copy filtered resources, i.e. build
is platform dependent!
[INFO] Copying 2 resources
[INFO] 
[INFO] --- maven-archetype-plugin:2.4:jar (default-jar) @ hbase-shaded-client-project-archetype
---
[INFO] Building archetype jar: <https://builds.apache.org/job/HBase-HBASE-14614/jdk=JDK%201.8%20(latest),label=Hadoop/ws/hbase-archetypes/hbase-shaded-client-project/target/build-archetype/target/generated-sources/archetype/target/hbase-shaded-client-project-archetype-2.0.0-SNAPSHOT>
[INFO] ------------------------------------------------------------------------
[INFO] BUILD SUCCESS
[INFO] ------------------------------------------------------------------------
[INFO] Total time: 1.829s
[INFO] Finished at: Thu Apr 20 19:17:43 UTC 2017
[INFO] Final Memory: 20M/724M
[INFO] ------------------------------------------------------------------------
[INFO] Archetype project created in <https://builds.apache.org/job/HBase-HBASE-14614/jdk=JDK%201.8%20(latest),label=Hadoop/ws/hbase-archetypes/hbase-shaded-client-project/target/build-archetype/target/generated-sources/archetype>
[INFO] ------------------------------------------------------------------------
[INFO] BUILD SUCCESS
[INFO] ------------------------------------------------------------------------
[INFO] Total time: 5.412s
[INFO] Finished at: Thu Apr 20 19:17:44 UTC 2017
[INFO] Final Memory: 21M/724M
[INFO] ------------------------------------------------------------------------
[INFO] 
[INFO] --- maven-resources-plugin:2.7:copy-resources (hbase-client-ARCHETYPE__copy-pom-to-temp-for-xslt-processing)
@ hbase-archetype-builder ---
[INFO] Using 'UTF-8' encoding to copy filtered resources.
[INFO] Copying 1 resource
[INFO] 
[INFO] --- maven-resources-plugin:2.7:copy-resources (hbase-shaded-client-ARCHETYPE__copy-pom-to-temp-for-xslt-processing)
@ hbase-archetype-builder ---
[INFO] Using 'UTF-8' encoding to copy filtered resources.
[INFO] Copying 1 resource
[INFO] 
[INFO] --- xml-maven-plugin:1.0.1:transform (modify-archetype-pom-files-via-xslt) @ hbase-archetype-builder
---
[INFO] Transforming file: <https://builds.apache.org/job/HBase-HBASE-14614/jdk=JDK%201.8%20(latest),label=Hadoop/159/artifact/hbase-archetypes/hbase-archetype-builder/../hbase-client-project/target/temp-arch/pom.xml>
[INFO] Transformed 1 file(s).
[INFO] Transforming file: <https://builds.apache.org/job/HBase-HBASE-14614/jdk=JDK%201.8%20(latest),label=Hadoop/159/artifact/hbase-archetypes/hbase-archetype-builder/../hbase-shaded-client-project/target/temp-arch/pom.xml>
[INFO] Transformed 1 file(s).
[INFO] 
[INFO] --- maven-install-plugin:2.5.2:install (default-install) @ hbase-archetype-builder
---
[INFO] Installing <https://builds.apache.org/job/HBase-HBASE-14614/jdk=JDK%201.8%20(latest),label=Hadoop/159/artifact/hbase-archetypes/hbase-archetype-builder/pom.xml>
to /home/jenkins/.m2/repository/org/apache/hbase/hbase-archetype-builder/2.0.0-SNAPSHOT/hbase-archetype-builder-2.0.0-SNAPSHOT.pom
[INFO] 
[INFO] --- exec-maven-plugin:1.4.0:exec (run-installArchetypes-script) @ hbase-archetype-builder
---
[INFO] Scanning for projects...
[INFO]                                                                         
[INFO] ------------------------------------------------------------------------
[INFO] Building hbase-client-project-archetype 2.0.0-SNAPSHOT
[INFO] ------------------------------------------------------------------------
[INFO] 
[INFO] --- maven-resources-plugin:3.0.1:resources (default-resources) @ hbase-client-project-archetype
---
[INFO] Using 'UTF-8' encoding to copy filtered resources.
[INFO] Copying 6 resources
[INFO] 
[INFO] --- maven-resources-plugin:3.0.1:testResources (default-testResources) @ hbase-client-project-archetype
---
[INFO] Using 'UTF-8' encoding to copy filtered resources.
[INFO] Copying 2 resources
[INFO] 
[INFO] --- maven-archetype-plugin:2.4:jar (default-jar) @ hbase-client-project-archetype ---
[INFO] Building archetype jar: <https://builds.apache.org/job/HBase-HBASE-14614/jdk=JDK%201.8%20(latest),label=Hadoop/ws/hbase-archetypes/hbase-client-project/target/build-archetype/target/generated-sources/archetype/target/hbase-client-project-archetype-2.0.0-SNAPSHOT>
[INFO] 
[INFO] --- maven-archetype-plugin:2.4:integration-test (default-integration-test) @ hbase-client-project-archetype
---
[INFO] Processing Archetype IT project: basic
[INFO] ----------------------------------------------------------------------------
[INFO] Using following parameters for creating project from Archetype: hbase-client-project-archetype:2.0.0-SNAPSHOT
[INFO] ----------------------------------------------------------------------------
[INFO] Parameter: groupId, Value: archetype.it
[INFO] Parameter: artifactId, Value: basic
[INFO] Parameter: version, Value: 0.1-SNAPSHOT
[INFO] Parameter: package, Value: it.pkg
[INFO] Parameter: packageInPathFormat, Value: it/pkg
[INFO] Parameter: version, Value: 0.1-SNAPSHOT
[INFO] Parameter: package, Value: it.pkg
[INFO] Parameter: groupId, Value: archetype.it
[INFO] Parameter: artifactId, Value: basic
[INFO] project created from Archetype in dir: <https://builds.apache.org/job/HBase-HBASE-14614/jdk=JDK%201.8%20(latest),label=Hadoop/ws/hbase-archetypes/hbase-client-project/target/build-archetype/target/generated-sources/archetype/target/test-classes/projects/basic/project/basic>
[INFO] 
[INFO] --- maven-install-plugin:2.5.2:install (default-install) @ hbase-client-project-archetype
---
[INFO] Installing <https://builds.apache.org/job/HBase-HBASE-14614/jdk=JDK%201.8%20(latest),label=Hadoop/ws/hbase-archetypes/hbase-client-project/target/build-archetype/target/generated-sources/archetype/target/hbase-client-project-archetype-2.0.0-SNAPSHOT.jar>
to /home/jenkins/.m2/repository/org/apache/hbase/hbase-client-project-archetype/2.0.0-SNAPSHOT/hbase-client-project-archetype-2.0.0-SNAPSHOT.jar
[INFO] Installing <https://builds.apache.org/job/HBase-HBASE-14614/jdk=JDK%201.8%20(latest),label=Hadoop/159/artifact/hbase-archetypes/hbase-client-project/target/build-archetype/target/generated-sources/archetype/pom.xml>
to /home/jenkins/.m2/repository/org/apache/hbase/hbase-client-project-archetype/2.0.0-SNAPSHOT/hbase-client-project-archetype-2.0.0-SNAPSHOT.pom
[INFO] 
[INFO] --- maven-archetype-plugin:2.4:update-local-catalog (default-update-local-catalog)
@ hbase-client-project-archetype ---
[INFO] ------------------------------------------------------------------------
[INFO] BUILD SUCCESS
[INFO] ------------------------------------------------------------------------
[INFO] Total time: 2.138s
[INFO] Finished at: Thu Apr 20 19:17:48 UTC 2017
[INFO] Final Memory: 23M/724M
[INFO] ------------------------------------------------------------------------
[INFO] Scanning for projects...
[INFO]                                                                         
[INFO] ------------------------------------------------------------------------
[INFO] Building hbase-shaded-client-project-archetype 2.0.0-SNAPSHOT
[INFO] ------------------------------------------------------------------------
[INFO] 
[INFO] --- maven-resources-plugin:3.0.1:resources (default-resources) @ hbase-shaded-client-project-archetype
---
[INFO] Using 'UTF-8' encoding to copy filtered resources.
[INFO] Copying 6 resources
[INFO] 
[INFO] --- maven-resources-plugin:3.0.1:testResources (default-testResources) @ hbase-shaded-client-project-archetype
---
[INFO] Using 'UTF-8' encoding to copy filtered resources.
[INFO] Copying 2 resources
[INFO] 
[INFO] --- maven-archetype-plugin:2.4:jar (default-jar) @ hbase-shaded-client-project-archetype
---
[INFO] Building archetype jar: <https://builds.apache.org/job/HBase-HBASE-14614/jdk=JDK%201.8%20(latest),label=Hadoop/ws/hbase-archetypes/hbase-shaded-client-project/target/build-archetype/target/generated-sources/archetype/target/hbase-shaded-client-project-archetype-2.0.0-SNAPSHOT>
[INFO] 
[INFO] --- maven-archetype-plugin:2.4:integration-test (default-integration-test) @ hbase-shaded-client-project-archetype
---
[INFO] Processing Archetype IT project: basic
[INFO] ----------------------------------------------------------------------------
[INFO] Using following parameters for creating project from Archetype: hbase-shaded-client-project-archetype:2.0.0-SNAPSHOT
[INFO] ----------------------------------------------------------------------------
[INFO] Parameter: groupId, Value: archetype.it
[INFO] Parameter: artifactId, Value: basic
[INFO] Parameter: version, Value: 0.1-SNAPSHOT
[INFO] Parameter: package, Value: it.pkg
[INFO] Parameter: packageInPathFormat, Value: it/pkg
[INFO] Parameter: version, Value: 0.1-SNAPSHOT
[INFO] Parameter: package, Value: it.pkg
[INFO] Parameter: groupId, Value: archetype.it
[INFO] Parameter: artifactId, Value: basic
[INFO] project created from Archetype in dir: <https://builds.apache.org/job/HBase-HBASE-14614/jdk=JDK%201.8%20(latest),label=Hadoop/ws/hbase-archetypes/hbase-shaded-client-project/target/build-archetype/target/generated-sources/archetype/target/test-classes/projects/basic/project/basic>
[INFO] 
[INFO] --- maven-install-plugin:2.5.2:install (default-install) @ hbase-shaded-client-project-archetype
---
[INFO] Installing <https://builds.apache.org/job/HBase-HBASE-14614/jdk=JDK%201.8%20(latest),label=Hadoop/ws/hbase-archetypes/hbase-shaded-client-project/target/build-archetype/target/generated-sources/archetype/target/hbase-shaded-client-project-archetype-2.0.0-SNAPSHOT.jar>
to /home/jenkins/.m2/repository/org/apache/hbase/hbase-shaded-client-project-archetype/2.0.0-SNAPSHOT/hbase-shaded-client-project-archetype-2.0.0-SNAPSHOT.jar
[INFO] Installing <https://builds.apache.org/job/HBase-HBASE-14614/jdk=JDK%201.8%20(latest),label=Hadoop/159/artifact/hbase-archetypes/hbase-shaded-client-project/target/build-archetype/target/generated-sources/archetype/pom.xml>
to /home/jenkins/.m2/repository/org/apache/hbase/hbase-shaded-client-project-archetype/2.0.0-SNAPSHOT/hbase-shaded-client-project-archetype-2.0.0-SNAPSHOT.pom
[INFO] 
[INFO] --- maven-archetype-plugin:2.4:update-local-catalog (default-update-local-catalog)
@ hbase-shaded-client-project-archetype ---
[INFO] ------------------------------------------------------------------------
[INFO] BUILD SUCCESS
[INFO] ------------------------------------------------------------------------
[INFO] Total time: 1.977s
[INFO] Finished at: Thu Apr 20 19:17:51 UTC 2017
[INFO] Final Memory: 21M/724M
[INFO] ------------------------------------------------------------------------
[INFO] ------------------------------------------------------------------------
[INFO] Reactor Summary:
[INFO] 
[INFO] Apache HBase ...................................... SUCCESS [4.298s]
[INFO] Apache HBase - Checkstyle ......................... SUCCESS [1.817s]
[INFO] Apache HBase - Resource Bundle .................... SUCCESS [0.587s]
[INFO] Apache HBase - Annotations ........................ SUCCESS [0.628s]
[INFO] Apache HBase - Common ............................. SUCCESS [2:29.188s]
[INFO] Apache HBase - Protocol ........................... SUCCESS [1.523s]
[INFO] Apache HBase - Shaded Protocol .................... SUCCESS [2.161s]
[INFO] Apache HBase - Procedure .......................... SUCCESS [3:29.215s]
[INFO] Apache HBase - Client ............................. SUCCESS [2:30.647s]
[INFO] Apache HBase - Metrics API ........................ SUCCESS [3.124s]
[INFO] Apache HBase - Hadoop Compatibility ............... SUCCESS [12.519s]
[INFO] Apache HBase - Metrics Implementation ............. SUCCESS [7.392s]
[INFO] Apache HBase - Hadoop Two Compatibility ........... SUCCESS [19.438s]
[INFO] Apache HBase - Prefix Tree ........................ SUCCESS [21.030s]
[INFO] Apache HBase - Server ............................. FAILURE [1:41:35.310s]
[INFO] Apache HBase - Testing Util ....................... SKIPPED
[INFO] Apache HBase - Thrift ............................. SKIPPED
[INFO] Apache HBase - RSGroup ............................ SKIPPED
[INFO] Apache HBase - Shell .............................. SKIPPED
[INFO] Apache HBase - Coprocessor Endpoint ............... SKIPPED
[INFO] Apache HBase - Integration Tests .................. SKIPPED
[INFO] Apache HBase - Examples ........................... SKIPPED
[INFO] Apache HBase - Rest ............................... SKIPPED
[INFO] Apache HBase - External Block Cache ............... SKIPPED
[INFO] Apache HBase - Spark .............................. SKIPPED
[INFO] Apache HBase - Assembly ........................... SKIPPED
[INFO] Apache HBase - Shaded ............................. SUCCESS [0.396s]
[INFO] Apache HBase - Shaded - Client .................... SUCCESS [2.211s]
[INFO] Apache HBase - Shaded - Server .................... SKIPPED
[INFO] Apache HBase - Archetypes ......................... SUCCESS [0.089s]
[INFO] Apache HBase - Exemplar for hbase-client archetype  SKIPPED
[INFO] Apache HBase - Exemplar for hbase-shaded-client archetype  SKIPPED
[INFO] Apache HBase - Archetype builder .................. SUCCESS [25.338s]
[INFO] ------------------------------------------------------------------------
[INFO] BUILD FAILURE
[INFO] ------------------------------------------------------------------------
[INFO] Total time: 1:51:49.970s
[INFO] Finished at: Thu Apr 20 19:17:51 UTC 2017
[INFO] Final Memory: 188M/4052M
[INFO] ------------------------------------------------------------------------
[ERROR] Failed to execute goal org.apache.maven.plugins:maven-surefire-plugin:2.18.1:test
(secondPartTestsExecution) on project hbase-server: ExecutionException: java.lang.OutOfMemoryError:
unable to create new native thread -> [Help 1]
[ERROR] 
[ERROR] To see the full stack trace of the errors, re-run Maven with the -e switch.
[ERROR] Re-run Maven using the -X switch to enable full debug logging.
[ERROR] 
[ERROR] For more information about the errors and possible solutions, please read the following
articles:
[ERROR] [Help 1] http://cwiki.apache.org/confluence/display/MAVEN/MojoFailureException
[ERROR] 
[ERROR] After correcting the problems, you can resume the build with the command
[ERROR]   mvn <goals> -rf :hbase-server
Build step 'Invoke top-level Maven targets' marked build as failure
Performing Post build task...
Match found for :.* : True
Logical operation result is TRUE
Running script  : # Run zombie detector script
./dev-support/zombie-detector.sh --jenkins ${BUILD_ID}
[a3159d73] $ /bin/bash -xe /tmp/hudson5326797493265953751.sh
+ ./dev-support/zombie-detector.sh --jenkins 159
Thu Apr 20 19:17:54 UTC 2017 Found 3 suspicious java process(es) listed below; waiting 30s
to see if just slow to stop
17872 surefirebooter2738752250724629407.jar -enableassertions -Dhbase.build.id=159 -Xmx2800m
-Djava.security.egd=file:/dev/./urandom -Djava.net.preferIPv4Stack=true -Djava.awt.headless=true
17324 surefirebooter5342292690130377986.jar -enableassertions -Dhbase.build.id=159 -Xmx2800m
-Djava.security.egd=file:/dev/./urandom -Djava.net.preferIPv4Stack=true -Djava.awt.headless=true
17678 surefirebooter3112526365122270020.jar -enableassertions -Dhbase.build.id=159 -Xmx2800m
-Djava.security.egd=file:/dev/./urandom -Djava.net.preferIPv4Stack=true -Djava.awt.headless=true
tail: cannot open '+2' for reading: No such file or directory
tail: cannot open '+2' for reading: No such file or directory
tail: cannot open '+2' for reading: No such file or directory
Thu Apr 20 19:18:24 UTC 2017 We're ok: there was a zombie candidate but it went away


    {color:green}+1 zombies{color}. No zombie tests found running at the end of the build
(There were candidates but they seem to have gone away).
POST BUILD TASK : SUCCESS
END OF POST BUILD TASK : 0
Archiving artifacts
No prior successful build to compare, so performing full copy of artifacts
Recording test results
[FINDBUGS] Skipping publisher since build result is FAILURE
[CHECKSTYLE] Skipping publisher since build result is FAILURE

Mime
View raw message