hbase-builds mailing list archives

Site index · List index
Message view « Date » · « Thread »
Top « Date » · « Thread »
From Apache Jenkins Server <jenk...@builds.apache.org>
Subject Build failed in Jenkins: HBase-1.1-JDK8 #1938
Date Tue, 14 Mar 2017 23:09:02 GMT
See <https://builds.apache.org/job/HBase-1.1-JDK8/1938/display/redirect?page=changes>

Changes:

[apurtell] HBASE-17780 BoundedByteBufferPool "At capacity" messages are not

------------------------------------------
[...truncated 365.63 KB...]
[ERROR] Re-run Maven using the -X switch to enable full debug logging.
[ERROR] 
[ERROR] For more information about the errors and possible solutions, please read the following
articles:
[ERROR] [Help 1] http://cwiki.apache.org/confluence/display/MAVEN/MojoFailureException
[ERROR] 
[ERROR] After correcting the problems, you can resume the build with the command
[ERROR]   mvn <goals> -rf :hbase-server
Build step 'Invoke top-level Maven targets' marked build as failure
Performing Post build task...
Match found for :.* : True
Logical operation result is TRUE
Running script  : # Post-build task script. TODO: Check this in and have all builds reference
check-in.
pwd && ls
# NOTE!!!! The below code has been copied and pasted from ./dev-tools/run-test.sh
# Do not change here without syncing there and vice-versa.
ZOMBIE_TESTS_COUNT=`jps -v | grep surefirebooter | grep -e '-Dhbase.test' | wc -l`
if [[ $ZOMBIE_TESTS_COUNT != 0 ]] ; then
 echo "Suspicious java process found - waiting 30s to see if there are just slow to stop"
 sleep 30
 ZOMBIE_TESTS_COUNT=`jps -v | grep surefirebooter | grep -e '-Dhbase.test' | wc -l`
 if [[ $ZOMBIE_TESTS_COUNT != 0 ]] ; then
   echo " {color:red}There appear to be $ZOMBIE_TESTS_COUNT zombie tests{color}, they should
have been killed by surefire but survived"
   jps -v | grep surefirebooter | grep -e '-Dhbase.test'
   jps -v | grep surefirebooter | grep -e '-Dhbase.test' | cut -d ' ' -f 1 | xargs -n 1 jstack
   # Exit with error
   exit 1
 else
   echo "We're ok: there is no zombie test, but some tests took some time to stop"
 fi
else
  echo "We're ok: there is no zombie test"
fi
[HBase-1.1-JDK8] $ /bin/bash -xe /tmp/hudson460112786436877962.sh
+ pwd
<https://builds.apache.org/job/HBase-1.1-JDK8/ws/>
+ ls
bin
CHANGES.txt
conf
dev-support
hbase-annotations
hbase-assembly
hbase-checkstyle
hbase-client
hbase-common
hbase-examples
hbase-hadoop2-compat
hbase-hadoop-compat
hbase-it
hbase-native-client
hbase-prefix-tree
hbase-procedure
hbase-protocol
hbase-resource-bundle
hbase-rest
hbase-server
hbase-shaded
hbase-shell
hbase-testing-util
hbase-thrift
LICENSE.txt
NOTICE.txt
pom.xml
README.txt
src
target
++ jps -v
++ grep surefirebooter
++ wc -l
++ grep -e -Dhbase.test
+ ZOMBIE_TESTS_COUNT=1
+ [[ 1 != 0 ]]
+ echo 'Suspicious java process found - waiting 30s to see if there are just slow to stop'
Suspicious java process found - waiting 30s to see if there are just slow to stop
+ sleep 30
++ jps -v
++ wc -l
++ grep surefirebooter
++ grep -e -Dhbase.test
+ ZOMBIE_TESTS_COUNT=1
+ [[ 1 != 0 ]]
+ echo ' {color:red}There appear to be 1 zombie tests{color}, they should have been killed
by surefire but survived'
 {color:red}There appear to be 1 zombie tests{color}, they should have been killed by surefire
but survived
+ jps -v
+ grep surefirebooter
+ grep -e -Dhbase.test
18171 surefirebooter7589447995283867350.jar -enableassertions -Dhbase.test -Xmx2800m -Djava.security.egd=file:/dev/./urandom
-Djava.net.preferIPv4Stack=true -Djava.awt.headless=true
+ jps -v
+ grep surefirebooter
+ grep -e -Dhbase.test
+ cut -d ' ' -f 1
+ xargs -n 1 jstack
2017-03-14 23:06:25
Full thread dump Java HotSpot(TM) 64-Bit Server VM (25.121-b13 mixed mode):

"Attach Listener" #18 daemon prio=9 os_prio=0 tid=0x00007ff278001000 nid=0x47f7 waiting on
condition [0x0000000000000000]
   java.lang.Thread.State: RUNNABLE

"Service Thread" #17 daemon prio=9 os_prio=0 tid=0x00007ff310375000 nid=0x471f runnable [0x0000000000000000]
   java.lang.Thread.State: RUNNABLE

"C1 CompilerThread11" #16 daemon prio=9 os_prio=0 tid=0x00007ff310372800 nid=0x471e waiting
on condition [0x0000000000000000]
   java.lang.Thread.State: RUNNABLE

"C1 CompilerThread10" #15 daemon prio=9 os_prio=0 tid=0x00007ff310370000 nid=0x471d waiting
on condition [0x0000000000000000]
   java.lang.Thread.State: RUNNABLE

"C1 CompilerThread9" #14 daemon prio=9 os_prio=0 tid=0x00007ff31036e000 nid=0x471c waiting
on condition [0x0000000000000000]
   java.lang.Thread.State: RUNNABLE

"C1 CompilerThread8" #13 daemon prio=9 os_prio=0 tid=0x00007ff31036c000 nid=0x471b waiting
on condition [0x0000000000000000]
   java.lang.Thread.State: RUNNABLE

"C2 CompilerThread7" #12 daemon prio=9 os_prio=0 tid=0x00007ff31036a000 nid=0x471a waiting
on condition [0x0000000000000000]
   java.lang.Thread.State: RUNNABLE

"C2 CompilerThread6" #11 daemon prio=9 os_prio=0 tid=0x00007ff310368000 nid=0x4719 waiting
on condition [0x0000000000000000]
   java.lang.Thread.State: RUNNABLE

"C2 CompilerThread5" #10 daemon prio=9 os_prio=0 tid=0x00007ff310366000 nid=0x4718 waiting
on condition [0x0000000000000000]
   java.lang.Thread.State: RUNNABLE

"C2 CompilerThread4" #9 daemon prio=9 os_prio=0 tid=0x00007ff310364000 nid=0x4717 waiting
on condition [0x0000000000000000]
   java.lang.Thread.State: RUNNABLE

"C2 CompilerThread3" #8 daemon prio=9 os_prio=0 tid=0x00007ff310362000 nid=0x4716 waiting
on condition [0x0000000000000000]
   java.lang.Thread.State: RUNNABLE

"C2 CompilerThread2" #7 daemon prio=9 os_prio=0 tid=0x00007ff31035f800 nid=0x4715 waiting
on condition [0x0000000000000000]
   java.lang.Thread.State: RUNNABLE

"C2 CompilerThread1" #6 daemon prio=9 os_prio=0 tid=0x00007ff31035e000 nid=0x4714 waiting
on condition [0x0000000000000000]
   java.lang.Thread.State: RUNNABLE

"C2 CompilerThread0" #5 daemon prio=9 os_prio=0 tid=0x00007ff31035b000 nid=0x4713 waiting
on condition [0x0000000000000000]
   java.lang.Thread.State: RUNNABLE

"Signal Dispatcher" #4 daemon prio=9 os_prio=0 tid=0x00007ff310359800 nid=0x4712 runnable
[0x0000000000000000]
   java.lang.Thread.State: RUNNABLE

"Finalizer" #3 daemon prio=8 os_prio=0 tid=0x00007ff310326800 nid=0x4711 in Object.wait()
[0x00007ff2dbefd000]
   java.lang.Thread.State: WAITING (on object monitor)
	at java.lang.Object.wait(Native Method)
	- waiting on <0x0000000785b08ec8> (a java.lang.ref.ReferenceQueue$Lock)
	at java.lang.ref.ReferenceQueue.remove(ReferenceQueue.java:143)
	- locked <0x0000000785b08ec8> (a java.lang.ref.ReferenceQueue$Lock)
	at java.lang.ref.ReferenceQueue.remove(ReferenceQueue.java:164)
	at java.lang.ref.Finalizer$FinalizerThread.run(Finalizer.java:209)

"Reference Handler" #2 daemon prio=10 os_prio=0 tid=0x00007ff310322000 nid=0x4710 in Object.wait()
[0x00007ff2dbffe000]
   java.lang.Thread.State: WAITING (on object monitor)
	at java.lang.Object.wait(Native Method)
	- waiting on <0x0000000785b06b68> (a java.lang.ref.Reference$Lock)
	at java.lang.Object.wait(Object.java:502)
	at java.lang.ref.Reference.tryHandlePending(Reference.java:191)
	- locked <0x0000000785b06b68> (a java.lang.ref.Reference$Lock)
	at java.lang.ref.Reference$ReferenceHandler.run(Reference.java:153)

"main" #1 prio=5 os_prio=0 tid=0x00007ff310008800 nid=0x46fc waiting on condition [0x00007ff3183da000]
   java.lang.Thread.State: TIMED_WAITING (parking)
	at sun.misc.Unsafe.park(Native Method)
	- parking to wait for  <0x0000000788a48830> (a java.util.concurrent.locks.AbstractQueuedSynchronizer$ConditionObject)
	at java.util.concurrent.locks.LockSupport.parkNanos(LockSupport.java:215)
	at java.util.concurrent.locks.AbstractQueuedSynchronizer$ConditionObject.awaitNanos(AbstractQueuedSynchronizer.java:2078)
	at org.apache.hadoop.hbase.procedure2.util.TimeoutBlockingQueue.poll(TimeoutBlockingQueue.java:106)
	at org.apache.hadoop.hbase.procedure2.util.TestTimeoutBlockingQueue.testOrder(TestTimeoutBlockingQueue.java:88)
	at sun.reflect.NativeMethodAccessorImpl.invoke0(Native Method)
	at sun.reflect.NativeMethodAccessorImpl.invoke(NativeMethodAccessorImpl.java:62)
	at sun.reflect.DelegatingMethodAccessorImpl.invoke(DelegatingMethodAccessorImpl.java:43)
	at java.lang.reflect.Method.invoke(Method.java:498)
	at org.junit.runners.model.FrameworkMethod$1.runReflectiveCall(FrameworkMethod.java:50)
	at org.junit.internal.runners.model.ReflectiveCallable.run(ReflectiveCallable.java:12)
	at org.junit.runners.model.FrameworkMethod.invokeExplosively(FrameworkMethod.java:47)
	at org.junit.internal.runners.statements.InvokeMethod.evaluate(InvokeMethod.java:17)
	at org.junit.runners.ParentRunner.runLeaf(ParentRunner.java:325)
	at org.junit.runners.BlockJUnit4ClassRunner.runChild(BlockJUnit4ClassRunner.java:78)
	at org.junit.runners.BlockJUnit4ClassRunner.runChild(BlockJUnit4ClassRunner.java:57)
	at org.junit.runners.ParentRunner$3.run(ParentRunner.java:290)
	at org.junit.runners.ParentRunner$1.schedule(ParentRunner.java:71)
	at org.junit.runners.ParentRunner.runChildren(ParentRunner.java:288)
	at org.junit.runners.ParentRunner.access$000(ParentRunner.java:58)
	at org.junit.runners.ParentRunner$2.evaluate(ParentRunner.java:268)
	at org.junit.runners.ParentRunner.run(ParentRunner.java:363)
	at org.junit.runners.Suite.runChild(Suite.java:128)
	at org.junit.runners.Suite.runChild(Suite.java:27)
	at org.junit.runners.ParentRunner$3.run(ParentRunner.java:290)
	at org.junit.runners.ParentRunner$1.schedule(ParentRunner.java:71)
	at org.junit.runners.ParentRunner.runChildren(ParentRunner.java:288)
	at org.junit.runners.ParentRunner.access$000(ParentRunner.java:58)
	at org.junit.runners.ParentRunner$2.evaluate(ParentRunner.java:268)
	at org.junit.runners.ParentRunner.run(ParentRunner.java:363)
	at org.junit.runner.JUnitCore.run(JUnitCore.java:137)
	at org.junit.runner.JUnitCore.run(JUnitCore.java:115)
	at org.apache.maven.surefire.junitcore.JUnitCoreWrapper.createRequestAndRun(JUnitCoreWrapper.java:108)
	at org.apache.maven.surefire.junitcore.JUnitCoreWrapper.executeEager(JUnitCoreWrapper.java:78)
	at org.apache.maven.surefire.junitcore.JUnitCoreWrapper.execute(JUnitCoreWrapper.java:54)
	at org.apache.maven.surefire.junitcore.JUnitCoreProvider.invoke(JUnitCoreProvider.java:144)
	at org.apache.maven.surefire.booter.ForkedBooter.invokeProviderInSameClassLoader(ForkedBooter.java:203)
	at org.apache.maven.surefire.booter.ForkedBooter.runSuitesInProcess(ForkedBooter.java:155)
	at org.apache.maven.surefire.booter.ForkedBooter.main(ForkedBooter.java:103)

"VM Thread" os_prio=0 tid=0x00007ff31031a800 nid=0x470f runnable 

"GC task thread#0 (ParallelGC)" os_prio=0 tid=0x00007ff31001e000 nid=0x46fd runnable 

"GC task thread#1 (ParallelGC)" os_prio=0 tid=0x00007ff310020000 nid=0x46fe runnable 

"GC task thread#2 (ParallelGC)" os_prio=0 tid=0x00007ff310021800 nid=0x46ff runnable 

"GC task thread#3 (ParallelGC)" os_prio=0 tid=0x00007ff310023800 nid=0x4700 runnable 

"GC task thread#4 (ParallelGC)" os_prio=0 tid=0x00007ff310025000 nid=0x4701 runnable 

"GC task thread#5 (ParallelGC)" os_prio=0 tid=0x00007ff310027000 nid=0x4702 runnable 

"GC task thread#6 (ParallelGC)" os_prio=0 tid=0x00007ff310028800 nid=0x4703 runnable 

"GC task thread#7 (ParallelGC)" os_prio=0 tid=0x00007ff31002a800 nid=0x4704 runnable 

"GC task thread#8 (ParallelGC)" os_prio=0 tid=0x00007ff31002c000 nid=0x4705 runnable 

"GC task thread#9 (ParallelGC)" os_prio=0 tid=0x00007ff31002e000 nid=0x4706 runnable 

"GC task thread#10 (ParallelGC)" os_prio=0 tid=0x00007ff31002f800 nid=0x4707 runnable 

"GC task thread#11 (ParallelGC)" os_prio=0 tid=0x00007ff310031800 nid=0x4708 runnable 

"GC task thread#12 (ParallelGC)" os_prio=0 tid=0x00007ff310033000 nid=0x4709 runnable 

"GC task thread#13 (ParallelGC)" os_prio=0 tid=0x00007ff310035000 nid=0x470a runnable 

"GC task thread#14 (ParallelGC)" os_prio=0 tid=0x00007ff310036800 nid=0x470b runnable 

"GC task thread#15 (ParallelGC)" os_prio=0 tid=0x00007ff310038800 nid=0x470c runnable 

"GC task thread#16 (ParallelGC)" os_prio=0 tid=0x00007ff31003a000 nid=0x470d runnable 

"GC task thread#17 (ParallelGC)" os_prio=0 tid=0x00007ff31003c000 nid=0x470e runnable 

"VM Periodic Task Thread" os_prio=0 tid=0x00007ff310378800 nid=0x4720 waiting on condition


JNI global references: 32

+ exit 1
POST BUILD TASK : FAILURE
END OF POST BUILD TASK : 0
Archiving artifacts
Recording test results
[JIRA] Updating issue HBASE-17780

Mime
View raw message