hbase-builds mailing list archives

Site index · List index
Message view « Date » · « Thread »
Top « Date » · « Thread »
From Apache Jenkins Server <jenk...@builds.apache.org>
Subject Build failed in Jenkins: HBase-1.2-IT » IntegrationTestAcidGuarantees,JDK 1.8 (latest),Hadoop #604
Date Thu, 23 Feb 2017 11:02:40 GMT
See <https://builds.apache.org/job/HBase-1.2-IT/it.test=IntegrationTestAcidGuarantees,jdk=JDK%201.8%20(latest),label=Hadoop/604/display/redirect?page=changes>

Changes:

[busbey] HBASE-17677 Just the new tests from 'ServerName parsing from directory

------------------------------------------
[...truncated 4.64 MB...]
SUREFIRE-859: [GC (Allocation Failure)  1549702K->579968K(2143232K), 0.0607434 secs]
SUREFIRE-859: [GC (Allocation Failure)  1476992K->669614K(2191872K), 0.0538871 secs]
SUREFIRE-859: [GC (Allocation Failure)  1566638K->668452K(2087424K), 0.0438906 secs]
SUREFIRE-859: [GC (Allocation Failure)  1461021K->679054K(2050560K), 0.0478456 secs]
SUREFIRE-859: [GC (Allocation Failure)  1471630K->689758K(2140160K), 0.0724958 secs]
SUREFIRE-859: [GC (Allocation Failure)  1477726K->700382K(2007040K), 0.0543209 secs]
SUREFIRE-859: [GC (Allocation Failure)  1488292K->703353K(2129920K), 0.0463742 secs]
SUREFIRE-859: [GC (Allocation Failure)  1497977K->730506K(2123264K), 0.0630783 secs]
SUREFIRE-859: [GC (Allocation Failure)  1525130K->763041K(2145792K), 0.0214030 secs]
SUREFIRE-859: [GC (Allocation Failure)  1573025K->782369K(1910784K), 0.0266761 secs]
SUREFIRE-859: [GC (Allocation Failure)  1592353K->795665K(2150400K), 0.0250249 secs]
SUREFIRE-859: [GC (Allocation Failure)  1607185K->809177K(1870336K), 0.0478139 secs]
SUREFIRE-859: [GC (Allocation Failure)  1620662K->818378K(2148864K), 0.1009894 secs]
SUREFIRE-859: [GC (Allocation Failure)  1627850K->819886K(1860096K), 0.0794679 secs]
SUREFIRE-859: [GC (Allocation Failure)  1629358K->835929K(2152448K), 0.0121433 secs]
SUREFIRE-859: [GC (Allocation Failure)  1651545K->894024K(1902592K), 0.0281518 secs]
SUREFIRE-859: [GC (Allocation Failure)  1709640K->929560K(2143744K), 0.0183694 secs]
SUREFIRE-859: [GC (Allocation Failure)  1753880K->958929K(2138624K), 0.0122311 secs]
SUREFIRE-859: [GC (Allocation Failure)  1783249K->995826K(2152960K), 0.0162626 secs]
SUREFIRE-859: [GC (Allocation Failure)  1865202K->1017512K(2154496K), 0.0278087 secs]
SUREFIRE-859: [GC (Allocation Failure)  1886888K->997698K(2179584K), 0.0479554 secs]
SUREFIRE-859: [GC (Allocation Failure)  1924418K->985527K(2186240K), 0.0355165 secs]
SUREFIRE-859: [GC (Allocation Failure)  1912247K->996439K(2206208K), 0.0376316 secs]
SUREFIRE-859: [GC (Allocation Failure)  1975383K->1044319K(2214400K), 0.0482667 secs]
SUREFIRE-859: [Full GC (Ergonomics)  1044319K->483599K(2562048K), 0.5266634 secs]
SUREFIRE-859: [GC (Allocation Failure)  1462543K->488843K(2594816K), 0.0205220 secs]
SUREFIRE-859: [GC (Allocation Failure)  1512331K->494460K(2595328K), 0.0372481 secs]
SUREFIRE-859: [GC (Allocation Failure)  1517948K->501611K(2601984K), 0.0360873 secs]
SUREFIRE-859: [GC (Allocation Failure)  1542507K->543451K(2605056K), 0.0273183 secs]
SUREFIRE-859: [GC (Allocation Failure)  1584339K->546299K(2609152K), 0.0426755 secs]
SUREFIRE-859: [GC (Allocation Failure)  1609723K->573537K(2610176K), 0.0315130 secs]
SUREFIRE-859: [GC (Allocation Failure)  1636961K->574010K(2632192K), 0.0302237 secs]
SUREFIRE-859: [GC (Allocation Failure)  1661498K->603637K(2583040K), 0.0275404 secs]
SUREFIRE-859: [GC (Allocation Failure)  1691125K->630901K(2599936K), 0.0352428 secs]
SUREFIRE-859: [GC (Allocation Failure)  1678453K->677005K(2564608K), 0.0318215 secs]
SUREFIRE-859: [GC (Allocation Failure)  1724557K->675512K(2593280K), 0.0335509 secs]
SUREFIRE-859: [GC (Allocation Failure)  1692344K->675737K(2599424K), 0.0397660 secs]
SUREFIRE-859: [GC (Allocation Failure)  1692569K->668417K(2579968K), 0.0457342 secs]
SUREFIRE-859: [GC (Allocation Failure)  1688321K->687793K(2591232K), 0.0357084 secs]
SUREFIRE-859: [GC (Allocation Failure)  1707697K->699245K(2603520K), 0.0364342 secs]
SUREFIRE-859: [GC (Allocation Failure)  1740653K->717663K(2608128K), 0.0254399 secs]
SUREFIRE-859: [GC (Allocation Failure)  1759071K->738711K(2608128K), 0.0412380 secs]
SUREFIRE-859: [GC (Allocation Failure)  1789847K->751383K(2612736K), 0.0476063 secs]
SUREFIRE-859: [GC (Allocation Failure)  1802464K->778509K(2610688K), 0.0288048 secs]
SUREFIRE-859: [GC (Allocation Failure)  1841421K->793270K(2615808K), 0.0627468 secs]
SUREFIRE-859: [GC (Allocation Failure)  1856182K->822524K(2617344K), 0.0371201 secs]
SUREFIRE-859: [GC (Allocation Failure)  1905396K->952574K(2622464K), 0.0473073 secs]
SUREFIRE-859: [GC (Allocation Failure)  2035454K->954548K(2624000K), 0.0327468 secs]
2017-02-23 10:58:54\2C881 DEBUG [RS_LOG_REPLAY_OPS-asf911:35257-1-Writer-0] wal.WALSplitter$LogRecoveredEditsOutputSink(1571):
getWriterAndPath decided we don't need to write edits for IntegrationTestIngestWithTags/2fda53ff9430ef8e1c470ffb86a369cd/5595=[#edits:
1 = <0f46c64b74a6c964c674853a89796c8e-2281/test_cf:9/1487847132647/Put/vlen=1154/seqid=0;
>]\0A
SUREFIRE-859: [GC (Allocation Failure)  2021670K->956198K(2623488K), 0.0419354 secs]
SUREFIRE-859: [GC (Allocation Failure)  2024742K->955657K(2619904K), 0.0326849 secs]
SUREFIRE-859: [GC (Allocation Failure)  2024201K->958082K(2626048K), 0.0225422 secs]
SUREFIRE-859: [GC (Allocation Failure)  2038402K->991070K(2623488K), 0.0222611 secs]
SUREFIRE-859: [GC (Allocation Failure)  2071390K->1014253K(2630656K), 0.0243200 secs]
SUREFIRE-859: [GC (Allocation Failure)  2112493K->1028679K(2625536K), 0.0245905 secs]
SUREFIRE-859: [GC (Allocation Failure)  2126919K->1043143K(2646016K), 0.0183161 secs]
SUREFIRE-859: [GC (Allocation Failure)  2174151K->1056190K(2642944K), 0.0170658 secs]
SUREFIRE-859: [GC (Allocation Failure)  2187198K->1066854K(2662912K), 0.0312081 secs]
SUREFIRE-859: [GC (Allocation Failure)  2222950K->1098534K(2661888K), 0.0274165 secs]
SUREFIRE-859: [GC (Allocation Failure)  2254629K->1124623K(2629632K), 0.0434278 secs]
SUREFIRE-859: [GC (Allocation Failure)  2237711K->1128003K(2619904K), 0.0239551 secs]
SUREFIRE-859: [GC (Allocation Failure)  2241091K->1129032K(2607104K), 0.0320191 secs]
SUREFIRE-859: [GC (Allocation Failure)  2186824K->1139976K(2576384K), 0.0250966 secs]
SUREFIRE-859: [GC (Allocation Failure)  2197768K->1165488K(2566656K), 0.0358816 secs]
SUREFIRE-859: [GC (Allocation Failure)  2156720K->1185070K(2541056K), 0.0290941 secs]
SUREFIRE-859: [GC (Allocation Failure)  2176263K->1151794K(2573312K), 0.0271978 secs]
SUREFIRE-859: [GC (Allocation Failure)  2112306K->1170799K(2467840K), 0.0473915 secs]
SUREFIRE-859: [GC (Allocation Failure)  2131311K->1210396K(2559488K), 0.0469651 secs]
SUREFIRE-859: [GC (Allocation Failure)  2163228K->1202997K(2440704K), 0.0443603 secs]
SUREFIRE-859: [GC (Allocation Failure)  2155821K->1220529K(2571264K), 0.0612439 secs]
SUREFIRE-859: [GC (Allocation Failure)  2190257K->1229645K(2562560K), 0.0342277 secs]
SUREFIRE-859: [GC (Allocation Failure)  2199373K->1250714K(2579968K), 0.0406998 secs]
SUREFIRE-859: [GC (Allocation Failure)  2246027K->1250660K(2572288K), 0.0396148 secs]
SUREFIRE-859: [GC (Allocation Failure)  2245385K->1273964K(2600448K), 0.0489212 secs]
SUREFIRE-859: [GC (Allocation Failure)  2297964K->1309916K(2596864K), 0.0303897 secs]
SUREFIRE-859: [GC (Allocation Failure)  2333916K->1321881K(2603008K), 0.0276894 secs]
SUREFIRE-859: [GC (Allocation Failure)  2360729K->1318221K(2598912K), 0.0265222 secs]
SUREFIRE-859: [GC (Allocation Failure)  2357069K->1356667K(2615296K), 0.0239404 secs]
SUREFIRE-859: [Full GC (Ergonomics)  1356667K->576979K(2807808K), 0.4917172 secs]
SUREFIRE-859: [GC (Allocation Failure)  1634259K->621219K(2808320K), 0.0133754 secs]
SUREFIRE-859: [GC (Allocation Failure)  1678479K->632526K(2806272K), 0.0139497 secs]
SUREFIRE-859: [GC (Allocation Failure)  1702606K->654311K(2808832K), 0.0341768 secs]
SUREFIRE-859: [GC (Allocation Failure)  1724391K->632752K(2818048K), 0.0636398 secs]
SUREFIRE-859: [GC (Allocation Failure)  1726896K->654770K(2822144K), 0.0302701 secs]
SUREFIRE-859: [GC (Allocation Failure)  1748914K->664826K(2828288K), 0.1062932 secs]
SUREFIRE-859: [GC (Allocation Failure)  1779422K->687419K(2833920K), 0.0405632 secs]
SUREFIRE-859: [GC (Allocation Failure)  1802043K->693099K(2840576K), 0.0282686 secs]
SUREFIRE-859: [GC (Allocation Failure)  1826155K->700051K(2844672K), 0.0290864 secs]
SUREFIRE-859: [GC (Allocation Failure)  1833107K->704527K(2849280K), 0.0193707 secs]
SUREFIRE-859: [GC (Allocation Failure)  1840143K->704445K(2725376K), 0.0154211 secs]
SUREFIRE-859: [GC (Allocation Failure)  1840013K->791582K(2838016K), 0.0303986 secs]
SUREFIRE-859: [GC (Allocation Failure)  1912862K->764268K(2762240K), 0.0311132 secs]
SUREFIRE-859: [GC (Allocation Failure)  1885548K->832443K(2822144K), 0.0719995 secs]
SUREFIRE-859: [GC (Allocation Failure)  1939387K->808611K(2776576K), 0.1000457 secs]
SUREFIRE-859: [GC (Allocation Failure)  1915555K->838905K(2819072K), 0.0762732 secs]
SUREFIRE-859: [GC (Allocation Failure)  1927417K->818095K(2827776K), 0.0382664 secs]
SUREFIRE-859: [GC (Allocation Failure)  1906607K->841082K(2818048K), 0.0443883 secs]
SUREFIRE-859: [GC (Allocation Failure)  1933178K->939712K(2824704K), 0.0393927 secs]
SUREFIRE-859: [GC (Allocation Failure)  2031808K->966512K(2827776K), 0.0374501 secs]
SUREFIRE-859: [GC (Allocation Failure)  2058608K->982708K(2826240K), 0.0238557 secs]
SUREFIRE-859: [GC (Allocation Failure)  2074804K->984188K(2830848K), 0.0164386 secs]
SUREFIRE-859: [GC (Allocation Failure)  2078820K->991636K(2687488K), 0.0161315 secs]
SUREFIRE-859: [GC (Allocation Failure)  2086292K->999241K(2832384K), 0.0149972 secs]
SUREFIRE-859: [GC (Allocation Failure)  2097467K->1010554K(2694656K), 0.0188486 secs]
SUREFIRE-859: [GC (Allocation Failure)  2108794K->1089362K(2823168K), 0.0171487 secs]
SUREFIRE-859: [GC (Allocation Failure)  2186578K->1126140K(2828288K), 0.0231753 secs]
SUREFIRE-859: [GC (Allocation Failure)  2223356K->1139961K(2825728K), 0.0177086 secs]
SUREFIRE-859: [GC (Allocation Failure)  2248953K->1146832K(2831360K), 0.0199591 secs]
SUREFIRE-859: [GC (Allocation Failure)  2255815K->1154090K(2833408K), 0.0305393 secs]
SUREFIRE-859: [GC (Allocation Failure)  2281002K->1160949K(2839552K), 0.0237405 secs]
SUREFIRE-859: [GC (Allocation Failure)  2287861K->1197159K(2840576K), 0.0330721 secs]
SUREFIRE-859: [GC (Allocation Failure)  2344551K->1206993K(2847744K), 0.0299573 secs]
SUREFIRE-859: [GC (Allocation Failure)  2354385K->1214213K(2853888K), 0.0208333 secs]
Tests run: 1, Failures: 0, Errors: 0, Skipped: 0, Time elapsed: 631.108 sec - in org.apache.hadoop.hbase.IntegrationTestIngestWithTags

Results :

Failed tests: 
  IntegrationTestRegionReplicaReplication.testIngest:112->runIngestTest:197 Load failed
with error code 1
  IntegrationTestBulkLoad.testBulkLoad:217->runCheck:719 expected:<true> but was:<false>
Tests in error: 
  IntegrationTestIngestWithACL>IntegrationTestBase.setUp:133->setUpCluster:64->IntegrationTestIngest.setUpCluster:84
» IO
  IntegrationTestMTTR.testKillRsHoldingMeta:278->run:319 » Execution java.io.IOE...
  IntegrationTestMTTR.testRestartRsHoldingTable:273->run:319 » Execution java.io...
  IntegrationTestBigLinkedListWithVisibility.testContinuousIngest:636 » Runtime ...
  IntegrationTestWithCellVisibilityLoadAndVerify>IntegrationTestLoadAndVerify.testLoadAndVerify:545->doVerify:293->access$400:79->doVerify:338
» FileAlreadyExists

Tests run: 32, Failures: 2, Errors: 5, Skipped: 2

[WARNING] File encoding has not been set, using platform encoding ISO-8859-1, i.e. build is
platform dependent! The file encoding for reports output files should be provided by the POM
property ${project.reporting.outputEncoding}.
[INFO] 
[INFO] --- maven-failsafe-plugin:2.18.1:verify (verify) @ hbase-it ---
[INFO] Failsafe report directory: <https://builds.apache.org/job/HBase-1.2-IT/it.test=IntegrationTestAcidGuarantees,jdk=JDK%201.8%20(latest),label=Hadoop/ws/hbase-it/target/failsafe-reports>
[WARNING] File encoding has not been set, using platform encoding ISO-8859-1, i.e. build is
platform dependent! The file encoding for reports output files should be provided by the POM
property ${project.reporting.outputEncoding}.
[INFO] ------------------------------------------------------------------------
[INFO] Reactor Summary:
[INFO] 
[INFO] Apache HBase ...................................... SUCCESS [1:49.907s]
[INFO] Apache HBase - Checkstyle ......................... SUCCESS [7.787s]
[INFO] Apache HBase - Resource Bundle .................... SUCCESS [0.247s]
[INFO] Apache HBase - Annotations ........................ SUCCESS [1.841s]
[INFO] Apache HBase - Protocol ........................... SUCCESS [20.044s]
[INFO] Apache HBase - Common ............................. SUCCESS [1:52.416s]
[INFO] Apache HBase - Procedure .......................... SUCCESS [1.676s]
[INFO] Apache HBase - Client ............................. SUCCESS [16.199s]
[INFO] Apache HBase - Hadoop Compatibility ............... SUCCESS [2.780s]
[INFO] Apache HBase - Hadoop Two Compatibility ........... SUCCESS [3.600s]
[INFO] Apache HBase - Prefix Tree ........................ SUCCESS [1.383s]
[INFO] Apache HBase - Server ............................. SUCCESS [1:49.411s]
[INFO] Apache HBase - Testing Util ....................... SUCCESS [2.697s]
[INFO] Apache HBase - Thrift ............................. SUCCESS [10.703s]
[INFO] Apache HBase - Rest ............................... SUCCESS [3.115s]
[INFO] Apache HBase - Shell .............................. SUCCESS [6.527s]
[INFO] Apache HBase - Integration Tests .................. FAILURE [3:15:21.005s]
[INFO] Apache HBase - Examples ........................... SKIPPED
[INFO] Apache HBase - External Block Cache ............... SKIPPED
[INFO] Apache HBase - Assembly ........................... SKIPPED
[INFO] Apache HBase - Shaded ............................. SKIPPED
[INFO] Apache HBase - Shaded - Client .................... SKIPPED
[INFO] Apache HBase - Shaded - Server .................... SKIPPED
[INFO] ------------------------------------------------------------------------
[INFO] BUILD FAILURE
[INFO] ------------------------------------------------------------------------
[INFO] Total time: 3:22:43.364s
[INFO] Finished at: Thu Feb 23 11:02:17 UTC 2017
[INFO] Final Memory: 124M/1192M
[INFO] ------------------------------------------------------------------------
[ERROR] Failed to execute goal org.apache.maven.plugins:maven-failsafe-plugin:2.18.1:verify
(verify) on project hbase-it: There was a timeout or other error in the fork -> [Help 1]
[ERROR] 
[ERROR] To see the full stack trace of the errors, re-run Maven with the -e switch.
[ERROR] Re-run Maven using the -X switch to enable full debug logging.
[ERROR] 
[ERROR] For more information about the errors and possible solutions, please read the following
articles:
[ERROR] [Help 1] http://cwiki.apache.org/confluence/display/MAVEN/MojoFailureException
[ERROR] 
[ERROR] After correcting the problems, you can resume the build with the command
[ERROR]   mvn <goals> -rf :hbase-it
Build step 'Invoke top-level Maven targets' marked build as failure
Performing Post build task...
Match found for :.* : True
Logical operation result is TRUE
Running script  : # Post-build task script. TODO: Check this in and have all builds reference
check-in.
pwd && ls
# NOTE!!!! The below code has been copied and pasted from ./dev-tools/run-test.sh
# Do not change here without syncing there and vice-versa.
ZOMBIE_TESTS_COUNT=`jps -v | grep surefirebooter | grep -e '-Dhbase.test' | wc -l`
if [[ $ZOMBIE_TESTS_COUNT != 0 ]] ; then
 echo "Suspicious java process found - waiting 30s to see if there are just slow to stop"
 sleep 30
 ZOMBIE_TESTS_COUNT=`jps -v | grep surefirebooter | grep -e '-Dhbase.test' | wc -l`
 if [[ $ZOMBIE_TESTS_COUNT != 0 ]] ; then
   echo " {color:red}There appear to be $ZOMBIE_TESTS_COUNT zombie tests{color}, they should
have been killed by surefire but survived"
   jps -v | grep surefirebooter | grep -e '-Dhbase.test'
   jps -v | grep surefirebooter | grep -e '-Dhbase.test' | cut -d ' ' -f 1 | xargs -n 1 jstack
   # Exit with error
   exit 1
 else
   echo "We're ok: there is no zombie test, but some tests took some time to stop"
 fi
else
  echo "We're ok: there is no zombie test"
fi
[0407dd4a] $ /bin/bash -xe /tmp/hudson7840225778323851359.sh
+ pwd
<https://builds.apache.org/job/HBase-1.2-IT/it.test=IntegrationTestAcidGuarantees,jdk=JDK%201.8%20(latest),label=Hadoop/ws/>
+ ls
bin
CHANGES.txt
conf
dev-support
hbase-annotations
hbase-assembly
hbase-checkstyle
hbase-client
hbase-common
hbase-examples
hbase-external-blockcache
hbase-hadoop2-compat
hbase-hadoop-compat
hbase-it
hbase-native-client
hbase-prefix-tree
hbase-procedure
hbase-protocol
hbase-resource-bundle
hbase-rest
hbase-server
hbase-shaded
hbase-shell
hbase-testing-util
hbase-thrift
LICENSE.txt
NOTICE.txt
pom.xml
README.txt
src
target
++ jps -v
++ grep surefirebooter
++ grep -e -Dhbase.test
++ wc -l
+ ZOMBIE_TESTS_COUNT=0
+ [[ 0 != 0 ]]
+ echo 'We'\''re ok: there is no zombie test'
We're ok: there is no zombie test
POST BUILD TASK : SUCCESS
END OF POST BUILD TASK : 0
Archiving artifacts
No prior successful build to compare, so performing full copy of artifacts

Mime
View raw message