hbase-builds mailing list archives

Site index · List index
Message view « Date » · « Thread »
Top « Date » · « Thread »
From Apache Jenkins Server <jenk...@builds.apache.org>
Subject Build failed in Jenkins: HBase-1.2-IT » IntegrationTestAcidGuarantees,JDK 1.8 (latest),Hadoop #606
Date Fri, 24 Feb 2017 02:50:58 GMT
See <https://builds.apache.org/job/HBase-1.2-IT/it.test=IntegrationTestAcidGuarantees,jdk=JDK%201.8%20(latest),label=Hadoop/606/display/redirect?page=changes>

Changes:

[apurtell] Amend HBASE-17069 RegionServer writes invalid META entries in some

[apurtell] HBASE-17682 Region stuck in merging_new state indefinitely

------------------------------------------
[...truncated 4.65 MB...]
     bool UsePerfData                               = true                               
{product}
     bool UsePopCountInstruction                    = true                               
{product}
     bool UseRDPCForConstantTableBase               = false                              
{C2 product}
     bool UseRTMDeopt                               = false                              
{ARCH product}
     bool UseRTMLocking                             = false                              
{ARCH product}
     bool UseSHA                                    = false                              
{product}
     bool UseSHA1Intrinsics                         = false                              
{product}
     bool UseSHA256Intrinsics                       = false                              
{product}
     bool UseSHA512Intrinsics                       = false                              
{product}
     bool UseSHM                                    = false                              
{product}
     intx UseSSE                                    = 4                                  
{product}
     bool UseSSE42Intrinsics                        = true                               
{product}
     bool UseSerialGC                               = false                              
{product}
     bool UseSharedSpaces                           = false                              
{product}
     bool UseSignalChaining                         = true                               
{product}
     bool UseSquareToLenIntrinsic                   = false                              
{C2 product}
     bool UseStoreImmI16                            = false                              
{ARCH product}
     bool UseStringDeduplication                    = false                              
{product}
     bool UseSuperWord                              = true                               
{C2 product}
     bool UseTLAB                                   = true                               
{pd product}
     bool UseThreadPriorities                       = true                               
{pd product}
     bool UseTransparentHugePages                   = false                              
{product}
     bool UseTypeProfile                            = true                               
{product}
     bool UseTypeSpeculation                        = true                               
{C2 product}
     bool UseUnalignedLoadStores                    = true                               
{ARCH product}
     bool UseVMInterruptibleIO                      = false                              
{product}
     bool UseXMMForArrayCopy                        = true                               
{product}
     bool UseXmmI2D                                 = false                              
{ARCH product}
     bool UseXmmI2F                                 = false                              
{ARCH product}
     bool UseXmmLoadAndClearUpper                   = true                               
{ARCH product}
     bool UseXmmRegToRegMoveAll                     = true                               
{ARCH product}
     bool VMThreadHintNoPreempt                     = false                              
{product}
     intx VMThreadPriority                          = -1                                 
{product}
     intx VMThreadStackSize                         = 1024                               
{pd product}
     intx ValueMapInitialSize                       = 11                                 
{C1 product}
     intx ValueMapMaxLoopSize                       = 8                                  
{C1 product}
     intx ValueSearchLimit                          = 1000                               
{C2 product}
     bool VerifyMergedCPBytecodes                   = true                               
{product}
     bool VerifySharedSpaces                        = false                              
{product}
     intx WorkAroundNPTLTimedWaitHang               = 1                                  
{product}
    uintx YoungGenerationSizeIncrement              = 20                                 
{product}
    uintx YoungGenerationSizeSupplement             = 80                                 
{product}
    uintx YoungGenerationSizeSupplementDecay        = 8                                  
{product}
    uintx YoungPLABSize                             = 4096                               
{product}
     bool ZeroTLAB                                  = false                              
{product}
     intx hashCode                                  = 5                                  
{product}
Running org.apache.hadoop.hbase.IntegrationTestLazyCfLoading
SUREFIRE-859: [GC (Metadata GC Threshold)  254549K->16476K(1482240K), 0.0260092 secs]
SUREFIRE-859: [Full GC (Metadata GC Threshold)  16476K->15655K(1125376K), 0.0572168 secs]
SUREFIRE-859: [GC (Metadata GC Threshold)  310076K->97172K(1376256K), 0.1343048 secs]
SUREFIRE-859: [Full GC (Metadata GC Threshold)  97172K->85590K(1746944K), 0.0713639 secs]
SUREFIRE-859: [GC (Allocation Failure)  723542K->220548K(1883136K), 0.0372204 secs]
SUREFIRE-859: [GC (Allocation Failure)  994692K->413169K(2057728K), 0.0317963 secs]
SUREFIRE-859: [GC (Allocation Failure)  1360200K->633962K(2057728K), 0.0471548 secs]
SUREFIRE-859: [GC (Allocation Failure)  1582056K->801219K(2056704K), 0.0345037 secs]
SUREFIRE-859: [GC (Allocation Failure)  1445315K->899968K(2019328K), 0.0334494 secs]
SUREFIRE-859: [GC (Allocation Failure)  1544064K->969543K(1934336K), 0.0400564 secs]
SUREFIRE-859: [GC (Allocation Failure)  1435443K->1012381K(1976832K), 0.0467598 secs]
SUREFIRE-859: [GC (Allocation Failure)  1478271K->1048660K(1974784K), 0.0418313 secs]
SUREFIRE-859: [Full GC (Ergonomics)  1048660K->530563K(2807808K), 0.1748795 secs]
SUREFIRE-859: [GC (Allocation Failure)  996479K->624494K(2438144K), 0.0132672 secs]
SUREFIRE-859: [GC (Allocation Failure)  1090381K->694690K(2810880K), 0.0249193 secs]
SUREFIRE-859: [GC (Allocation Failure)  1168290K->761302K(2806272K), 0.0224038 secs]
SUREFIRE-859: [GC (Allocation Failure)  1234870K->906373K(2789376K), 0.0266693 secs]
SUREFIRE-859: [GC (Allocation Failure)  1400453K->970964K(2800128K), 0.0230573 secs]
SUREFIRE-859: [GC (Allocation Failure)  1465044K->987714K(2838528K), 0.0203609 secs]
SUREFIRE-859: [GC (Allocation Failure)  1543226K->1101638K(2841600K), 0.0261851 secs]
SUREFIRE-859: [GC (Allocation Failure)  1657158K->1165697K(2859520K), 0.0268000 secs]
SUREFIRE-859: [GC (Allocation Failure)  1757541K->1301148K(2852352K), 0.0231592 secs]
SUREFIRE-859: [GC (Allocation Failure)  1892978K->1436376K(2872832K), 0.0329979 secs]
SUREFIRE-859: [GC (Allocation Failure)  2082428K->1569742K(2866688K), 0.0348585 secs]
SUREFIRE-859: [GC (Allocation Failure)  2215834K->1677166K(2920448K), 0.0303388 secs]
SUREFIRE-859: [GC (Allocation Failure)  2392942K->1794845K(2911232K), 0.0293743 secs]
SUREFIRE-859: [Full GC (Ergonomics)  1794845K->632177K(3088384K), 0.1521225 secs]
SUREFIRE-859: [GC (Allocation Failure)  1345842K->781008K(3116032K), 0.0271442 secs]
SUREFIRE-859: [GC (Allocation Failure)  1542352K->915484K(3108352K), 0.0377736 secs]
SUREFIRE-859: [GC (Allocation Failure)  1676792K->977704K(3145216K), 0.0335948 secs]
SUREFIRE-859: [GC (Allocation Failure)  1789224K->1138573K(3140096K), 0.0288277 secs]
SUREFIRE-859: [GC (Allocation Failure)  1949577K->1154605K(3170816K), 0.0296067 secs]
SUREFIRE-859: [GC (Allocation Failure)  2004013K->1313179K(3173376K), 0.0348492 secs]
SUREFIRE-859: [GC (Allocation Failure)  2162569K->1478847K(3178496K), 0.0527697 secs]
SUREFIRE-859: [GC (Allocation Failure)  2337947K->1607152K(3005440K), 0.0435698 secs]
SUREFIRE-859: [GC (Allocation Failure)  2466288K->1722618K(3194368K), 0.0312877 secs]
SUREFIRE-859: [GC (Allocation Failure)  2601722K->1818396K(3181056K), 0.0307168 secs]
SUREFIRE-859: [GC (Allocation Failure)  2697500K->1983180K(3181056K), 0.0405965 secs]
SUREFIRE-859: [GC (Allocation Failure)  2872012K->2051442K(3183104K), 0.0595253 secs]
SUREFIRE-859: [Full GC (Ergonomics)  2051442K->1065956K(3792896K), 0.1923614 secs]
SUREFIRE-859: [GC (Allocation Failure)  1954777K->1133499K(3820544K), 0.0213551 secs]
SUREFIRE-859: [GC (Allocation Failure)  2055669K->1239777K(3821056K), 0.0276888 secs]
SUREFIRE-859: [GC (Allocation Failure)  2162858K->1335202K(3818496K), 0.0392240 secs]
SUREFIRE-859: [GC (Allocation Failure)  2261743K->1361073K(3821568K), 0.0297416 secs]
SUREFIRE-859: [GC (Allocation Failure)  2288305K->1518182K(3808768K), 0.0355524 secs]
SUREFIRE-859: [GC (Allocation Failure)  2428367K->1703747K(3739136K), 0.0479215 secs]
SUREFIRE-859: [GC (Allocation Failure)  2614034K->1718972K(3810816K), 0.0271877 secs]
SUREFIRE-859: [GC (Allocation Failure)  2615932K->1822228K(3674112K), 0.0253160 secs]
SUREFIRE-859: [GC (Allocation Failure)  2718585K->1889409K(3806720K), 0.0645695 secs]
SUREFIRE-859: [GC (Allocation Failure)  2793216K->2064680K(3800576K), 0.0301262 secs]
SUREFIRE-859: [GC (Allocation Failure)  2969384K->2197764K(3811328K), 0.0410519 secs]
SUREFIRE-859: [GC (Allocation Failure)  3106052K->2301436K(3697664K), 0.0374734 secs]
SUREFIRE-859: [GC (Allocation Failure)  3208492K->2463850K(3813376K), 0.0488149 secs]
SUREFIRE-859: [GC (Allocation Failure)  3377770K->2466564K(3814400K), 0.0457748 secs]
SUREFIRE-859: [Full GC (Ergonomics)  2466564K->1733798K(3945984K), 0.2499137 secs]
SUREFIRE-859: [GC (Allocation Failure)  2647718K->1968528K(3885056K), 0.0313347 secs]
SUREFIRE-859: [GC (Allocation Failure)  2813328K->2159926K(3807232K), 0.0465510 secs]
SUREFIRE-859: [GC (Allocation Failure)  3004726K->2327269K(3921408K), 0.0395197 secs]
SUREFIRE-859: [GC (Allocation Failure)  3175141K->2410928K(3728896K), 0.0359850 secs]
SUREFIRE-859: [GC (Allocation Failure)  3258735K->2421905K(3906048K), 0.0269079 secs]
SUREFIRE-859: [GC (Allocation Failure)  3265169K->2420222K(3910656K), 0.0220734 secs]
SUREFIRE-859: [GC (Allocation Failure)  3263486K->2497567K(3899392K), 0.0238550 secs]
SUREFIRE-859: [GC (Allocation Failure)  3349081K->2499702K(3910144K), 0.0290316 secs]
SUREFIRE-859: [GC (Allocation Failure)  3352846K->2504330K(3909632K), 0.0269847 secs]
SUREFIRE-859: [GC (Allocation Failure)  3394626K->2503638K(3920896K), 0.0300253 secs]
SUREFIRE-859: [GC (Allocation Failure)  3393955K->2508891K(3937280K), 0.0275694 secs]
Tests run: 1, Failures: 0, Errors: 0, Skipped: 0, Time elapsed: 95.99 sec - in org.apache.hadoop.hbase.IntegrationTestLazyCfLoading

Results :

Failed tests: 
  IntegrationTestRegionReplicaReplication.testIngest:112->runIngestTest:197 Load failed
with error code 1
  IntegrationTestBulkLoad.testBulkLoad:217->runCheck:719 expected:<true> but was:<false>
Tests in error: 
  IntegrationTestIngestWithACL>IntegrationTestBase.setUp:133->setUpCluster:64->IntegrationTestIngest.setUpCluster:84
» IO
  IntegrationTestMTTR.testKillRsHoldingMeta:278->run:319 » Execution java.io.IOE...
  IntegrationTestMTTR.testRestartRsHoldingTable:273->run:319 » Execution java.io...
  IntegrationTestBigLinkedListWithVisibility.testContinuousIngest:636 » Runtime ...
  IntegrationTestWithCellVisibilityLoadAndVerify>IntegrationTestLoadAndVerify.testLoadAndVerify:545->doVerify:293->access$400:79->doVerify:338
» FileAlreadyExists

Tests run: 32, Failures: 2, Errors: 5, Skipped: 2

[WARNING] File encoding has not been set, using platform encoding ISO-8859-1, i.e. build is
platform dependent! The file encoding for reports output files should be provided by the POM
property ${project.reporting.outputEncoding}.
[INFO] 
[INFO] --- maven-failsafe-plugin:2.18.1:verify (verify) @ hbase-it ---
[INFO] Failsafe report directory: <https://builds.apache.org/job/HBase-1.2-IT/it.test=IntegrationTestAcidGuarantees,jdk=JDK%201.8%20(latest),label=Hadoop/ws/hbase-it/target/failsafe-reports>
[WARNING] File encoding has not been set, using platform encoding ISO-8859-1, i.e. build is
platform dependent! The file encoding for reports output files should be provided by the POM
property ${project.reporting.outputEncoding}.
[INFO] ------------------------------------------------------------------------
[INFO] Reactor Summary:
[INFO] 
[INFO] Apache HBase ...................................... SUCCESS [1:48.072s]
[INFO] Apache HBase - Checkstyle ......................... SUCCESS [7.454s]
[INFO] Apache HBase - Resource Bundle .................... SUCCESS [0.194s]
[INFO] Apache HBase - Annotations ........................ SUCCESS [0.914s]
[INFO] Apache HBase - Protocol ........................... SUCCESS [18.166s]
[INFO] Apache HBase - Common ............................. SUCCESS [1:49.283s]
[INFO] Apache HBase - Procedure .......................... SUCCESS [1.123s]
[INFO] Apache HBase - Client ............................. SUCCESS [14.021s]
[INFO] Apache HBase - Hadoop Compatibility ............... SUCCESS [2.519s]
[INFO] Apache HBase - Hadoop Two Compatibility ........... SUCCESS [3.385s]
[INFO] Apache HBase - Prefix Tree ........................ SUCCESS [1.070s]
[INFO] Apache HBase - Server ............................. SUCCESS [1:38.438s]
[INFO] Apache HBase - Testing Util ....................... SUCCESS [2.552s]
[INFO] Apache HBase - Thrift ............................. SUCCESS [9.241s]
[INFO] Apache HBase - Rest ............................... SUCCESS [2.413s]
[INFO] Apache HBase - Shell .............................. SUCCESS [7.586s]
[INFO] Apache HBase - Integration Tests .................. FAILURE [3:14:57.521s]
[INFO] Apache HBase - Examples ........................... SKIPPED
[INFO] Apache HBase - External Block Cache ............... SKIPPED
[INFO] Apache HBase - Assembly ........................... SKIPPED
[INFO] Apache HBase - Shaded ............................. SKIPPED
[INFO] Apache HBase - Shaded - Client .................... SKIPPED
[INFO] Apache HBase - Shaded - Server .................... SKIPPED
[INFO] ------------------------------------------------------------------------
[INFO] BUILD FAILURE
[INFO] ------------------------------------------------------------------------
[INFO] Total time: 3:21:55.335s
[INFO] Finished at: Fri Feb 24 02:50:08 UTC 2017
[INFO] Final Memory: 131M/1158M
[INFO] ------------------------------------------------------------------------
[ERROR] Failed to execute goal org.apache.maven.plugins:maven-failsafe-plugin:2.18.1:verify
(verify) on project hbase-it: There was a timeout or other error in the fork -> [Help 1]
[ERROR] 
[ERROR] To see the full stack trace of the errors, re-run Maven with the -e switch.
[ERROR] Re-run Maven using the -X switch to enable full debug logging.
[ERROR] 
[ERROR] For more information about the errors and possible solutions, please read the following
articles:
[ERROR] [Help 1] http://cwiki.apache.org/confluence/display/MAVEN/MojoFailureException
[ERROR] 
[ERROR] After correcting the problems, you can resume the build with the command
[ERROR]   mvn <goals> -rf :hbase-it
Build step 'Invoke top-level Maven targets' marked build as failure
Performing Post build task...
Match found for :.* : True
Logical operation result is TRUE
Running script  : # Post-build task script. TODO: Check this in and have all builds reference
check-in.
pwd && ls
# NOTE!!!! The below code has been copied and pasted from ./dev-tools/run-test.sh
# Do not change here without syncing there and vice-versa.
ZOMBIE_TESTS_COUNT=`jps -v | grep surefirebooter | grep -e '-Dhbase.test' | wc -l`
if [[ $ZOMBIE_TESTS_COUNT != 0 ]] ; then
 echo "Suspicious java process found - waiting 30s to see if there are just slow to stop"
 sleep 30
 ZOMBIE_TESTS_COUNT=`jps -v | grep surefirebooter | grep -e '-Dhbase.test' | wc -l`
 if [[ $ZOMBIE_TESTS_COUNT != 0 ]] ; then
   echo " {color:red}There appear to be $ZOMBIE_TESTS_COUNT zombie tests{color}, they should
have been killed by surefire but survived"
   jps -v | grep surefirebooter | grep -e '-Dhbase.test'
   jps -v | grep surefirebooter | grep -e '-Dhbase.test' | cut -d ' ' -f 1 | xargs -n 1 jstack
   # Exit with error
   exit 1
 else
   echo "We're ok: there is no zombie test, but some tests took some time to stop"
 fi
else
  echo "We're ok: there is no zombie test"
fi
[0407dd4a] $ /bin/bash -xe /tmp/hudson7267565538394409375.sh
+ pwd
<https://builds.apache.org/job/HBase-1.2-IT/it.test=IntegrationTestAcidGuarantees,jdk=JDK%201.8%20(latest),label=Hadoop/ws/>
+ ls
bin
CHANGES.txt
conf
dev-support
hbase-annotations
hbase-assembly
hbase-checkstyle
hbase-client
hbase-common
hbase-examples
hbase-external-blockcache
hbase-hadoop2-compat
hbase-hadoop-compat
hbase-it
hbase-native-client
hbase-prefix-tree
hbase-procedure
hbase-protocol
hbase-resource-bundle
hbase-rest
hbase-server
hbase-shaded
hbase-shell
hbase-testing-util
hbase-thrift
LICENSE.txt
NOTICE.txt
pom.xml
README.txt
src
target
++ jps -v
++ grep surefirebooter
++ wc -l
++ grep -e -Dhbase.test
+ ZOMBIE_TESTS_COUNT=0
+ [[ 0 != 0 ]]
+ echo 'We'\''re ok: there is no zombie test'
We're ok: there is no zombie test
POST BUILD TASK : SUCCESS
END OF POST BUILD TASK : 0
Archiving artifacts
No prior successful build to compare, so performing full copy of artifacts

Mime
View raw message