hbase-builds mailing list archives

Site index · List index
Message view « Date » · « Thread »
Top « Date » · « Thread »
From Apache Jenkins Server <jenk...@builds.apache.org>
Subject Build failed in Jenkins: HBase-1.2-IT » IntegrationTestAcidGuarantees,JDK 1.7 (latest),Hadoop #599
Date Tue, 21 Feb 2017 19:25:29 GMT
See <https://builds.apache.org/job/HBase-1.2-IT/it.test=IntegrationTestAcidGuarantees,jdk=JDK%201.7%20(latest),label=Hadoop/599/display/redirect>

------------------------------------------
[...truncated 4.17 MB...]
SUREFIRE-859: [GC 2178629K->995490K(2596864K), 0.0426920 secs]
SUREFIRE-859: [GC 2206370K->1010122K(2658816K), 0.0290280 secs]
SUREFIRE-859: [GC 2227658K->1019821K(2657280K), 0.0224530 secs]
SUREFIRE-859: [GC 2237353K->1027887K(2667008K), 0.0255690 secs]
SUREFIRE-859: [GC 2257704K->1080350K(2664960K), 0.0263980 secs]
SUREFIRE-859: [GC 2310174K->1110573K(2671104K), 0.0264050 secs]
SUREFIRE-859: [GC 2341891K->1118763K(2595840K), 0.0230710 secs]
SUREFIRE-859: [GC 2350123K->1160501K(2664448K), 0.0286990 secs]
SUREFIRE-859: [GC 2390325K->1203194K(2665984K), 0.0326740 secs]
SUREFIRE-859: [GC 2433014K->1259268K(2664960K), 0.0252540 secs]
SUREFIRE-859: [GC 2490605K->1248876K(2670080K), 0.0637300 secs]
SUREFIRE-859: [GC 2480187K->1256608K(2662400K), 0.0248160 secs]
SUREFIRE-859: [GC 2490528K->1310915K(2667520K), 0.0235440 secs]
SUREFIRE-859: [GC 2544835K->1319173K(2672640K), 0.0208320 secs]
SUREFIRE-859: [Full GC 1319173K->397924K(2593280K), 0.3139140 secs]
SUREFIRE-859: [GC 1635940K->406596K(2522624K), 0.0126510 secs]
SUREFIRE-859: [GC 1644612K->434391K(2594816K), 0.0201860 secs]
SUREFIRE-859: [GC 1677527K->468206K(2591744K), 0.0201330 secs]
SUREFIRE-859: [GC 1711342K->504835K(2597376K), 0.0270360 secs]
SUREFIRE-859: [GC 1758723K->513235K(2594816K), 0.0341010 secs]
SUREFIRE-859: [GC 1767069K->536339K(2604032K), 0.0266550 secs]
SUREFIRE-859: [GC 1802515K->566089K(2603520K), 0.0279850 secs]
SUREFIRE-859: [GC 1832265K->608066K(2601472K), 0.0223730 secs]
SUREFIRE-859: [GC 1874212K->618344K(2608128K), 0.0213670 secs]
SUREFIRE-859: [GC 1884520K->622268K(2605056K), 0.0184580 secs]
SUREFIRE-859: [GC 1889468K->627941K(2607104K), 0.0202520 secs]
SUREFIRE-859: [GC 1895141K->645080K(2600960K), 0.0189200 secs]
SUREFIRE-859: [GC 1916364K->674347K(2606080K), 0.0191510 secs]
SUREFIRE-859: [GC 1945643K->682851K(2610176K), 0.0198880 secs]
SUREFIRE-859: [GC 1962339K->702621K(2612224K), 0.0177930 secs]
SUREFIRE-859: [GC 1982109K->721947K(2614784K), 0.0181630 secs]
SUREFIRE-859: [GC 2008091K->727083K(2616320K), 0.0199270 secs]
SUREFIRE-859: [GC 2013227K->737717K(2614784K), 0.0543340 secs]
SUREFIRE-859: [GC 2028981K->761953K(2617344K), 0.0213270 secs]
SUREFIRE-859: [GC 2053217K->775993K(2619392K), 0.0218090 secs]
SUREFIRE-859: [GC 2074425K->772143K(2621952K), 0.0202210 secs]
SUREFIRE-859: [GC 2070575K->781817K(2619392K), 0.0215230 secs]
SUREFIRE-859: [GC 2086393K->817997K(2623488K), 0.0219000 secs]
SUREFIRE-859: [GC 2122573K->800237K(2626560K), 0.0355460 secs]
SUREFIRE-859: [GC 2101229K->810937K(2595840K), 0.0282990 secs]
SUREFIRE-859: [GC 2111929K->815772K(2623488K), 0.0219300 secs]
SUREFIRE-859: [GC 2118300K->840049K(2621952K), 0.0255740 secs]
SUREFIRE-859: [GC 2142577K->865124K(2625024K), 0.0287000 secs]
SUREFIRE-859: [GC 2168164K->867059K(2626560K), 0.0189920 secs]
SUREFIRE-859: [GC 2170099K->884839K(2625024K), 0.0186370 secs]
SUREFIRE-859: [GC 2188903K->900988K(2626048K), 0.0160940 secs]
SUREFIRE-859: [GC 2205052K->971158K(2578944K), 0.0380710 secs]
SUREFIRE-859: [GC 2229142K->978830K(2604032K), 0.0402610 secs]
SUREFIRE-859: [GC 2236806K->993973K(2597376K), 0.0184900 secs]
SUREFIRE-859: [GC 2253493K->1011441K(2601472K), 0.0219300 secs]
SUREFIRE-859: [GC 2270961K->1024338K(2605056K), 0.0129500 secs]
SUREFIRE-859: [GC 2290118K->1052344K(2607104K), 0.0419380 secs]
SUREFIRE-859: [GC 2319544K->1108732K(2607616K), 0.0287650 secs]
SUREFIRE-859: [GC 2379004K->1133398K(2609664K), 0.0161000 secs]
SUREFIRE-859: [GC 2403670K->1140043K(2609664K), 0.0356470 secs]
SUREFIRE-859: [GC 2414411K->1147181K(2609664K), 0.0174920 secs]
SUREFIRE-859: [GC 2421549K->1215521K(2583040K), 0.0202980 secs]
SUREFIRE-859: [GC 2464289K->1239866K(2599424K), 0.0279330 secs]
SUREFIRE-859: [Full GC 1239866K->429096K(2693632K), 0.2552950 secs]
SUREFIRE-859: [GC 1677864K->452777K(2681344K), 0.0214650 secs]
SUREFIRE-859: [GC 1705641K->532368K(2689536K), 0.0308150 secs]
SUREFIRE-859: [GC 1785232K->559247K(2693120K), 0.0207120 secs]
SUREFIRE-859: [GC 1805425K->619192K(2679296K), 0.0225630 secs]
SUREFIRE-859: [GC 1865400K->622501K(2688512K), 0.0237720 secs]
SUREFIRE-859: [GC 1858469K->640622K(2625024K), 0.0185840 secs]
SUREFIRE-859: [GC 1876590K->655690K(2685952K), 0.0267420 secs]
SUREFIRE-859: [GC 1893706K->723730K(2683904K), 0.0182330 secs]
SUREFIRE-859: [GC 1961702K->743539K(2689024K), 0.0180920 secs]
SUREFIRE-859: [GC 1988677K->750641K(2688512K), 0.0150950 secs]
SUREFIRE-859: [GC 1995825K->784729K(2693120K), 0.0153240 secs]
SUREFIRE-859: [GC 2037081K->832758K(2673152K), 0.0261720 secs]
SUREFIRE-859: [GC 2085097K->827761K(2694144K), 0.0224760 secs]
SUREFIRE-859: [GC 2076501K->836315K(2628096K), 0.0178420 secs]
SUREFIRE-859: [GC 2085083K->905255K(2681344K), 0.0178130 secs]
SUREFIRE-859: [GC 2143783K->909976K(2688512K), 0.0255670 secs]
SUREFIRE-859: [GC 2148504K->899677K(2683904K), 0.0370290 secs]
SUREFIRE-859: [GC 2140761K->911457K(2687488K), 0.0227710 secs]
SUREFIRE-859: [GC 2152483K->934642K(2683904K), 0.0301870 secs]
SUREFIRE-859: [GC 2182898K->948053K(2688512K), 0.0335950 secs]
SUREFIRE-859: [GC 2196309K->961429K(2692096K), 0.0305630 secs]
SUREFIRE-859: [GC 2221973K->959446K(2696192K), 0.0420270 secs]
SUREFIRE-859: [GC 2219990K->963561K(2697728K), 0.0227670 secs]
SUREFIRE-859: [GC 2231785K->959636K(2700800K), 0.0163190 secs]
SUREFIRE-859: [GC 2227860K->961460K(2702336K), 0.0181920 secs]
SUREFIRE-859: [GC 2235316K->968066K(2704384K), 0.0225290 secs]
SUREFIRE-859: [GC 2241922K->972732K(2703872K), 0.0171600 secs]
SUREFIRE-859: [GC 2253244K->972149K(2705408K), 0.0209710 secs]
SUREFIRE-859: [GC 2252616K->1021973K(2694144K), 0.0245360 secs]
SUREFIRE-859: [GC 2293269K->1047728K(2704896K), 0.0256810 secs]
SUREFIRE-859: [GC 2319024K->1105650K(2608640K), 0.0263940 secs]
SUREFIRE-859: [GC 2280690K->1137162K(2604544K), 0.0461250 secs]
SUREFIRE-859: [GC 2312202K->1117938K(2661888K), 0.0516040 secs]
SUREFIRE-859: [GC 2296562K->1104330K(2563072K), 0.0392440 secs]
SUREFIRE-859: [GC 2282954K->1103747K(2655232K), 0.0210450 secs]
SUREFIRE-859: [GC 2285443K->1098156K(2652160K), 0.0174290 secs]
SUREFIRE-859: [GC 2279852K->1103731K(2664448K), 0.0260320 secs]
SUREFIRE-859: [GC 2301811K->1100163K(2662400K), 0.0173780 secs]
SUREFIRE-859: [GC 2298243K->1102655K(2670592K), 0.0185890 secs]
SUREFIRE-859: [GC 2314047K->1105095K(2669568K), 0.0217390 secs]
SUREFIRE-859: [GC 2316487K->1105445K(2676736K), 0.0188800 secs]
SUREFIRE-859: [GC 2330149K->1104825K(2675712K), 0.0343910 secs]
SUREFIRE-859: [GC 2329530K->1124528K(2683392K), 0.0313570 secs]
SUREFIRE-859: [GC 2364269K->1130867K(2682880K), 0.0242430 secs]
SUREFIRE-859: [GC 2370419K->1119417K(2692096K), 0.0194200 secs]
SUREFIRE-859: [GC 2373817K->1118075K(2691072K), 0.0133320 secs]
SUREFIRE-859: [GC 2372475K->1118443K(2699264K), 0.0178980 secs]
SUREFIRE-859: [GC 2385131K->1120960K(2698240K), 0.0203080 secs]
SUREFIRE-859: [GC 2387648K->1119693K(2704384K), 0.0193060 secs]
SUREFIRE-859: [GC 2396621K->1121126K(2702848K), 0.0195540 secs]
SUREFIRE-859: [GC 2398054K->1229313K(2649088K), 0.0312610 secs]
SUREFIRE-859: [GC 2455553K->1311498K(2648576K), 0.0323060 secs]
SUREFIRE-859: [GC 2537738K->1399500K(2643968K), 0.0559060 secs]
SUREFIRE-859: [Full GC 1399500K->589532K(2882048K), 0.4083200 secs]
Tests run: 1, Failures: 0, Errors: 0, Skipped: 0, Time elapsed: 674.791 sec - in org.apache.hadoop.hbase.IntegrationTestIngestWithEncryption

Results :

Failed tests: 
  IntegrationTestRegionReplicaReplication.testIngest:112->runIngestTest:197 Load failed
with error code 1
  IntegrationTestBulkLoad.testBulkLoad:217->runCheck:719 expected:<true> but was:<false>
Tests in error: 
  IntegrationTestIngestWithACL>IntegrationTestBase.setUp:133->setUpCluster:64->IntegrationTestIngest.setUpCluster:84
» IO
  IntegrationTestMTTR.testKillRsHoldingMeta:278->run:319 » Execution java.io.IOE...
  IntegrationTestMTTR.testRestartRsHoldingTable:273->run:319 » Execution java.io...
  IntegrationTestBigLinkedListWithVisibility.testContinuousIngest:636 » Runtime ...
  IntegrationTestWithCellVisibilityLoadAndVerify>IntegrationTestLoadAndVerify.testLoadAndVerify:545->doVerify:293->access$400:79->doVerify:338
» FileAlreadyExists

Tests run: 32, Failures: 2, Errors: 5, Skipped: 2

[WARNING] File encoding has not been set, using platform encoding ISO-8859-1, i.e. build is
platform dependent! The file encoding for reports output files should be provided by the POM
property ${project.reporting.outputEncoding}.
[INFO] 
[INFO] --- maven-failsafe-plugin:2.18.1:verify (verify) @ hbase-it ---
[INFO] Failsafe report directory: <https://builds.apache.org/job/HBase-1.2-IT/it.test=IntegrationTestAcidGuarantees,jdk=JDK%201.7%20(latest),label=Hadoop/ws/hbase-it/target/failsafe-reports>
[WARNING] File encoding has not been set, using platform encoding ISO-8859-1, i.e. build is
platform dependent! The file encoding for reports output files should be provided by the POM
property ${project.reporting.outputEncoding}.
[INFO] ------------------------------------------------------------------------
[INFO] Reactor Summary:
[INFO] 
[INFO] Apache HBase ...................................... SUCCESS [1:57.281s]
[INFO] Apache HBase - Checkstyle ......................... SUCCESS [7.558s]
[INFO] Apache HBase - Resource Bundle .................... SUCCESS [0.291s]
[INFO] Apache HBase - Annotations ........................ SUCCESS [1.107s]
[INFO] Apache HBase - Protocol ........................... SUCCESS [18.148s]
[INFO] Apache HBase - Common ............................. SUCCESS [1:37.299s]
[INFO] Apache HBase - Procedure .......................... SUCCESS [1.482s]
[INFO] Apache HBase - Client ............................. SUCCESS [12.422s]
[INFO] Apache HBase - Hadoop Compatibility ............... SUCCESS [2.623s]
[INFO] Apache HBase - Hadoop Two Compatibility ........... SUCCESS [3.690s]
[INFO] Apache HBase - Prefix Tree ........................ SUCCESS [1.207s]
[INFO] Apache HBase - Server ............................. SUCCESS [1:40.836s]
[INFO] Apache HBase - Testing Util ....................... SUCCESS [13.083s]
[INFO] Apache HBase - Thrift ............................. SUCCESS [9.901s]
[INFO] Apache HBase - Rest ............................... SUCCESS [2.885s]
[INFO] Apache HBase - Shell .............................. SUCCESS [6.275s]
[INFO] Apache HBase - Integration Tests .................. FAILURE [3:21:09.299s]
[INFO] Apache HBase - Examples ........................... SKIPPED
[INFO] Apache HBase - External Block Cache ............... SKIPPED
[INFO] Apache HBase - Assembly ........................... SKIPPED
[INFO] Apache HBase - Shaded ............................. SKIPPED
[INFO] Apache HBase - Shaded - Client .................... SKIPPED
[INFO] Apache HBase - Shaded - Server .................... SKIPPED
[INFO] ------------------------------------------------------------------------
[INFO] BUILD FAILURE
[INFO] ------------------------------------------------------------------------
[INFO] Total time: 3:28:17.384s
[INFO] Finished at: Tue Feb 21 19:24:18 UTC 2017
[INFO] Final Memory: 82M/608M
[INFO] ------------------------------------------------------------------------
[ERROR] Failed to execute goal org.apache.maven.plugins:maven-failsafe-plugin:2.18.1:verify
(verify) on project hbase-it: There was a timeout or other error in the fork -> [Help 1]
[ERROR] 
[ERROR] To see the full stack trace of the errors, re-run Maven with the -e switch.
[ERROR] Re-run Maven using the -X switch to enable full debug logging.
[ERROR] 
[ERROR] For more information about the errors and possible solutions, please read the following
articles:
[ERROR] [Help 1] http://cwiki.apache.org/confluence/display/MAVEN/MojoFailureException
[ERROR] 
[ERROR] After correcting the problems, you can resume the build with the command
[ERROR]   mvn <goals> -rf :hbase-it
Build step 'Invoke top-level Maven targets' marked build as failure
Performing Post build task...
Match found for :.* : True
Logical operation result is TRUE
Running script  : # Post-build task script. TODO: Check this in and have all builds reference
check-in.
pwd && ls
# NOTE!!!! The below code has been copied and pasted from ./dev-tools/run-test.sh
# Do not change here without syncing there and vice-versa.
ZOMBIE_TESTS_COUNT=`jps -v | grep surefirebooter | grep -e '-Dhbase.test' | wc -l`
if [[ $ZOMBIE_TESTS_COUNT != 0 ]] ; then
 echo "Suspicious java process found - waiting 30s to see if there are just slow to stop"
 sleep 30
 ZOMBIE_TESTS_COUNT=`jps -v | grep surefirebooter | grep -e '-Dhbase.test' | wc -l`
 if [[ $ZOMBIE_TESTS_COUNT != 0 ]] ; then
   echo " {color:red}There appear to be $ZOMBIE_TESTS_COUNT zombie tests{color}, they should
have been killed by surefire but survived"
   jps -v | grep surefirebooter | grep -e '-Dhbase.test'
   jps -v | grep surefirebooter | grep -e '-Dhbase.test' | cut -d ' ' -f 1 | xargs -n 1 jstack
   # Exit with error
   exit 1
 else
   echo "We're ok: there is no zombie test, but some tests took some time to stop"
 fi
else
  echo "We're ok: there is no zombie test"
fi
[468d432e] $ /bin/bash -xe /tmp/hudson3711220848266785233.sh
+ pwd
<https://builds.apache.org/job/HBase-1.2-IT/it.test=IntegrationTestAcidGuarantees,jdk=JDK%201.7%20(latest),label=Hadoop/ws/>
+ ls
bin
CHANGES.txt
conf
dev-support
hbase-annotations
hbase-assembly
hbase-checkstyle
hbase-client
hbase-common
hbase-examples
hbase-external-blockcache
hbase-hadoop2-compat
hbase-hadoop-compat
hbase-it
hbase-native-client
hbase-prefix-tree
hbase-procedure
hbase-protocol
hbase-resource-bundle
hbase-rest
hbase-server
hbase-shaded
hbase-shell
hbase-testing-util
hbase-thrift
LICENSE.txt
NOTICE.txt
pom.xml
README.txt
src
target
++ jps -v
++ grep surefirebooter
++ wc -l
++ grep -e -Dhbase.test
+ ZOMBIE_TESTS_COUNT=0
+ [[ 0 != 0 ]]
+ echo 'We'\''re ok: there is no zombie test'
We're ok: there is no zombie test
POST BUILD TASK : SUCCESS
END OF POST BUILD TASK : 0
Archiving artifacts
No prior successful build to compare, so performing full copy of artifacts

Mime
View raw message