hbase-builds mailing list archives

Site index · List index
Message view « Date » · « Thread »
Top « Date » · « Thread »
From Apache Jenkins Server <jenk...@builds.apache.org>
Subject Build failed in Jenkins: HBase-1.2-IT » IntegrationTestBigLinkedList,JDK 1.8 (latest),Hadoop #599
Date Tue, 21 Feb 2017 19:23:18 GMT
See <https://builds.apache.org/job/HBase-1.2-IT/it.test=IntegrationTestBigLinkedList,jdk=JDK%201.8%20(latest),label=Hadoop/599/display/redirect>

------------------------------------------
[...truncated 4.91 MB...]
     bool UseNUMA                                   = false                              
{product}
     bool UseNUMAInterleaving                       = false                              
{product}
     bool UseNewLongLShift                          = false                              
{ARCH product}
     bool UseOSErrorReporting                       = false                              
{pd product}
     bool UseOldInlining                            = true                               
{C2 product}
     bool UseOnStackReplacement                     = true                               
{pd product}
     bool UseOnlyInlinedBimorphic                   = true                               
{C2 product}
     bool UseOprofile                               = false                              
{product}
     bool UseOptoBiasInlining                       = true                               
{C2 product}
     bool UsePSAdaptiveSurvivorSizePolicy           = true                               
{product}
     bool UseParNewGC                               = false                              
{product}
     bool UseParallelGC                            := true                               
{product}
     bool UseParallelOldGC                          = true                               
{product}
     bool UsePerfData                               = true                               
{product}
     bool UsePopCountInstruction                    = true                               
{product}
     bool UseRDPCForConstantTableBase               = false                              
{C2 product}
     bool UseRTMDeopt                               = false                              
{ARCH product}
     bool UseRTMLocking                             = false                              
{ARCH product}
     bool UseSHA                                    = false                              
{product}
     bool UseSHA1Intrinsics                         = false                              
{product}
     bool UseSHA256Intrinsics                       = false                              
{product}
     bool UseSHA512Intrinsics                       = false                              
{product}
     bool UseSHM                                    = false                              
{product}
     intx UseSSE                                    = 4                                  
{product}
     bool UseSSE42Intrinsics                        = true                               
{product}
     bool UseSerialGC                               = false                              
{product}
     bool UseSharedSpaces                           = false                              
{product}
     bool UseSignalChaining                         = true                               
{product}
     bool UseSquareToLenIntrinsic                   = false                              
{C2 product}
     bool UseStoreImmI16                            = false                              
{ARCH product}
     bool UseStringDeduplication                    = false                              
{product}
     bool UseSuperWord                              = true                               
{C2 product}
     bool UseTLAB                                   = true                               
{pd product}
     bool UseThreadPriorities                       = true                               
{pd product}
     bool UseTransparentHugePages                   = false                              
{product}
     bool UseTypeProfile                            = true                               
{product}
     bool UseTypeSpeculation                        = true                               
{C2 product}
     bool UseUnalignedLoadStores                    = true                               
{ARCH product}
     bool UseVMInterruptibleIO                      = false                              
{product}
     bool UseXMMForArrayCopy                        = true                               
{product}
     bool UseXmmI2D                                 = false                              
{ARCH product}
     bool UseXmmI2F                                 = false                              
{ARCH product}
     bool UseXmmLoadAndClearUpper                   = true                               
{ARCH product}
     bool UseXmmRegToRegMoveAll                     = true                               
{ARCH product}
     bool VMThreadHintNoPreempt                     = false                              
{product}
     intx VMThreadPriority                          = -1                                 
{product}
     intx VMThreadStackSize                         = 1024                               
{pd product}
     intx ValueMapInitialSize                       = 11                                 
{C1 product}
     intx ValueMapMaxLoopSize                       = 8                                  
{C1 product}
     intx ValueSearchLimit                          = 1000                               
{C2 product}
     bool VerifyMergedCPBytecodes                   = true                               
{product}
     bool VerifySharedSpaces                        = false                              
{product}
     intx WorkAroundNPTLTimedWaitHang               = 1                                  
{product}
    uintx YoungGenerationSizeIncrement              = 20                                 
{product}
    uintx YoungGenerationSizeSupplement             = 80                                 
{product}
    uintx YoungGenerationSizeSupplementDecay        = 8                                  
{product}
    uintx YoungPLABSize                             = 4096                               
{product}
     bool ZeroTLAB                                  = false                              
{product}
     intx hashCode                                  = 5                                  
{product}
Running org.apache.hadoop.hbase.IntegrationTestLazyCfLoading
SUREFIRE-859: [GC (Metadata GC Threshold)  239062K->16557K(1482240K), 0.0299777 secs]
SUREFIRE-859: [Full GC (Metadata GC Threshold)  16557K->15655K(1119232K), 0.0620711 secs]
SUREFIRE-859: [GC (Metadata GC Threshold)  326149K->96264K(1375232K), 0.1390863 secs]
SUREFIRE-859: [Full GC (Metadata GC Threshold)  96264K->85732K(1736704K), 0.0724337 secs]
SUREFIRE-859: [GC (Allocation Failure)  728804K->183423K(1867776K), 0.0417342 secs]
SUREFIRE-859: [GC (Allocation Failure)  957567K->366301K(2056192K), 0.0364121 secs]
SUREFIRE-859: [GC (Allocation Failure)  1328808K->501648K(2056192K), 0.0376016 secs]
SUREFIRE-859: [GC (Allocation Failure)  1464130K->613984K(2133504K), 0.0311811 secs]
SUREFIRE-859: [GC (Allocation Failure)  1426016K->718754K(2123264K), 0.0316569 secs]
SUREFIRE-859: [GC (Allocation Failure)  1530775K->798781K(1910272K), 0.0462978 secs]
SUREFIRE-859: [GC (Allocation Failure)  1374290K->967657K(1906176K), 0.0491028 secs]
SUREFIRE-859: [GC (Allocation Failure)  1544038K->1076303K(2015232K), 0.0416941 secs]
SUREFIRE-859: [Full GC (Ergonomics)  1076303K->557989K(2836992K), 0.1681008 secs]
SUREFIRE-859: [GC (Allocation Failure)  1109925K->669005K(2514432K), 0.0315218 secs]
SUREFIRE-859: [GC (Allocation Failure)  1220908K->749244K(2811392K), 0.0197644 secs]
SUREFIRE-859: [GC (Allocation Failure)  1304764K->831029K(2807808K), 0.0276648 secs]
SUREFIRE-859: [GC (Allocation Failure)  1386517K->982364K(2830848K), 0.0287170 secs]
SUREFIRE-859: [GC (Allocation Failure)  1584948K->1114124K(2834432K), 0.0353430 secs]
SUREFIRE-859: [GC (Allocation Failure)  1716748K->1181395K(2861568K), 0.0315087 secs]
SUREFIRE-859: [GC (Allocation Failure)  1828033K->1191350K(2855424K), 0.0279191 secs]
SUREFIRE-859: [GC (Allocation Failure)  1837964K->1378774K(2889728K), 0.0296653 secs]
SUREFIRE-859: [GC (Allocation Failure)  2056150K->1467397K(2654720K), 0.0444563 secs]
SUREFIRE-859: [GC (Allocation Failure)  2144773K->1638565K(2888704K), 0.0347563 secs]
SUREFIRE-859: [GC (Allocation Failure)  2335898K->1807289K(2868736K), 0.0421101 secs]
SUREFIRE-859: [Full GC (Ergonomics)  1807289K->573269K(3027968K), 0.1617548 secs]
SUREFIRE-859: [GC (Allocation Failure)  1270613K->666611K(3059712K), 0.0284476 secs]
SUREFIRE-859: [GC (Allocation Failure)  1413047K->742696K(3051008K), 0.0220468 secs]
SUREFIRE-859: [GC (Allocation Failure)  1489192K->920836K(3082752K), 0.0309090 secs]
SUREFIRE-859: [GC (Allocation Failure)  1705062K->947339K(3098624K), 0.0411976 secs]
SUREFIRE-859: [GC (Allocation Failure)  1732546K->1035964K(3076096K), 0.0376426 secs]
SUREFIRE-859: [GC (Allocation Failure)  1840316K->1084237K(3092992K), 0.0331132 secs]
SUREFIRE-859: [GC (Allocation Failure)  1888570K->1127392K(3124736K), 0.0259371 secs]
SUREFIRE-859: [GC (Allocation Failure)  1969632K->1205375K(2980864K), 0.0274302 secs]
SUREFIRE-859: [GC (Allocation Failure)  2047615K->1299710K(3128832K), 0.0377579 secs]
SUREFIRE-859: [GC (Allocation Failure)  2155262K->1377595K(3124224K), 0.0330330 secs]
SUREFIRE-859: [GC (Allocation Failure)  2233147K->1551632K(3136000K), 0.0398003 secs]
SUREFIRE-859: [GC (Allocation Failure)  2428688K->1708582K(3136000K), 0.0391283 secs]
SUREFIRE-859: [GC (Allocation Failure)  2585606K->1862734K(3153408K), 0.0457032 secs]
SUREFIRE-859: [GC (Allocation Failure)  2753571K->2007272K(3041792K), 0.0519278 secs]
SUREFIRE-859: [Full GC (Ergonomics)  2007272K->1070336K(3635712K), 0.2303315 secs]
SUREFIRE-859: [GC (Allocation Failure)  1961202K->1273719K(3721728K), 0.0194720 secs]
SUREFIRE-859: [GC (Allocation Failure)  2143365K->1376656K(3738624K), 0.0302414 secs]
SUREFIRE-859: [GC (Allocation Failure)  2247016K->1516124K(3713536K), 0.0387045 secs]
SUREFIRE-859: [GC (Allocation Failure)  2387839K->1666701K(3726848K), 0.0283812 secs]
SUREFIRE-859: [GC (Allocation Failure)  2537941K->1748073K(3739136K), 0.0288293 secs]
SUREFIRE-859: [GC (Allocation Failure)  2651753K->1872804K(3748864K), 0.0302804 secs]
SUREFIRE-859: [GC (Allocation Failure)  2776484K->1999178K(3744768K), 0.0353954 secs]
SUREFIRE-859: [GC (Allocation Failure)  2924084K->2024094K(3752448K), 0.0471984 secs]
SUREFIRE-859: [GC (Allocation Failure)  2949838K->2028320K(3758592K), 0.0251317 secs]
SUREFIRE-859: [GC (Allocation Failure)  2953497K->2025420K(3532288K), 0.0191634 secs]
SUREFIRE-859: [GC (Allocation Failure)  2948118K->2027307K(3759616K), 0.0205971 secs]
SUREFIRE-859: [GC (Allocation Failure)  2941673K->2028194K(3523072K), 0.0216712 secs]
SUREFIRE-859: [GC (Allocation Failure)  2942562K->2029316K(3763200K), 0.0187973 secs]
Tests run: 1, Failures: 0, Errors: 0, Skipped: 0, Time elapsed: 93.795 sec - in org.apache.hadoop.hbase.IntegrationTestLazyCfLoading

Results :

Failed tests: 
  IntegrationTestRegionReplicaReplication.testIngest:112->runIngestTest:197 Load failed
with error code 1
  IntegrationTestBulkLoad.testBulkLoad:217->runCheck:719 expected:<true> but was:<false>
Tests in error: 
  IntegrationTestIngestWithACL>IntegrationTestBase.setUp:133->setUpCluster:64->IntegrationTestIngest.setUpCluster:84
» IO
  IntegrationTestMTTR.testKillRsHoldingMeta:278->run:319 » Execution java.io.IOE...
  IntegrationTestMTTR.testRestartRsHoldingTable:273->run:319 » Execution java.io...
  IntegrationTestBigLinkedListWithVisibility.testContinuousIngest:636 » Runtime ...
  IntegrationTestWithCellVisibilityLoadAndVerify>IntegrationTestLoadAndVerify.testLoadAndVerify:545->doVerify:293->access$400:79->doVerify:338
» FileAlreadyExists

Tests run: 32, Failures: 2, Errors: 5, Skipped: 2

[WARNING] File encoding has not been set, using platform encoding ISO-8859-1, i.e. build is
platform dependent! The file encoding for reports output files should be provided by the POM
property ${project.reporting.outputEncoding}.
[INFO] 
[INFO] --- maven-failsafe-plugin:2.18.1:verify (verify) @ hbase-it ---
[INFO] Failsafe report directory: <https://builds.apache.org/job/HBase-1.2-IT/it.test=IntegrationTestBigLinkedList,jdk=JDK%201.8%20(latest),label=Hadoop/ws/hbase-it/target/failsafe-reports>
[WARNING] File encoding has not been set, using platform encoding ISO-8859-1, i.e. build is
platform dependent! The file encoding for reports output files should be provided by the POM
property ${project.reporting.outputEncoding}.
[INFO] ------------------------------------------------------------------------
[INFO] Reactor Summary:
[INFO] 
[INFO] Apache HBase ...................................... SUCCESS [1:45.480s]
[INFO] Apache HBase - Checkstyle ......................... SUCCESS [7.619s]
[INFO] Apache HBase - Resource Bundle .................... SUCCESS [0.208s]
[INFO] Apache HBase - Annotations ........................ SUCCESS [0.891s]
[INFO] Apache HBase - Protocol ........................... SUCCESS [16.047s]
[INFO] Apache HBase - Common ............................. SUCCESS [1:42.411s]
[INFO] Apache HBase - Procedure .......................... SUCCESS [1.102s]
[INFO] Apache HBase - Client ............................. SUCCESS [13.929s]
[INFO] Apache HBase - Hadoop Compatibility ............... SUCCESS [2.566s]
[INFO] Apache HBase - Hadoop Two Compatibility ........... SUCCESS [3.475s]
[INFO] Apache HBase - Prefix Tree ........................ SUCCESS [1.024s]
[INFO] Apache HBase - Server ............................. SUCCESS [1:36.452s]
[INFO] Apache HBase - Testing Util ....................... SUCCESS [2.923s]
[INFO] Apache HBase - Thrift ............................. SUCCESS [9.299s]
[INFO] Apache HBase - Rest ............................... SUCCESS [2.481s]
[INFO] Apache HBase - Shell .............................. SUCCESS [7.314s]
[INFO] Apache HBase - Integration Tests .................. FAILURE [3:19:36.864s]
[INFO] Apache HBase - Examples ........................... SKIPPED
[INFO] Apache HBase - External Block Cache ............... SKIPPED
[INFO] Apache HBase - Assembly ........................... SKIPPED
[INFO] Apache HBase - Shaded ............................. SKIPPED
[INFO] Apache HBase - Shaded - Client .................... SKIPPED
[INFO] Apache HBase - Shaded - Server .................... SKIPPED
[INFO] ------------------------------------------------------------------------
[INFO] BUILD FAILURE
[INFO] ------------------------------------------------------------------------
[INFO] Total time: 3:26:21.821s
[INFO] Finished at: Tue Feb 21 19:22:30 UTC 2017
[INFO] Final Memory: 138M/1393M
[INFO] ------------------------------------------------------------------------
[ERROR] Failed to execute goal org.apache.maven.plugins:maven-failsafe-plugin:2.18.1:verify
(verify) on project hbase-it: There was a timeout or other error in the fork -> [Help 1]
[ERROR] 
[ERROR] To see the full stack trace of the errors, re-run Maven with the -e switch.
[ERROR] Re-run Maven using the -X switch to enable full debug logging.
[ERROR] 
[ERROR] For more information about the errors and possible solutions, please read the following
articles:
[ERROR] [Help 1] http://cwiki.apache.org/confluence/display/MAVEN/MojoFailureException
[ERROR] 
[ERROR] After correcting the problems, you can resume the build with the command
[ERROR]   mvn <goals> -rf :hbase-it
Build step 'Invoke top-level Maven targets' marked build as failure
Performing Post build task...
Match found for :.* : True
Logical operation result is TRUE
Running script  : # Post-build task script. TODO: Check this in and have all builds reference
check-in.
pwd && ls
# NOTE!!!! The below code has been copied and pasted from ./dev-tools/run-test.sh
# Do not change here without syncing there and vice-versa.
ZOMBIE_TESTS_COUNT=`jps -v | grep surefirebooter | grep -e '-Dhbase.test' | wc -l`
if [[ $ZOMBIE_TESTS_COUNT != 0 ]] ; then
 echo "Suspicious java process found - waiting 30s to see if there are just slow to stop"
 sleep 30
 ZOMBIE_TESTS_COUNT=`jps -v | grep surefirebooter | grep -e '-Dhbase.test' | wc -l`
 if [[ $ZOMBIE_TESTS_COUNT != 0 ]] ; then
   echo " {color:red}There appear to be $ZOMBIE_TESTS_COUNT zombie tests{color}, they should
have been killed by surefire but survived"
   jps -v | grep surefirebooter | grep -e '-Dhbase.test'
   jps -v | grep surefirebooter | grep -e '-Dhbase.test' | cut -d ' ' -f 1 | xargs -n 1 jstack
   # Exit with error
   exit 1
 else
   echo "We're ok: there is no zombie test, but some tests took some time to stop"
 fi
else
  echo "We're ok: there is no zombie test"
fi
[6a208e71] $ /bin/bash -xe /tmp/hudson1649979655348097443.sh
+ pwd
<https://builds.apache.org/job/HBase-1.2-IT/it.test=IntegrationTestBigLinkedList,jdk=JDK%201.8%20(latest),label=Hadoop/ws/>
+ ls
bin
CHANGES.txt
conf
dev-support
hbase-annotations
hbase-assembly
hbase-checkstyle
hbase-client
hbase-common
hbase-examples
hbase-external-blockcache
hbase-hadoop2-compat
hbase-hadoop-compat
hbase-it
hbase-native-client
hbase-prefix-tree
hbase-procedure
hbase-protocol
hbase-resource-bundle
hbase-rest
hbase-server
hbase-shaded
hbase-shell
hbase-testing-util
hbase-thrift
LICENSE.txt
NOTICE.txt
pom.xml
README.txt
src
target
++ jps -v
++ grep surefirebooter
++ grep -e -Dhbase.test
++ wc -l
+ ZOMBIE_TESTS_COUNT=0
+ [[ 0 != 0 ]]
+ echo 'We'\''re ok: there is no zombie test'
We're ok: there is no zombie test
POST BUILD TASK : SUCCESS
END OF POST BUILD TASK : 0
Archiving artifacts
No prior successful build to compare, so performing full copy of artifacts

Mime
View raw message