hbase-builds mailing list archives

Site index · List index
Message view « Date » · « Thread »
Top « Date » · « Thread »
From Apache Jenkins Server <jenk...@builds.apache.org>
Subject Build failed in Jenkins: HBase-1.4 » JDK_1_7,Hadoop&&!H13 #644
Date Fri, 24 Feb 2017 00:02:42 GMT
See <https://builds.apache.org/job/HBase-1.4/jdk=JDK_1_7,label=Hadoop&&!H13/644/display/redirect?page=changes>

Changes:

[apurtell] Amend HBASE-17069 RegionServer writes invalid META entries in some

[apurtell] HBASE-17682 Region stuck in merging_new state indefinitely

------------------------------------------
Started by upstream project "HBase-1.4" build number 644
originally caused by:
 Started by an SCM change
[EnvInject] - Loading node environment variables.
Building remotely on H7 (Hadoop) in workspace <https://builds.apache.org/job/HBase-1.4/jdk=JDK_1_7,label=Hadoop&&!H13/ws/>
Cloning the remote Git repository
Cloning repository https://git-wip-us.apache.org/repos/asf/hbase.git
 > git init <https://builds.apache.org/job/HBase-1.4/jdk=JDK_1_7,label=Hadoop&&!H13/ws/>
# timeout=10
Fetching upstream changes from https://git-wip-us.apache.org/repos/asf/hbase.git
 > git --version # timeout=10
 > git fetch --tags --progress https://git-wip-us.apache.org/repos/asf/hbase.git +refs/heads/*:refs/remotes/origin/*
 > git config remote.origin.url https://git-wip-us.apache.org/repos/asf/hbase.git # timeout=10
 > git config --add remote.origin.fetch +refs/heads/*:refs/remotes/origin/* # timeout=10
 > git config remote.origin.url https://git-wip-us.apache.org/repos/asf/hbase.git # timeout=10
Cleaning workspace
 > git rev-parse --verify HEAD # timeout=10
No valid HEAD. Skipping the resetting
 > git clean -fdx # timeout=10
Fetching upstream changes from https://git-wip-us.apache.org/repos/asf/hbase.git
 > git fetch --tags --progress https://git-wip-us.apache.org/repos/asf/hbase.git +refs/heads/*:refs/remotes/origin/*
Checking out Revision b0780bdc63aa8c5858c85ee4b6f999fd8a624a29 (refs/remotes/origin/branch-1)
 > git config core.sparsecheckout # timeout=10
 > git checkout -f b0780bdc63aa8c5858c85ee4b6f999fd8a624a29
 > git rev-list 3e2a6784c7416b712f9ad9c24c26f85a804a4488 # timeout=10
Setting JDK_1_7_LATEST__HOME=/home/jenkins/tools/java/latest1.7
Setting JDK_1_8_LATEST__HOME=/home/jenkins/tools/java/latest1.8
[19ccb43d] $ /bin/bash -xe /tmp/hudson5588309230753131389.sh
+ ulimit -a
core file size          (blocks, -c) 0
data seg size           (kbytes, -d) unlimited
scheduling priority             (-e) 0
file size               (blocks, -f) unlimited
pending signals                 (-i) 386178
max locked memory       (kbytes, -l) 64
max memory size         (kbytes, -m) unlimited
open files                      (-n) 60000
pipe size            (512 bytes, -p) 8
POSIX message queues     (bytes, -q) 819200
real-time priority              (-r) 0
stack size              (kbytes, -s) 8192
cpu time               (seconds, -t) unlimited
max user processes              (-u) 10240
virtual memory          (kbytes, -v) unlimited
file locks                      (-x) unlimited
+ echo 'Listing of other java processes on this box'
Listing of other java processes on this box
+ jps -v
6225 jar -Xmx2g -Xms512m -XX:MaxPermSize=256m
1464 Jps -Dapplication.home=/usr/lib/jvm/java-7-openjdk-amd64 -Xms8m
16164 DAGAppMaster -Xmx819m -Djava.io.tmpdir=/home/jenkins/jenkins-slave/workspace/PreCommit-TEZ-Build/tez-tests/target/org.apache.tez.test.TestRecovery/org.apache.tez.test.TestRecovery-localDir-nm-0_0/usercache/jenkins/appcache/application_1487737124966_0016/container_1487737124966_0016_02_000001/tmp
-Djava.net.preferIPv4Stack=true -Dhadoop.metrics.log.level=WARN -XX:+PrintGCDetails -verbose:gc
-XX:+PrintGCTimeStamps -XX:+UseNUMA -XX:+UseParallelGC -Dlog4j.configuratorClass=org.apache.tez.common.TezLog4jConfigurator
-Dlog4j.configuration=tez-container-log4j.properties -Dyarn.app.container.log.dir=/home/jenkins/jenkins-slave/workspace/PreCommit-TEZ-Build/tez-tests/target/org.apache.tez.test.TestRecovery/org.apache.tez.test.TestRecovery-logDir-nm-0_0/application_1487737124966_0016/container_1487737124966_0016_02_000001
-Dtez.root.logger=INFO,CLA -Dsun.nio.ch.bugLevel=
1256 Launcher -Dclassworlds.conf=/home/jenkins/tools/maven/latest/bin/m2.conf -Dmaven.home=/home/jenkins/tools/maven/latest
-Dmaven.multiModuleProjectDirectory=/home/jenkins/jenkins-slave/workspace/Ambari-branch-2.5
-Xmx2048m -XX:MaxPermSize=512m -Djava.awt.headless=true
+ rm -rf /tmp/hbase-jenkins/hbase
+ echo ''
+ jdk_tool=JDK_1_7_LATEST__HOME
+ echo JAVA_HOME=/home/jenkins/tools/java/latest1.7
+ /home/jenkins/tools/java/latest1.7/bin/java -version
java version "1.7.0_80"
Java(TM) SE Runtime Environment (build 1.7.0_80-b15)
Java HotSpot(TM) 64-Bit Server VM (build 24.80-b11, mixed mode)
[EnvInject] - Injecting environment variables from a build step.
Setting JDK_1_7_LATEST__HOME=/home/jenkins/tools/java/latest1.7
Setting JDK_1_8_LATEST__HOME=/home/jenkins/tools/java/latest1.8
[EnvInject] - Injecting as environment variables the properties file path 'extra_env_var'
[EnvInject] - Variables injected successfully.
Setting JDK_1_7_LATEST__HOME=/home/jenkins/tools/java/latest1.7
Setting JDK_1_8_LATEST__HOME=/home/jenkins/tools/java/latest1.8
[19ccb43d] $ /home/jenkins/tools/maven/apache-maven-3.0.5/bin/mvn -Djdk=JDK_1_7 -Dlabel=Hadoop&&!H13
-Dmaven.repo.local=<https://builds.apache.org/job/HBase-1.4/jdk=JDK_1_7,label=Hadoop&&!H13/ws/.repository>
-PrunAllTests -DreuseForks=false install -Dmaven.test.redirectTestOutputToFile=true -Dsurefire.rerunFailingTestsCount=2
-Dit.test=noItTest
[INFO] Scanning for projects...
Downloading: https://repository.apache.org/content/repositories/releases/org/apache/apache/18/apache-18.pom
4/16 KB   7/16 KB   8/16 KB   12/16 KB   14/16 KB   16/16 KB              Downloaded: https://repository.apache.org/content/repositories/releases/org/apache/apache/18/apache-18.pom
(16 KB at 12.0 KB/sec)
Downloading: http://repository.apache.org/snapshots/org/apache/felix/maven-bundle-plugin/2.5.3/maven-bundle-plugin-2.5.3.pom
           Downloading: http://repo.maven.apache.org/maven2/org/apache/felix/maven-bundle-plugin/2.5.3/maven-bundle-plugin-2.5.3.pom
           [ERROR] The build could not read 1 project -> [Help 1]
[ERROR]   
[ERROR]   The project org.apache.hbase:hbase:1.4.0-SNAPSHOT (<https://builds.apache.org/job/HBase-1.4/jdk=JDK_1_7,label=Hadoop&&!H13/ws/pom.xml)>
has 1 error
[ERROR]     Unresolveable build extension: Plugin org.apache.felix:maven-bundle-plugin:2.5.3
or one of its dependencies could not be resolved: Failed to collect dependencies for org.apache.felix:maven-bundle-plugin:jar:2.5.3
(): Failed to read artifact descriptor for org.apache.felix:maven-bundle-plugin:jar:2.5.3:
Could not transfer artifact org.apache.felix:maven-bundle-plugin:pom:2.5.3 from/to central
(http://repo.maven.apache.org/maven2): repo.maven.apache.org: Name or service not known: Unknown
host repo.maven.apache.org: Name or service not known -> [Help 2]
[ERROR] 
[ERROR] To see the full stack trace of the errors, re-run Maven with the -e switch.
[ERROR] Re-run Maven using the -X switch to enable full debug logging.
[ERROR] 
[ERROR] For more information about the errors and possible solutions, please read the following
articles:
[ERROR] [Help 1] http://cwiki.apache.org/confluence/display/MAVEN/ProjectBuildingException
[ERROR] [Help 2] http://cwiki.apache.org/confluence/display/MAVEN/PluginResolutionException
Build step 'Invoke top-level Maven targets' marked build as failure
Performing Post build task...
Match found for :.* : True
Logical operation result is TRUE
Running script  : # Post-build task script. TODO: Check this in and have all builds reference
check-in.
pwd && ls
# NOTE!!!! The below code has been copied and pasted from ./dev-tools/run-test.sh
# Do not change here without syncing there and vice-versa.
ZOMBIE_TESTS_COUNT=`jps -v | grep surefirebooter | grep -e '-Dhbase.test' | wc -l`
if [[ $ZOMBIE_TESTS_COUNT != 0 ]] ; then
 echo "Suspicious java process found - waiting 30s to see if there are just slow to stop"
 sleep 30
 ZOMBIE_TESTS_COUNT=`jps -v | grep surefirebooter | grep -e '-Dhbase.test' | wc -l`
 if [[ $ZOMBIE_TESTS_COUNT != 0 ]] ; then
   echo " {color:red}There appear to be $ZOMBIE_TESTS_COUNT zombie tests{color}, they should
have been killed by surefire but survived"
   jps -v | grep surefirebooter | grep -e '-Dhbase.test'
   jps -v | grep surefirebooter | grep -e '-Dhbase.test' | cut -d ' ' -f 1 | xargs -n 1 jstack
   # Exit with error
   exit 1
 else
   echo "We're ok: there is no zombie test, but some tests took some time to stop"
 fi
else
  echo "We're ok: there is no zombie test"
fi
Setting JDK_1_7_LATEST__HOME=/home/jenkins/tools/java/latest1.7
Setting JDK_1_8_LATEST__HOME=/home/jenkins/tools/java/latest1.8
[19ccb43d] $ /bin/bash -xe /tmp/hudson3828830688363007220.sh
+ pwd
<https://builds.apache.org/job/HBase-1.4/jdk=JDK_1_7,label=Hadoop&&!H13/ws/>
+ ls
bin
CHANGES.txt
conf
dev-support
extra_env_var
hbase-annotations
hbase-archetypes
hbase-assembly
hbase-checkstyle
hbase-client
hbase-common
hbase-examples
hbase-external-blockcache
hbase-hadoop2-compat
hbase-hadoop-compat
hbase-it
hbase-native-client
hbase-prefix-tree
hbase-procedure
hbase-protocol
hbase-resource-bundle
hbase-rest
hbase-server
hbase-shaded
hbase-shell
hbase-testing-util
hbase-thrift
LICENSE.txt
NOTICE.txt
pom.xml
README.txt
src
++ jps -v
++ grep surefirebooter
++ grep -e -Dhbase.test
++ wc -l
+ ZOMBIE_TESTS_COUNT=0
+ [[ 0 != 0 ]]
+ echo 'We'\''re ok: there is no zombie test'
We're ok: there is no zombie test
POST BUILD TASK : SUCCESS
END OF POST BUILD TASK : 0
Archiving artifacts
Setting JDK_1_7_LATEST__HOME=/home/jenkins/tools/java/latest1.7
Setting JDK_1_8_LATEST__HOME=/home/jenkins/tools/java/latest1.8
Compressed 821.38 KB of artifacts by 62.3% relative to #642
Recording test results
Setting JDK_1_7_LATEST__HOME=/home/jenkins/tools/java/latest1.7
Setting JDK_1_8_LATEST__HOME=/home/jenkins/tools/java/latest1.8
ERROR: Step ?Publish JUnit test result report? failed: No test report files were found. Configuration
error?
Setting JDK_1_7_LATEST__HOME=/home/jenkins/tools/java/latest1.7
Setting JDK_1_8_LATEST__HOME=/home/jenkins/tools/java/latest1.8

Mime
View raw message