hbase-builds mailing list archives

Site index · List index
Message view « Date » · « Thread »
Top « Date » · « Thread »
From Apache Jenkins Server <jenk...@builds.apache.org>
Subject Build failed in Jenkins: HBase-1.2-IT » IntegrationTestBigLinkedList,JDK 1.7 (latest),Hadoop #602
Date Wed, 22 Feb 2017 07:03:22 GMT
See <https://builds.apache.org/job/HBase-1.2-IT/it.test=IntegrationTestBigLinkedList,jdk=JDK%201.7%20(latest),label=Hadoop/602/display/redirect?page=changes>

Changes:

[busbey] HBASE-15328 sanity check the redirect used to send master info requests

[apurtell] HBASE-17675 ReplicationEndpoint should choose new sinks if a

------------------------------------------
[...truncated 4.17 MB...]
     bool UnlinkSymbolsALot                         = false           {product}          

     bool Use486InstrsOnly                          = false           {ARCH product}     

     bool UseAES                                    = true            {product}          

     bool UseAESIntrinsics                          = true            {product}          

     intx UseAVX                                    = 0               {ARCH product}     

     bool UseAdaptiveGCBoundary                     = false           {product}          

     bool UseAdaptiveGenerationSizePolicyAtMajorCollection  = true            {product}  
        
     bool UseAdaptiveGenerationSizePolicyAtMinorCollection  = true            {product}  
        
     bool UseAdaptiveNUMAChunkSizing                = true            {product}          

     bool UseAdaptiveSizeDecayMajorGCCost           = true            {product}          

     bool UseAdaptiveSizePolicy                     = true            {product}          

     bool UseAdaptiveSizePolicyFootprintGoal        = true            {product}          

     bool UseAdaptiveSizePolicyWithSystemGC         = false           {product}          

     bool UseAddressNop                             = true            {ARCH product}     

     bool UseAltSigs                                = false           {product}          

     bool UseAutoGCSelectPolicy                     = false           {product}          

     bool UseBiasedLocking                          = true            {product}          

     bool UseBimorphicInlining                      = true            {C2 product}       

     bool UseBoundThreads                           = true            {product}          

     bool UseCMSBestFit                             = true            {product}          

     bool UseCMSCollectionPassing                   = true            {product}          

     bool UseCMSCompactAtFullCollection             = true            {product}          

     bool UseCMSInitiatingOccupancyOnly             = false           {product}          

     bool UseCodeCacheFlushing                      = true            {product}          

     bool UseCompiler                               = true            {product}          

     bool UseCompilerSafepoints                     = true            {product}          

     bool UseCompressedOops                        := true            {lp64_product}     

     bool UseConcMarkSweepGC                        = false           {product}          

     bool UseCondCardMark                           = false           {C2 product}       

     bool UseCountLeadingZerosInstruction           = false           {ARCH product}     

     bool UseCounterDecay                           = true            {product}          

     bool UseDivMod                                 = true            {C2 product}       

     bool UseDynamicNumberOfGCThreads               = false           {product}          

     bool UseFPUForSpilling                         = false           {C2 product}       

     bool UseFastAccessorMethods                    = false           {product}          

     bool UseFastEmptyMethods                       = false           {product}          

     bool UseFastJNIAccessors                       = true            {product}          

     bool UseFastStosb                              = false           {ARCH product}     

     bool UseG1GC                                   = false           {product}          

     bool UseGCLogFileRotation                      = false           {product}          

     bool UseGCOverheadLimit                        = true            {product}          

     bool UseGCTaskAffinity                         = false           {product}          

     bool UseHeavyMonitors                          = false           {product}          

     bool UseHugeTLBFS                              = false           {product}          

     bool UseInlineCaches                           = true            {product}          

     bool UseInterpreter                            = true            {product}          

     bool UseJumpTables                             = true            {C2 product}       

     bool UseLWPSynchronization                     = true            {product}          

     bool UseLargePages                             = false           {pd product}       

     bool UseLargePagesIndividualAllocation         = false           {pd product}       

     bool UseLinuxPosixThreadCPUClocks              = true            {product}          

     bool UseLockedTracing                          = false           {product}          

     bool UseLoopCounter                            = true            {product}          

     bool UseLoopPredicate                          = true            {C2 product}       

     bool UseMaximumCompactionOnSystemGC            = true            {product}          

     bool UseMembar                                 = false           {pd product}       

     bool UseNUMA                                   = false           {product}          

     bool UseNUMAInterleaving                       = false           {product}          

     bool UseNewLongLShift                          = false           {ARCH product}     

     bool UseOSErrorReporting                       = false           {pd product}       

     bool UseOldInlining                            = true            {C2 product}       

     bool UseOnStackReplacement                     = true            {pd product}       

     bool UseOnlyInlinedBimorphic                   = true            {C2 product}       

     bool UseOprofile                               = false           {product}          

     bool UseOptoBiasInlining                       = true            {C2 product}       

     bool UsePPCLWSYNC                              = true            {product}          

     bool UsePSAdaptiveSurvivorSizePolicy           = true            {product}          

     bool UseParNewGC                               = false           {product}          

     bool UseParallelGC                            := true            {product}          

     bool UseParallelOldGC                          = true            {product}          

     bool UsePerfData                               = true            {product}          

     bool UsePopCountInstruction                    = true            {product}          

     bool UseRDPCForConstantTableBase               = false           {C2 product}       

     bool UseSHM                                    = false           {product}          

     intx UseSSE                                    = 4               {product}          

     bool UseSSE42Intrinsics                        = true            {product}          

     bool UseSerialGC                               = false           {product}          

     bool UseSharedSpaces                           = false           {product}          

     bool UseSignalChaining                         = true            {product}          

     bool UseSplitVerifier                          = true            {product}          

     bool UseStoreImmI16                            = false           {ARCH product}     

     bool UseStringCache                            = false           {product}          

     bool UseSuperWord                              = true            {C2 product}       

     bool UseTLAB                                   = true            {pd product}       

     bool UseThreadPriorities                       = true            {pd product}       

     bool UseTransparentHugePages                   = false           {product}          

     bool UseTypeProfile                            = true            {product}          

     bool UseUnalignedLoadStores                    = true            {ARCH product}     

     bool UseVMInterruptibleIO                      = false           {product}          

     bool UseVectoredExceptions                     = false           {pd product}       

     bool UseXMMForArrayCopy                        = true            {product}          

     bool UseXmmI2D                                 = false           {ARCH product}     

     bool UseXmmI2F                                 = false           {ARCH product}     

     bool UseXmmLoadAndClearUpper                   = true            {ARCH product}     

     bool UseXmmRegToRegMoveAll                     = true            {ARCH product}     

     bool VMThreadHintNoPreempt                     = false           {product}          

     intx VMThreadPriority                          = -1              {product}          

     intx VMThreadStackSize                         = 1024            {pd product}       

     intx ValueMapInitialSize                       = 11              {C1 product}       

     intx ValueMapMaxLoopSize                       = 8               {C1 product}       

     intx ValueSearchLimit                          = 1000            {C2 product}       

     bool VerifyMergedCPBytecodes                   = true            {product}          

     intx WorkAroundNPTLTimedWaitHang               = 1               {product}          

    uintx YoungGenerationSizeIncrement              = 20              {product}          

    uintx YoungGenerationSizeSupplement             = 80              {product}          

    uintx YoungGenerationSizeSupplementDecay        = 8               {product}          

    uintx YoungPLABSize                             = 4096            {product}          

     bool ZeroTLAB                                  = false           {product}          

     intx hashCode                                  = 0               {product}          

Running org.apache.hadoop.hbase.IntegrationTestMetaReplicas
SUREFIRE-859: [GC 194048K->14286K(740864K), 0.0387970 secs]
SUREFIRE-859: [GC 208334K->70859K(934912K), 0.1036030 secs]
SUREFIRE-859: [GC 458955K->124796K(934912K), 0.1054050 secs]
Tests run: 1, Failures: 0, Errors: 0, Skipped: 0, Time elapsed: 22.456 sec - in org.apache.hadoop.hbase.IntegrationTestMetaReplicas

Results :

Failed tests: 
  IntegrationTestRegionReplicaReplication.testIngest:112->runIngestTest:197 Load failed
with error code 1
  IntegrationTestBulkLoad.testBulkLoad:217->runCheck:719 expected:<true> but was:<false>
Tests in error: 
  IntegrationTestIngestWithACL>IntegrationTestBase.setUp:133->setUpCluster:64->IntegrationTestIngest.setUpCluster:84
» IO
  IntegrationTestMTTR.testKillRsHoldingMeta:278->run:319 » Execution java.io.IOE...
  IntegrationTestMTTR.testRestartRsHoldingTable:273->run:319 » Execution java.io...
  IntegrationTestBigLinkedListWithVisibility.testContinuousIngest:636 » Runtime ...
  IntegrationTestWithCellVisibilityLoadAndVerify>IntegrationTestLoadAndVerify.testLoadAndVerify:545->doVerify:293->access$400:79->doVerify:338
» FileAlreadyExists

Tests run: 32, Failures: 2, Errors: 5, Skipped: 2

[WARNING] File encoding has not been set, using platform encoding ISO-8859-1, i.e. build is
platform dependent! The file encoding for reports output files should be provided by the POM
property ${project.reporting.outputEncoding}.
[INFO] 
[INFO] --- maven-failsafe-plugin:2.18.1:verify (verify) @ hbase-it ---
[INFO] Failsafe report directory: <https://builds.apache.org/job/HBase-1.2-IT/it.test=IntegrationTestBigLinkedList,jdk=JDK%201.7%20(latest),label=Hadoop/ws/hbase-it/target/failsafe-reports>
[WARNING] File encoding has not been set, using platform encoding ISO-8859-1, i.e. build is
platform dependent! The file encoding for reports output files should be provided by the POM
property ${project.reporting.outputEncoding}.
[INFO] ------------------------------------------------------------------------
[INFO] Reactor Summary:
[INFO] 
[INFO] Apache HBase ...................................... SUCCESS [1:47.546s]
[INFO] Apache HBase - Checkstyle ......................... SUCCESS [7.785s]
[INFO] Apache HBase - Resource Bundle .................... SUCCESS [0.301s]
[INFO] Apache HBase - Annotations ........................ SUCCESS [1.760s]
[INFO] Apache HBase - Protocol ........................... SUCCESS [19.997s]
[INFO] Apache HBase - Common ............................. SUCCESS [1:47.958s]
[INFO] Apache HBase - Procedure .......................... SUCCESS [1.771s]
[INFO] Apache HBase - Client ............................. SUCCESS [13.040s]
[INFO] Apache HBase - Hadoop Compatibility ............... SUCCESS [2.570s]
[INFO] Apache HBase - Hadoop Two Compatibility ........... SUCCESS [3.958s]
[INFO] Apache HBase - Prefix Tree ........................ SUCCESS [1.546s]
[INFO] Apache HBase - Server ............................. SUCCESS [1:44.148s]
[INFO] Apache HBase - Testing Util ....................... SUCCESS [3.439s]
[INFO] Apache HBase - Thrift ............................. SUCCESS [10.821s]
[INFO] Apache HBase - Rest ............................... SUCCESS [3.803s]
[INFO] Apache HBase - Shell .............................. SUCCESS [6.175s]
[INFO] Apache HBase - Integration Tests .................. FAILURE [3:25:23.035s]
[INFO] Apache HBase - Examples ........................... SKIPPED
[INFO] Apache HBase - External Block Cache ............... SKIPPED
[INFO] Apache HBase - Assembly ........................... SKIPPED
[INFO] Apache HBase - Shaded ............................. SKIPPED
[INFO] Apache HBase - Shaded - Client .................... SKIPPED
[INFO] Apache HBase - Shaded - Server .................... SKIPPED
[INFO] ------------------------------------------------------------------------
[INFO] BUILD FAILURE
[INFO] ------------------------------------------------------------------------
[INFO] Total time: 3:32:33.263s
[INFO] Finished at: Wed Feb 22 07:01:53 UTC 2017
[INFO] Final Memory: 80M/531M
[INFO] ------------------------------------------------------------------------
[ERROR] Failed to execute goal org.apache.maven.plugins:maven-failsafe-plugin:2.18.1:verify
(verify) on project hbase-it: There was a timeout or other error in the fork -> [Help 1]
[ERROR] 
[ERROR] To see the full stack trace of the errors, re-run Maven with the -e switch.
[ERROR] Re-run Maven using the -X switch to enable full debug logging.
[ERROR] 
[ERROR] For more information about the errors and possible solutions, please read the following
articles:
[ERROR] [Help 1] http://cwiki.apache.org/confluence/display/MAVEN/MojoFailureException
[ERROR] 
[ERROR] After correcting the problems, you can resume the build with the command
[ERROR]   mvn <goals> -rf :hbase-it
Build step 'Invoke top-level Maven targets' marked build as failure
Performing Post build task...
Match found for :.* : True
Logical operation result is TRUE
Running script  : # Post-build task script. TODO: Check this in and have all builds reference
check-in.
pwd && ls
# NOTE!!!! The below code has been copied and pasted from ./dev-tools/run-test.sh
# Do not change here without syncing there and vice-versa.
ZOMBIE_TESTS_COUNT=`jps -v | grep surefirebooter | grep -e '-Dhbase.test' | wc -l`
if [[ $ZOMBIE_TESTS_COUNT != 0 ]] ; then
 echo "Suspicious java process found - waiting 30s to see if there are just slow to stop"
 sleep 30
 ZOMBIE_TESTS_COUNT=`jps -v | grep surefirebooter | grep -e '-Dhbase.test' | wc -l`
 if [[ $ZOMBIE_TESTS_COUNT != 0 ]] ; then
   echo " {color:red}There appear to be $ZOMBIE_TESTS_COUNT zombie tests{color}, they should
have been killed by surefire but survived"
   jps -v | grep surefirebooter | grep -e '-Dhbase.test'
   jps -v | grep surefirebooter | grep -e '-Dhbase.test' | cut -d ' ' -f 1 | xargs -n 1 jstack
   # Exit with error
   exit 1
 else
   echo "We're ok: there is no zombie test, but some tests took some time to stop"
 fi
else
  echo "We're ok: there is no zombie test"
fi
[495466b0] $ /bin/bash -xe /tmp/hudson2494578973037230017.sh
+ pwd
<https://builds.apache.org/job/HBase-1.2-IT/it.test=IntegrationTestBigLinkedList,jdk=JDK%201.7%20(latest),label=Hadoop/ws/>
+ ls
bin
CHANGES.txt
conf
dev-support
hbase-annotations
hbase-assembly
hbase-checkstyle
hbase-client
hbase-common
hbase-examples
hbase-external-blockcache
hbase-hadoop2-compat
hbase-hadoop-compat
hbase-it
hbase-native-client
hbase-prefix-tree
hbase-procedure
hbase-protocol
hbase-resource-bundle
hbase-rest
hbase-server
hbase-shaded
hbase-shell
hbase-testing-util
hbase-thrift
LICENSE.txt
NOTICE.txt
pom.xml
README.txt
src
target
++ jps -v
++ grep surefirebooter
++ wc -l
++ grep -e -Dhbase.test
+ ZOMBIE_TESTS_COUNT=0
+ [[ 0 != 0 ]]
+ echo 'We'\''re ok: there is no zombie test'
We're ok: there is no zombie test
POST BUILD TASK : SUCCESS
END OF POST BUILD TASK : 0
Archiving artifacts
No prior successful build to compare, so performing full copy of artifacts

Mime
View raw message