hbase-builds mailing list archives

Site index · List index
Message view « Date » · « Thread »
Top « Date » · « Thread »
From Apache Jenkins Server <jenk...@builds.apache.org>
Subject Build failed in Jenkins: HBase-1.2-IT » IntegrationTestAcidGuarantees,JDK 1.8 (latest),Hadoop #599
Date Tue, 21 Feb 2017 19:18:11 GMT
See <https://builds.apache.org/job/HBase-1.2-IT/it.test=IntegrationTestAcidGuarantees,jdk=JDK%201.8%20(latest),label=Hadoop/599/display/redirect>

------------------------------------------
[...truncated 4.69 MB...]
SUREFIRE-859: [GC (Allocation Failure)  1854508K->753140K(2270720K), 0.0406294 secs]
SUREFIRE-859: [GC (Allocation Failure)  1824244K->765364K(2253824K), 0.0397345 secs]
SUREFIRE-859: [GC (Allocation Failure)  1836468K->764074K(2245120K), 0.0520791 secs]
SUREFIRE-859: [GC (Allocation Failure)  1777834K->742220K(2173440K), 0.0746947 secs]
SUREFIRE-859: [GC (Allocation Failure)  1755980K->808524K(2206720K), 0.1712412 secs]
SUREFIRE-859: [GC (Allocation Failure)  1770060K->831860K(2171392K), 0.0520419 secs]
SUREFIRE-859: [GC (Allocation Failure)  1793396K->849764K(2209280K), 0.0533752 secs]
SUREFIRE-859: [GC (Allocation Failure)  1775460K->874386K(2213376K), 0.0508670 secs]
SUREFIRE-859: [GC (Allocation Failure)  1800082K->866828K(2193408K), 0.0430082 secs]
SUREFIRE-859: [GC (GCLocker Initiated GC)  1796188K->906037K(2203648K), 0.0470562 secs]
SUREFIRE-859: [GC (GCLocker Initiated GC)  1835352K->909563K(2215936K), 0.0482520 secs]
SUREFIRE-859: [GC (GCLocker Initiated GC)  1873747K->929570K(2220544K), 0.0550189 secs]
SUREFIRE-859: [GC (GCLocker Initiated GC)  1893701K->935863K(2243072K), 0.0501704 secs]
SUREFIRE-859: [GC (GCLocker Initiated GC)  1928167K->969303K(2244096K), 0.0645019 secs]
SUREFIRE-859: [GC (GCLocker Initiated GC)  1961692K->993220K(2247680K), 0.3101247 secs]
SUREFIRE-859: [GC (GCLocker Initiated GC)  1992775K->999653K(2246656K), 0.0365212 secs]
SUREFIRE-859: [GC (GCLocker Initiated GC)  1999089K->1029630K(2242560K), 0.0507690 secs]
SUREFIRE-859: [Full GC (Ergonomics)  1029630K->256315K(2359808K), 0.5868052 secs]
SUREFIRE-859: [GC (GCLocker Initiated GC)  1264354K->277265K(2364416K), 0.0237883 secs]
SUREFIRE-859: [GC (GCLocker Initiated GC)  1285048K->286520K(2369536K), 0.0212435 secs]
SUREFIRE-859: [GC (GCLocker Initiated GC)  1313099K->311416K(2374144K), 0.0496832 secs]
SUREFIRE-859: [GC (GCLocker Initiated GC)  1338184K->319532K(2382336K), 0.0340466 secs]
SUREFIRE-859: [GC (GCLocker Initiated GC)  1367086K->327028K(2383872K), 0.0274751 secs]
SUREFIRE-859: [GC (GCLocker Initiated GC)  1374771K->334685K(2392064K), 0.0403735 secs]
SUREFIRE-859: [GC (Allocation Failure)  1403335K->358778K(2393600K), 0.0289332 secs]
SUREFIRE-859: [GC (Allocation Failure)  1427322K->373828K(2402816K), 0.0298829 secs]
SUREFIRE-859: [GC (GCLocker Initiated GC)  1468516K->405138K(2402816K), 0.0230958 secs]
SUREFIRE-859: [GC (Allocation Failure)  1499861K->394874K(2420224K), 0.0759750 secs]
SUREFIRE-859: [GC (Allocation Failure)  1521256K->410175K(2418176K), 0.0486333 secs]
SUREFIRE-859: [GC (Allocation Failure)  1536575K->416058K(2439680K), 0.0429116 secs]
SUREFIRE-859: [GC (Allocation Failure)  1570106K->453889K(2437120K), 0.0227726 secs]
SUREFIRE-859: [GC (Allocation Failure)  1607937K->479577K(2446848K), 0.0181907 secs]
SUREFIRE-859: [GC (Allocation Failure)  1652057K->507762K(2444288K), 0.0278460 secs]
SUREFIRE-859: [GC (Allocation Failure)  1680242K->490667K(2454016K), 0.0209699 secs]
SUREFIRE-859: [GC (Allocation Failure)  1683627K->537567K(2457088K), 0.0294364 secs]
SUREFIRE-859: [GC (Allocation Failure)  1730527K->571905K(2420224K), 0.0294926 secs]
SUREFIRE-859: [GC (Allocation Failure)  1717712K->590517K(2416128K), 0.0383225 secs]
SUREFIRE-859: [GC (Allocation Failure)  1736373K->614609K(2388480K), 0.0473464 secs]
SUREFIRE-859: [GC (Allocation Failure)  1694929K->586330K(2346496K), 0.0657884 secs]
SUREFIRE-859: [GC (Allocation Failure)  1666650K->580972K(2404352K), 0.0443768 secs]
SUREFIRE-859: [GC (GCLocker Initiated GC)  1652628K->612808K(2290176K), 0.0429383 secs]
SUREFIRE-859: [GC (GCLocker Initiated GC)  1684638K->651690K(2403840K), 0.0521111 secs]
SUREFIRE-859: [GC (GCLocker Initiated GC)  1732149K->684738K(2395136K), 0.0503083 secs]
SUREFIRE-859: [GC (GCLocker Initiated GC)  1765070K->699717K(2414080K), 0.0380775 secs]
SUREFIRE-859: [GC (GCLocker Initiated GC)  1803663K->739349K(2414080K), 0.0490531 secs]
SUREFIRE-859: [GC (GCLocker Initiated GC)  1843243K->742745K(2420736K), 0.0263800 secs]
SUREFIRE-859: [GC (GCLocker Initiated GC)  1862715K->753733K(2418176K), 0.0264830 secs]
SUREFIRE-859: [GC (GCLocker Initiated GC)  1873675K->752985K(2435072K), 0.0511621 secs]
SUREFIRE-859: [GC (GCLocker Initiated GC)  1889178K->771291K(2435072K), 0.0347903 secs]
SUREFIRE-859: [GC (GCLocker Initiated GC)  1907557K->783088K(2430464K), 0.0442071 secs]
SUREFIRE-859: [GC (GCLocker Initiated GC)  1921886K->789933K(2433024K), 0.1097946 secs]
SUREFIRE-859: [GC (GCLocker Initiated GC)  1928694K->790743K(2440192K), 0.0483095 secs]
SUREFIRE-859: [GC (Allocation Failure)  1940732K->842885K(2439680K), 0.0503779 secs]
SUREFIRE-859: [GC (GCLocker Initiated GC)  842959K->851129K(2443264K), 0.0402855 secs]
SUREFIRE-859: [GC (GCLocker Initiated GC)  2007753K->861482K(2442240K), 0.0296380 secs]
SUREFIRE-859: [GC (GCLocker Initiated GC)  2018493K->871584K(2445824K), 0.0515788 secs]
SUREFIRE-859: [GC (GCLocker Initiated GC)  2039087K->882273K(2445824K), 0.0434649 secs]
SUREFIRE-859: [GC (Allocation Failure)  2049636K->897135K(2449920K), 0.0445836 secs]
SUREFIRE-859: [GC (Allocation Failure)  2079855K->904303K(2451456K), 0.0446226 secs]
SUREFIRE-859: [GC (GCLocker Initiated GC)  2087084K->914237K(2461184K), 0.0247412 secs]
SUREFIRE-859: [GC (GCLocker Initiated GC)  2116640K->951695K(2462720K), 0.0333734 secs]
SUREFIRE-859: [GC (GCLocker Initiated GC)  2154152K->975634K(2465280K), 0.0385652 secs]
SUREFIRE-859: [GC (GCLocker Initiated GC)  2193300K->1014271K(2469376K), 0.0398006 secs]
SUREFIRE-859: [GC (GCLocker Initiated GC)  2231928K->1021601K(2476544K), 0.1139281 secs]
SUREFIRE-859: [GC (GCLocker Initiated GC)  2256563K->1023063K(2480640K), 0.0501736 secs]
SUREFIRE-859: [GC (GCLocker Initiated GC)  2258153K->1025606K(2482688K), 0.0332065 secs]
SUREFIRE-859: [GC (GCLocker Initiated GC)  2271968K->1037329K(2487296K), 0.0290509 secs]
SUREFIRE-859: [GC (GCLocker Initiated GC)  2283609K->1050422K(2486784K), 0.1651365 secs]
SUREFIRE-859: [GC (GCLocker Initiated GC)  2307915K->1057038K(2490880K), 0.0313116 secs]
SUREFIRE-859: [GC (Allocation Failure)  2314660K->1090911K(2499584K), 0.0341072 secs]
SUREFIRE-859: [GC (GCLocker Initiated GC)  1101662K->1092978K(2502656K), 0.0273992 secs]
SUREFIRE-859: [GC (Allocation Failure)  2362802K->1136723K(2492928K), 0.0554976 secs]
SUREFIRE-859: [GC (GCLocker Initiated GC)  1145060K->1146298K(2498560K), 0.0201140 secs]
SUREFIRE-859: [Full GC (Ergonomics)  1146298K->381373K(2637312K), 0.5250849 secs]
SUREFIRE-859: [GC (GCLocker Initiated GC)  1642996K->392647K(2627584K), 0.0276689 secs]
SUREFIRE-859: [GC (GCLocker Initiated GC)  1655766K->432897K(2633216K), 0.0378011 secs]
SUREFIRE-859: [GC (Allocation Failure)  1696224K->462287K(2640896K), 0.0388142 secs]
SUREFIRE-859: [GC (GCLocker Initiated GC)  1732049K->496782K(2613760K), 0.0597893 secs]
SUREFIRE-859: [GC (GCLocker Initiated GC)  1766657K->512942K(2643968K), 0.0419181 secs]
SUREFIRE-859: [GC (GCLocker Initiated GC)  1783745K->519101K(2580992K), 0.0325652 secs]
SUREFIRE-859: [GC (Allocation Failure)  1789983K->548848K(2638336K), 0.0259037 secs]
SUREFIRE-859: [GC (GCLocker Initiated GC)  1819181K->546069K(2638848K), 0.0440037 secs]
SUREFIRE-859: [GC (Allocation Failure)  1816935K->553779K(2642432K), 0.0331657 secs]
SUREFIRE-859: [GC (Allocation Failure)  1832243K->564150K(2642432K), 0.0462241 secs]
SUREFIRE-859: [GC (Allocation Failure)  1842572K->579631K(2645504K), 0.0302014 secs]
SUREFIRE-859: [GC (GCLocker Initiated GC)  1867344K->618377K(2646016K), 0.0321343 secs]
SUREFIRE-859: [GC (GCLocker Initiated GC)  1906348K->650828K(2641920K), 0.0259244 secs]
SUREFIRE-859: [GC (GCLocker Initiated GC)  1926017K->653727K(2643968K), 0.0154841 secs]
SUREFIRE-859: [GC (GCLocker Initiated GC)  1928647K->662378K(2638336K), 0.0231757 secs]
SUREFIRE-859: [GC (GCLocker Initiated GC)  1939055K->669950K(2641408K), 0.0386966 secs]
SUREFIRE-859: [GC (GCLocker Initiated GC)  1946454K->676987K(2642432K), 0.0293377 secs]
SUREFIRE-859: [GC (GCLocker Initiated GC)  1962770K->718463K(2645504K), 0.0375998 secs]
SUREFIRE-859: [GC (GCLocker Initiated GC)  2004278K->748347K(2649600K), 0.0227853 secs]
SUREFIRE-859: [GC (GCLocker Initiated GC)  2031434K->756360K(2600448K), 0.0256479 secs]
SUREFIRE-859: [GC (GCLocker Initiated GC)  2039766K->763867K(2647040K), 0.0453575 secs]
SUREFIRE-859: [GC (GCLocker Initiated GC)  2049601K->774561K(2644480K), 0.0373750 secs]
SUREFIRE-859: [GC (Allocation Failure)  2060291K->781624K(2650624K), 0.0277853 secs]
SUREFIRE-859: [GC (GCLocker Initiated GC)  2075987K->803929K(2649088K), 0.0311001 secs]
SUREFIRE-859: [GC (GCLocker Initiated GC)  2098689K->826014K(2656256K), 0.0369239 secs]
SUREFIRE-859: [GC (Allocation Failure)  2128549K->829657K(2656768K), 0.0479851 secs]
SUREFIRE-859: [GC (Allocation Failure)  2132185K->855163K(2657280K), 0.0282915 secs]
SUREFIRE-859: [GC (Allocation Failure)  2159739K->870498K(2657792K), 0.0223777 secs]
SUREFIRE-859: [GC (Allocation Failure)  2175074K->885127K(2653696K), 0.0157629 secs]
SUREFIRE-859: [GC (Allocation Failure)  2191751K->893576K(2656768K), 0.0285629 secs]
SUREFIRE-859: [GC (Allocation Failure)  2200200K->938393K(2629632K), 0.0260069 secs]
SUREFIRE-859: [GC (Allocation Failure)  2217369K->976753K(2645504K), 0.0177987 secs]
SUREFIRE-859: [GC (Allocation Failure)  2255729K->975033K(2611712K), 0.0292724 secs]
SUREFIRE-859: [GC (Allocation Failure)  2219193K->987068K(2620928K), 0.0382679 secs]
SUREFIRE-859: [GC (Allocation Failure)  2231228K->992545K(2595328K), 0.0461679 secs]
SUREFIRE-859: [GC (Allocation Failure)  2195745K->1015881K(2608128K), 0.0329360 secs]
SUREFIRE-859: [GC (Allocation Failure)  2219045K->1050559K(2568192K), 0.0420258 secs]
SUREFIRE-859: [GC (Allocation Failure)  2213823K->1149027K(2588160K), 0.0524174 secs]
SUREFIRE-859: [GC (Allocation Failure)  2312291K->1227873K(2428416K), 0.0627928 secs]
Tests run: 1, Failures: 0, Errors: 0, Skipped: 0, Time elapsed: 730.508 sec - in org.apache.hadoop.hbase.IntegrationTestIngestWithTags

Results :

Failed tests: 
  IntegrationTestRegionReplicaReplication.testIngest:112->runIngestTest:197 Load failed
with error code 1
  IntegrationTestBulkLoad.testBulkLoad:217->runCheck:719 expected:<true> but was:<false>
Tests in error: 
  IntegrationTestIngestWithACL>IntegrationTestBase.setUp:133->setUpCluster:64->IntegrationTestIngest.setUpCluster:84
» IO
  IntegrationTestMTTR.testKillRsHoldingMeta:278->run:319 » Execution java.io.IOE...
  IntegrationTestMTTR.testRestartRsHoldingTable:273->run:319 » Execution java.io...
  IntegrationTestBigLinkedListWithVisibility.testContinuousIngest:636 » Runtime ...
  IntegrationTestWithCellVisibilityLoadAndVerify>IntegrationTestLoadAndVerify.testLoadAndVerify:545->doVerify:293->access$400:79->doVerify:338
» FileAlreadyExists

Tests run: 32, Failures: 2, Errors: 5, Skipped: 2

[WARNING] File encoding has not been set, using platform encoding UTF-8, i.e. build is platform
dependent! The file encoding for reports output files should be provided by the POM property
${project.reporting.outputEncoding}.
[INFO] 
[INFO] --- maven-failsafe-plugin:2.18.1:verify (verify) @ hbase-it ---
[INFO] Failsafe report directory: <https://builds.apache.org/job/HBase-1.2-IT/it.test=IntegrationTestAcidGuarantees,jdk=JDK%201.8%20(latest),label=Hadoop/ws/hbase-it/target/failsafe-reports>
[WARNING] File encoding has not been set, using platform encoding UTF-8, i.e. build is platform
dependent! The file encoding for reports output files should be provided by the POM property
${project.reporting.outputEncoding}.
[INFO] ------------------------------------------------------------------------
[INFO] Reactor Summary:
[INFO] 
[INFO] Apache HBase ...................................... SUCCESS [1:42.638s]
[INFO] Apache HBase - Checkstyle ......................... SUCCESS [7.311s]
[INFO] Apache HBase - Resource Bundle .................... SUCCESS [0.174s]
[INFO] Apache HBase - Annotations ........................ SUCCESS [0.977s]
[INFO] Apache HBase - Protocol ........................... SUCCESS [18.288s]
[INFO] Apache HBase - Common ............................. SUCCESS [1:46.267s]
[INFO] Apache HBase - Procedure .......................... SUCCESS [1.264s]
[INFO] Apache HBase - Client ............................. SUCCESS [11.043s]
[INFO] Apache HBase - Hadoop Compatibility ............... SUCCESS [2.574s]
[INFO] Apache HBase - Hadoop Two Compatibility ........... SUCCESS [3.344s]
[INFO] Apache HBase - Prefix Tree ........................ SUCCESS [1.000s]
[INFO] Apache HBase - Server ............................. SUCCESS [1:43.606s]
[INFO] Apache HBase - Testing Util ....................... SUCCESS [2.503s]
[INFO] Apache HBase - Thrift ............................. SUCCESS [10.285s]
[INFO] Apache HBase - Rest ............................... SUCCESS [2.701s]
[INFO] Apache HBase - Shell .............................. SUCCESS [4.849s]
[INFO] Apache HBase - Integration Tests .................. FAILURE [3:14:12.268s]
[INFO] Apache HBase - Examples ........................... SKIPPED
[INFO] Apache HBase - External Block Cache ............... SKIPPED
[INFO] Apache HBase - Assembly ........................... SKIPPED
[INFO] Apache HBase - Shaded ............................. SKIPPED
[INFO] Apache HBase - Shaded - Client .................... SKIPPED
[INFO] Apache HBase - Shaded - Server .................... SKIPPED
[INFO] ------------------------------------------------------------------------
[INFO] BUILD FAILURE
[INFO] ------------------------------------------------------------------------
[INFO] Total time: 3:21:02.387s
[INFO] Finished at: Tue Feb 21 19:17:11 UTC 2017
[INFO] Final Memory: 125M/1270M
[INFO] ------------------------------------------------------------------------
[ERROR] Failed to execute goal org.apache.maven.plugins:maven-failsafe-plugin:2.18.1:verify
(verify) on project hbase-it: There was a timeout or other error in the fork -> [Help 1]
[ERROR] 
[ERROR] To see the full stack trace of the errors, re-run Maven with the -e switch.
[ERROR] Re-run Maven using the -X switch to enable full debug logging.
[ERROR] 
[ERROR] For more information about the errors and possible solutions, please read the following
articles:
[ERROR] [Help 1] http://cwiki.apache.org/confluence/display/MAVEN/MojoFailureException
[ERROR] 
[ERROR] After correcting the problems, you can resume the build with the command
[ERROR]   mvn <goals> -rf :hbase-it
Build step 'Invoke top-level Maven targets' marked build as failure
Performing Post build task...
Match found for :.* : True
Logical operation result is TRUE
Running script  : # Post-build task script. TODO: Check this in and have all builds reference
check-in.
pwd && ls
# NOTE!!!! The below code has been copied and pasted from ./dev-tools/run-test.sh
# Do not change here without syncing there and vice-versa.
ZOMBIE_TESTS_COUNT=`jps -v | grep surefirebooter | grep -e '-Dhbase.test' | wc -l`
if [[ $ZOMBIE_TESTS_COUNT != 0 ]] ; then
 echo "Suspicious java process found - waiting 30s to see if there are just slow to stop"
 sleep 30
 ZOMBIE_TESTS_COUNT=`jps -v | grep surefirebooter | grep -e '-Dhbase.test' | wc -l`
 if [[ $ZOMBIE_TESTS_COUNT != 0 ]] ; then
   echo " {color:red}There appear to be $ZOMBIE_TESTS_COUNT zombie tests{color}, they should
have been killed by surefire but survived"
   jps -v | grep surefirebooter | grep -e '-Dhbase.test'
   jps -v | grep surefirebooter | grep -e '-Dhbase.test' | cut -d ' ' -f 1 | xargs -n 1 jstack
   # Exit with error
   exit 1
 else
   echo "We're ok: there is no zombie test, but some tests took some time to stop"
 fi
else
  echo "We're ok: there is no zombie test"
fi
[0407dd4a] $ /bin/bash -xe /tmp/hudson7164540478888553990.sh
+ pwd
<https://builds.apache.org/job/HBase-1.2-IT/it.test=IntegrationTestAcidGuarantees,jdk=JDK%201.8%20(latest),label=Hadoop/ws/>
+ ls
bin
CHANGES.txt
conf
dev-support
hbase-annotations
hbase-assembly
hbase-checkstyle
hbase-client
hbase-common
hbase-examples
hbase-external-blockcache
hbase-hadoop2-compat
hbase-hadoop-compat
hbase-it
hbase-native-client
hbase-prefix-tree
hbase-procedure
hbase-protocol
hbase-resource-bundle
hbase-rest
hbase-server
hbase-shaded
hbase-shell
hbase-testing-util
hbase-thrift
LICENSE.txt
NOTICE.txt
pom.xml
README.txt
src
target
++ grep surefirebooter
++ grep -e -Dhbase.test
++ jps -v
++ wc -l
+ ZOMBIE_TESTS_COUNT=0
+ [[ 0 != 0 ]]
+ echo 'We'\''re ok: there is no zombie test'
We're ok: there is no zombie test
POST BUILD TASK : SUCCESS
END OF POST BUILD TASK : 0
Archiving artifacts
No prior successful build to compare, so performing full copy of artifacts

Mime
View raw message