hbase-builds mailing list archives

Site index · List index
Message view « Date » · « Thread »
Top « Date » · « Thread »
From Apache Jenkins Server <jenk...@builds.apache.org>
Subject Build failed in Jenkins: HBase-1.2-IT » IntegrationTestBigLinkedList,JDK 1.8 (latest),Hadoop #604
Date Thu, 23 Feb 2017 11:20:26 GMT
See <https://builds.apache.org/job/HBase-1.2-IT/it.test=IntegrationTestBigLinkedList,jdk=JDK%201.8%20(latest),label=Hadoop/604/display/redirect?page=changes>

Changes:

[busbey] HBASE-17677 Just the new tests from 'ServerName parsing from directory

------------------------------------------
[...truncated 4.60 MB...]
SUREFIRE-859: [Full GC (Ergonomics)  1276951K->490405K(2763264K), 0.5401117 secs]
SUREFIRE-859: [GC (Allocation Failure)  1628069K->498905K(2763776K), 0.0183810 secs]
SUREFIRE-859: [GC (Allocation Failure)  1654489K->537139K(2769408K), 0.0216636 secs]
SUREFIRE-859: [GC (Allocation Failure)  1692723K->552628K(2779648K), 0.0238570 secs]
SUREFIRE-859: [GC (Allocation Failure)  1719988K->546219K(2783744K), 0.0295931 secs]
SUREFIRE-859: [GC (Allocation Failure)  1713579K->559795K(2771456K), 0.0238725 secs]
SUREFIRE-859: [GC (Allocation Failure)  1730227K->569682K(2778112K), 0.0228149 secs]
SUREFIRE-859: [GC (Allocation Failure)  1740114K->620178K(2792448K), 0.0212397 secs]
SUREFIRE-859: [GC (Allocation Failure)  1809042K->668370K(2726400K), 0.0194993 secs]
SUREFIRE-859: [GC (Allocation Failure)  1857234K->685707K(2791936K), 0.0186628 secs]
SUREFIRE-859: [GC (Allocation Failure)  1878155K->692676K(2790400K), 0.0170910 secs]
SUREFIRE-859: [GC (Allocation Failure)  1885124K->703731K(2798592K), 0.0140298 secs]
SUREFIRE-859: [GC (Allocation Failure)  1910003K->729075K(2798080K), 0.0126055 secs]
SUREFIRE-859: [GC (Allocation Failure)  1935347K->761020K(2793472K), 0.0233733 secs]
SUREFIRE-859: [GC (Allocation Failure)  1965244K->770364K(2783744K), 0.0196853 secs]
SUREFIRE-859: [GC (Allocation Failure)  1974540K->796637K(2756608K), 0.0328415 secs]
SUREFIRE-859: [GC (Allocation Failure)  1944511K->807741K(2764800K), 0.0268044 secs]
SUREFIRE-859: [GC (Allocation Failure)  1955645K->812639K(2718720K), 0.0317442 secs]
SUREFIRE-859: [GC (Allocation Failure)  1895981K->802991K(2741760K), 0.0336812 secs]
SUREFIRE-859: [GC (Allocation Failure)  1886383K->811158K(2717696K), 0.0291089 secs]
SUREFIRE-859: [GC (Allocation Failure)  1904278K->844223K(2734592K), 0.0263011 secs]
SUREFIRE-859: [GC (Allocation Failure)  1937343K->880327K(2745344K), 0.0218427 secs]
SUREFIRE-859: [GC (Allocation Failure)  2003655K->880851K(2755072K), 0.0235222 secs]
SUREFIRE-859: [GC (Allocation Failure)  2004179K->891575K(2767872K), 0.0334770 secs]
SUREFIRE-859: [GC (Allocation Failure)  2026679K->897570K(2642944K), 0.0153887 secs]
SUREFIRE-859: [GC (Allocation Failure)  2032633K->927353K(2772480K), 0.0159279 secs]
SUREFIRE-859: [GC (Allocation Failure)  2069113K->989801K(2765824K), 0.0214205 secs]
SUREFIRE-859: [GC (Allocation Failure)  2131561K->973012K(2770944K), 0.0315976 secs]
SUREFIRE-859: [GC (Allocation Failure)  2121428K->997727K(2767872K), 0.0239646 secs]
SUREFIRE-859: [GC (Allocation Failure)  2146141K->1028025K(2772992K), 0.0151564 secs]
SUREFIRE-859: [GC (Allocation Failure)  2191801K->1031300K(2774016K), 0.0275715 secs]
SUREFIRE-859: [GC (Allocation Failure)  2195076K->1048323K(2786816K), 0.0251602 secs]
SUREFIRE-859: [GC (Allocation Failure)  2232067K->1059628K(2786304K), 0.0204328 secs]
SUREFIRE-859: [GC (Allocation Failure)  2243372K->1070076K(2793472K), 0.0220392 secs]
SUREFIRE-859: [GC (Allocation Failure)  2267644K->1122395K(2793984K), 0.0176221 secs]
SUREFIRE-859: [GC (Allocation Failure)  2319963K->1131595K(2796032K), 0.0206467 secs]
SUREFIRE-859: [GC (Allocation Failure)  2336331K->1138685K(2798592K), 0.0188023 secs]
SUREFIRE-859: [GC (Allocation Failure)  2343421K->1145454K(2800128K), 0.0159459 secs]
SUREFIRE-859: [GC (Allocation Failure)  2360430K->1168557K(2803200K), 0.0158468 secs]
SUREFIRE-859: [GC (Allocation Failure)  2383520K->1228798K(2785792K), 0.0228069 secs]
SUREFIRE-859: [GC (Allocation Failure)  2431998K->1224617K(2801664K), 0.0270413 secs]
SUREFIRE-859: [GC (Allocation Failure)  2427817K->1229486K(2793472K), 0.0317853 secs]
SUREFIRE-859: [GC (Allocation Failure)  2435758K->1242489K(2799104K), 0.0405923 secs]
SUREFIRE-859: [GC (Allocation Failure)  2448719K->1255883K(2797568K), 0.0296677 secs]
SUREFIRE-859: [GC (Allocation Failure)  2474443K->1285161K(2803200K), 0.0221214 secs]
SUREFIRE-859: [GC (Allocation Failure)  2503721K->1306827K(2808320K), 0.0241919 secs]
SUREFIRE-859: [GC (Allocation Failure)  2539295K->1313089K(2812928K), 0.0213385 secs]
SUREFIRE-859: [GC (Allocation Failure)  2547521K->1357308K(2817536K), 0.0223758 secs]
SUREFIRE-859: [GC (Allocation Failure)  2598396K->1373902K(2820608K), 0.0197314 secs]
SUREFIRE-859: [GC (Allocation Failure)  2614990K->1389402K(2813952K), 0.0180897 secs]
SUREFIRE-859: [GC (Allocation Failure)  2633050K->1404789K(2817536K), 0.0324545 secs]
SUREFIRE-859: [GC (Allocation Failure)  2648430K->1459292K(2812928K), 0.0248742 secs]
SUREFIRE-859: [GC (Allocation Failure)  2701404K->1471588K(2821120K), 0.0286231 secs]
SUREFIRE-859: [Full GC (Ergonomics)  1471588K->999827K(3423232K), 0.6292597 secs]
SUREFIRE-859: [GC (Allocation Failure)  2241939K->1007057K(3416576K), 0.0196167 secs]
SUREFIRE-859: [GC (Allocation Failure)  2251729K->1014458K(3421184K), 0.0171385 secs]
SUREFIRE-859: [GC (Allocation Failure)  2259130K->1013751K(3421184K), 0.0192701 secs]
SUREFIRE-859: [GC (Allocation Failure)  2268151K->1016331K(3425280K), 0.0177294 secs]
SUREFIRE-859: [GC (Allocation Failure)  2270731K->1017648K(3426304K), 0.0170849 secs]
SUREFIRE-859: [GC (Allocation Failure)  2282288K->1088741K(3430912K), 0.0223618 secs]
SUREFIRE-859: [GC (Allocation Failure)  2353381K->1277412K(3252736K), 0.0578081 secs]
SUREFIRE-859: [GC (Allocation Failure)  2356708K->1514509K(3341824K), 0.1032085 secs]
SUREFIRE-859: [GC (Allocation Failure)  2593805K->1690801K(3010048K), 0.1094509 secs]
SUREFIRE-859: [GC (Allocation Failure)  2438321K->1731192K(3175936K), 0.0785484 secs]
SUREFIRE-859: [GC (Allocation Failure)  2478483K->1764762K(3126784K), 0.0406020 secs]
SUREFIRE-859: [GC (Allocation Failure)  2528666K->1834095K(3159552K), 0.0972457 secs]
SUREFIRE-859: [GC (Allocation Failure)  2597999K->1822823K(3180544K), 0.0463350 secs]
SUREFIRE-859: [GC (Allocation Failure)  2653799K->1941073K(3202048K), 0.0462493 secs]
SUREFIRE-859: [GC (Allocation Failure)  2772049K->2037967K(3209728K), 0.0598187 secs]
SUREFIRE-859: [Full GC (Ergonomics)  2037967K->1140510K(3521536K), 0.5841950 secs]
SUREFIRE-859: [GC (Allocation Failure)  2021150K->1183242K(3534848K), 0.0233055 secs]
SUREFIRE-859: [GC (Allocation Failure)  2063882K->1239762K(3545600K), 0.0361826 secs]
SUREFIRE-859: [GC (Allocation Failure)  2169042K->1239917K(3561472K), 0.0199514 secs]
SUREFIRE-859: [GC (Allocation Failure)  2169197K->1249181K(3583488K), 0.0109718 secs]
SUREFIRE-859: [GC (Allocation Failure)  2214813K->1249847K(3590656K), 0.0164791 secs]
SUREFIRE-859: [GC (Allocation Failure)  2215479K->1255831K(3587584K), 0.0298298 secs]
SUREFIRE-859: [GC (Allocation Failure)  2238871K->1262147K(3596288K), 0.0165919 secs]
SUREFIRE-859: [GC (Allocation Failure)  2245187K->1297757K(3587584K), 0.0165466 secs]
SUREFIRE-859: [GC (Allocation Failure)  2306397K->1337684K(3601920K), 0.0168012 secs]
SUREFIRE-859: [GC (Allocation Failure)  2346324K->1363060K(3617792K), 0.0218679 secs]
SUREFIRE-859: [GC (Allocation Failure)  2414196K->1372297K(3628544K), 0.0217046 secs]
SUREFIRE-859: [GC (Allocation Failure)  2423433K->1381845K(3631616K), 0.0229119 secs]
SUREFIRE-859: [GC (Allocation Failure)  2462165K->1390576K(3642880K), 0.0178279 secs]
SUREFIRE-859: [GC (Allocation Failure)  2470896K->1420263K(3639808K), 0.0217180 secs]
SUREFIRE-859: [GC (Allocation Failure)  2530279K->1474471K(3654656K), 0.0236511 secs]
SUREFIRE-859: [GC (Allocation Failure)  2584462K->1460744K(3674112K), 0.0256041 secs]
SUREFIRE-859: [GC (Allocation Failure)  2597384K->1467683K(3677696K), 0.0174637 secs]
SUREFIRE-859: [GC (Allocation Failure)  2604323K->1474603K(3677184K), 0.0159384 secs]
SUREFIRE-859: [GC (Allocation Failure)  2625579K->1504187K(3681280K), 0.0154833 secs]
SUREFIRE-859: [GC (Allocation Failure)  2655163K->1524994K(3693568K), 0.0256147 secs]
SUREFIRE-859: [GC (Allocation Failure)  2693378K->1525698K(3696640K), 0.0207250 secs]
SUREFIRE-859: [GC (Allocation Failure)  2694082K->1553346K(3675648K), 0.0332844 secs]
SUREFIRE-859: [GC (Allocation Failure)  2699202K->1560547K(3654144K), 0.0226643 secs]
SUREFIRE-859: [GC (Allocation Failure)  2706403K->1585955K(3638784K), 0.0314929 secs]
SUREFIRE-859: [GC (Allocation Failure)  2672419K->1573934K(3604992K), 0.0350803 secs]
SUREFIRE-859: [GC (Allocation Failure)  2660386K->1572439K(3642368K), 0.0304423 secs]
SUREFIRE-859: [GC (Allocation Failure)  2635351K->1582623K(3550208K), 0.0280882 secs]
SUREFIRE-859: [GC (Allocation Failure)  2645535K->1616474K(3642368K), 0.0419761 secs]
SUREFIRE-859: [GC (Allocation Failure)  2682458K->1636644K(3642368K), 0.0284039 secs]
SUREFIRE-859: [GC (Allocation Failure)  2702605K->1669211K(3644416K), 0.0335945 secs]
SUREFIRE-859: [GC (Allocation Failure)  2740827K->1687302K(3550720K), 0.0337251 secs]
SUREFIRE-859: [GC (Allocation Failure)  2758918K->1723186K(3653120K), 0.0346625 secs]
SUREFIRE-859: [GC (Allocation Failure)  2808114K->1783444K(3646976K), 0.0344732 secs]
SUREFIRE-859: [GC (Allocation Failure)  2868372K->1821458K(3660288K), 0.0283036 secs]
SUREFIRE-859: [GC (Allocation Failure)  2924818K->1831736K(3658240K), 0.0229369 secs]
SUREFIRE-859: [GC (Allocation Failure)  2935096K->1972607K(3646464K), 0.0565410 secs]
SUREFIRE-859: [GC (Allocation Failure)  3068287K->1934589K(3518464K), 0.0410718 secs]
Tests run: 1, Failures: 0, Errors: 0, Skipped: 0, Time elapsed: 674.295 sec - in org.apache.hadoop.hbase.IntegrationTestIngest

Results :

Failed tests: 
  IntegrationTestDDLMasterFailover.testAsUnitTest:190->runTest:782->checkException:752
Action failed: CREATE_TABLE in thread: Thread-155 expected null, but was:<org.apache.hadoop.hbase.client.RetriesExhaustedException:
Failed after attempts=351, exceptions:
Thu Feb 23 08:30:57 UTC 2017, null, java.net.SocketTimeoutException: callTimeout=60000, callDuration=68473:
row 'ittable-1191212209,,' on table 'hbase:meta' at region=hbase:meta,,1.1588230740, hostname=asf905.gq1.ygridcore.net,54848,1487838247405,
seqNum=0
>
  IntegrationTestRegionReplicaReplication.testIngest:112->runIngestTest:197 Load failed
with error code 1
  IntegrationTestBulkLoad.testBulkLoad:217->runCheck:719 expected:<true> but was:<false>
Tests in error: 
  IntegrationTestIngestWithACL>IntegrationTestBase.setUp:133->setUpCluster:64->IntegrationTestIngest.setUpCluster:84
» IO
  IntegrationTestMTTR.testKillRsHoldingMeta:278->run:319 » Execution java.io.IOE...
  IntegrationTestMTTR.testRestartRsHoldingTable:273->run:319 » Execution java.io...
  IntegrationTestBigLinkedListWithVisibility.testContinuousIngest:636 » Runtime ...
  IntegrationTestWithCellVisibilityLoadAndVerify>IntegrationTestLoadAndVerify.testLoadAndVerify:545->doVerify:293->access$400:79->doVerify:338
» FileAlreadyExists

Tests run: 33, Failures: 3, Errors: 5, Skipped: 2

[WARNING] File encoding has not been set, using platform encoding ISO-8859-1, i.e. build is
platform dependent! The file encoding for reports output files should be provided by the POM
property ${project.reporting.outputEncoding}.
[INFO] 
[INFO] --- maven-failsafe-plugin:2.18.1:verify (verify) @ hbase-it ---
[INFO] Failsafe report directory: <https://builds.apache.org/job/HBase-1.2-IT/it.test=IntegrationTestBigLinkedList,jdk=JDK%201.8%20(latest),label=Hadoop/ws/hbase-it/target/failsafe-reports>
[WARNING] File encoding has not been set, using platform encoding ISO-8859-1, i.e. build is
platform dependent! The file encoding for reports output files should be provided by the POM
property ${project.reporting.outputEncoding}.
[INFO] ------------------------------------------------------------------------
[INFO] Reactor Summary:
[INFO] 
[INFO] Apache HBase ...................................... SUCCESS [1:46.488s]
[INFO] Apache HBase - Checkstyle ......................... SUCCESS [7.479s]
[INFO] Apache HBase - Resource Bundle .................... SUCCESS [0.194s]
[INFO] Apache HBase - Annotations ........................ SUCCESS [0.963s]
[INFO] Apache HBase - Protocol ........................... SUCCESS [18.160s]
[INFO] Apache HBase - Common ............................. SUCCESS [1:48.328s]
[INFO] Apache HBase - Procedure .......................... SUCCESS [1.385s]
[INFO] Apache HBase - Client ............................. SUCCESS [14.025s]
[INFO] Apache HBase - Hadoop Compatibility ............... SUCCESS [2.490s]
[INFO] Apache HBase - Hadoop Two Compatibility ........... SUCCESS [3.507s]
[INFO] Apache HBase - Prefix Tree ........................ SUCCESS [1.175s]
[INFO] Apache HBase - Server ............................. SUCCESS [1:51.182s]
[INFO] Apache HBase - Testing Util ....................... SUCCESS [3.128s]
[INFO] Apache HBase - Thrift ............................. SUCCESS [11.063s]
[INFO] Apache HBase - Rest ............................... SUCCESS [2.979s]
[INFO] Apache HBase - Shell .............................. SUCCESS [7.746s]
[INFO] Apache HBase - Integration Tests .................. FAILURE [3:25:21.053s]
[INFO] Apache HBase - Examples ........................... SKIPPED
[INFO] Apache HBase - External Block Cache ............... SKIPPED
[INFO] Apache HBase - Assembly ........................... SKIPPED
[INFO] Apache HBase - Shaded ............................. SKIPPED
[INFO] Apache HBase - Shaded - Client .................... SKIPPED
[INFO] Apache HBase - Shaded - Server .................... SKIPPED
[INFO] ------------------------------------------------------------------------
[INFO] BUILD FAILURE
[INFO] ------------------------------------------------------------------------
[INFO] Total time: 3:32:32.452s
[INFO] Finished at: Thu Feb 23 11:19:44 UTC 2017
[INFO] Final Memory: 88M/1340M
[INFO] ------------------------------------------------------------------------
[ERROR] Failed to execute goal org.apache.maven.plugins:maven-failsafe-plugin:2.18.1:verify
(verify) on project hbase-it: There are test failures.
[ERROR] 
[ERROR] Please refer to <https://builds.apache.org/job/HBase-1.2-IT/it.test=IntegrationTestBigLinkedList,jdk=JDK%201.8%20(latest),label=Hadoop/ws/hbase-it/target/failsafe-reports>
for the individual test results.
[ERROR] -> [Help 1]
[ERROR] 
[ERROR] To see the full stack trace of the errors, re-run Maven with the -e switch.
[ERROR] Re-run Maven using the -X switch to enable full debug logging.
[ERROR] 
[ERROR] For more information about the errors and possible solutions, please read the following
articles:
[ERROR] [Help 1] http://cwiki.apache.org/confluence/display/MAVEN/MojoFailureException
[ERROR] 
[ERROR] After correcting the problems, you can resume the build with the command
[ERROR]   mvn <goals> -rf :hbase-it
Build step 'Invoke top-level Maven targets' marked build as failure
Performing Post build task...
Match found for :.* : True
Logical operation result is TRUE
Running script  : # Post-build task script. TODO: Check this in and have all builds reference
check-in.
pwd && ls
# NOTE!!!! The below code has been copied and pasted from ./dev-tools/run-test.sh
# Do not change here without syncing there and vice-versa.
ZOMBIE_TESTS_COUNT=`jps -v | grep surefirebooter | grep -e '-Dhbase.test' | wc -l`
if [[ $ZOMBIE_TESTS_COUNT != 0 ]] ; then
 echo "Suspicious java process found - waiting 30s to see if there are just slow to stop"
 sleep 30
 ZOMBIE_TESTS_COUNT=`jps -v | grep surefirebooter | grep -e '-Dhbase.test' | wc -l`
 if [[ $ZOMBIE_TESTS_COUNT != 0 ]] ; then
   echo " {color:red}There appear to be $ZOMBIE_TESTS_COUNT zombie tests{color}, they should
have been killed by surefire but survived"
   jps -v | grep surefirebooter | grep -e '-Dhbase.test'
   jps -v | grep surefirebooter | grep -e '-Dhbase.test' | cut -d ' ' -f 1 | xargs -n 1 jstack
   # Exit with error
   exit 1
 else
   echo "We're ok: there is no zombie test, but some tests took some time to stop"
 fi
else
  echo "We're ok: there is no zombie test"
fi
[6a208e71] $ /bin/bash -xe /tmp/hudson522704591894616408.sh
+ pwd
<https://builds.apache.org/job/HBase-1.2-IT/it.test=IntegrationTestBigLinkedList,jdk=JDK%201.8%20(latest),label=Hadoop/ws/>
+ ls
bin
CHANGES.txt
conf
dev-support
hbase-annotations
hbase-assembly
hbase-checkstyle
hbase-client
hbase-common
hbase-examples
hbase-external-blockcache
hbase-hadoop2-compat
hbase-hadoop-compat
hbase-it
hbase-native-client
hbase-prefix-tree
hbase-procedure
hbase-protocol
hbase-resource-bundle
hbase-rest
hbase-server
hbase-shaded
hbase-shell
hbase-testing-util
hbase-thrift
LICENSE.txt
NOTICE.txt
pom.xml
README.txt
src
target
++ jps -v
++ grep surefirebooter
++ grep -e -Dhbase.test
++ wc -l
+ ZOMBIE_TESTS_COUNT=0
+ [[ 0 != 0 ]]
+ echo 'We'\''re ok: there is no zombie test'
We're ok: there is no zombie test
POST BUILD TASK : SUCCESS
END OF POST BUILD TASK : 0
Archiving artifacts
No prior successful build to compare, so performing full copy of artifacts

Mime
View raw message