hbase-builds mailing list archives

Site index · List index
Message view « Date » · « Thread »
Top « Date » · « Thread »
From Apache Jenkins Server <jenk...@builds.apache.org>
Subject Build failed in Jenkins: HBase-1.2-IT » IntegrationTestBigLinkedList,JDK 1.7 (latest),Hadoop #604
Date Thu, 23 Feb 2017 11:07:40 GMT
See <https://builds.apache.org/job/HBase-1.2-IT/it.test=IntegrationTestBigLinkedList,jdk=JDK%201.7%20(latest),label=Hadoop/604/display/redirect?page=changes>

Changes:

[busbey] HBASE-17677 Just the new tests from 'ServerName parsing from directory

------------------------------------------
[...truncated 4.01 MB...]
SUREFIRE-859: [GC 2090385K->832607K(2828288K), 0.0197310 secs]
SUREFIRE-859: [GC 2119775K->882902K(2826240K), 0.0213740 secs]
SUREFIRE-859: [GC 2170070K->903064K(2827264K), 0.0220050 secs]
SUREFIRE-859: [GC 2190232K->919862K(2825216K), 0.0227190 secs]
SUREFIRE-859: [GC 2212130K->966370K(2827776K), 0.0255170 secs]
SUREFIRE-859: [GC 2258658K->1105168K(2723328K), 0.0456080 secs]
SUREFIRE-859: [GC 2289424K->1106349K(2777600K), 0.0315780 secs]
SUREFIRE-859: [GC 2290605K->1107365K(2774528K), 0.0114460 secs]
SUREFIRE-859: [GC 2291621K->1113455K(2776064K), 0.0110330 secs]
SUREFIRE-859: [GC 2297711K->1121295K(2772992K), 0.0308910 secs]
SUREFIRE-859: [GC 2311183K->1125273K(2775552K), 0.0164500 secs]
SUREFIRE-859: [GC 2315161K->1210225K(2758656K), 0.0206780 secs]
SUREFIRE-859: [GC 2386288K->1225959K(2773504K), 0.0313600 secs]
SUREFIRE-859: [GC 2402023K->1237168K(2760192K), 0.0240710 secs]
SUREFIRE-859: [GC 2416304K->1245265K(2768384K), 0.0336580 secs]
SUREFIRE-859: [GC 2424401K->1248766K(2769408K), 0.0256780 secs]
SUREFIRE-859: [GC 2445310K->1263890K(2777600K), 0.0242070 secs]
SUREFIRE-859: [GC 2460422K->1314016K(2782208K), 0.0261420 secs]
SUREFIRE-859: [GC 2520800K->1305133K(2788864K), 0.0304460 secs]
SUREFIRE-859: [GC 2511898K->1314178K(2778112K), 0.0295740 secs]
SUREFIRE-859: [GC 2525058K->1337802K(2784768K), 0.0221840 secs]
SUREFIRE-859: [GC 2548682K->1361370K(2788352K), 0.0257350 secs]
SUREFIRE-859: [GC 2590682K->1361171K(2792960K), 0.0225670 secs]
SUREFIRE-859: [GC 2590483K->1368635K(2798592K), 0.0192210 secs]
SUREFIRE-859: [GC 2615317K->1396837K(2803712K), 0.0289510 secs]
SUREFIRE-859: [GC 2643510K->1457109K(2809344K), 0.0335700 secs]
SUREFIRE-859: [Full GC 1457109K->549771K(2834944K), 0.3101470 secs]
SUREFIRE-859: [GC 1808267K->572714K(2838016K), 0.0246730 secs]
SUREFIRE-859: [GC 1831168K->615301K(2838016K), 0.0236940 secs]
SUREFIRE-859: [GC 1877381K->693672K(2842112K), 0.0322960 secs]
SUREFIRE-859: [GC 1955752K->761155K(2782720K), 0.0290230 secs]
SUREFIRE-859: [GC 1963843K->745166K(2812416K), 0.0174000 secs]
SUREFIRE-859: [GC 1947854K->749798K(2807296K), 0.0132210 secs]
SUREFIRE-859: [GC 1953510K->756842K(2810368K), 0.0146950 secs]
SUREFIRE-859: [GC 1960554K->761764K(2809344K), 0.0159970 secs]
SUREFIRE-859: [GC 1973668K->838460K(2801152K), 0.0176790 secs]
SUREFIRE-859: [GC 2050354K->835292K(2811392K), 0.0203870 secs]
SUREFIRE-859: [GC 2032827K->848034K(2716672K), 0.0158210 secs]
SUREFIRE-859: [GC 2045552K->854933K(2807808K), 0.0200590 secs]
SUREFIRE-859: [GC 2056085K->858514K(2804224K), 0.0198970 secs]
SUREFIRE-859: [GC 2059652K->871618K(2813440K), 0.0176740 secs]
SUREFIRE-859: [GC 2089653K->942016K(2811904K), 0.0226680 secs]
SUREFIRE-859: [GC 2160064K->948930K(2822144K), 0.0181780 secs]
SUREFIRE-859: [GC 2166928K->971266K(2746880K), 0.0250820 secs]
SUREFIRE-859: [GC 2189314K->996883K(2817536K), 0.0305250 secs]
SUREFIRE-859: [GC 2219539K->995914K(2812928K), 0.0173340 secs]
SUREFIRE-859: [GC 2218570K->1060928K(2812928K), 0.0206780 secs]
SUREFIRE-859: [GC 2286144K->1088855K(2823680K), 0.0275040 secs]
SUREFIRE-859: [GC 2314071K->1136738K(2822656K), 0.0250040 secs]
SUREFIRE-859: [GC 2362978K->1143281K(2823680K), 0.0178460 secs]
SUREFIRE-859: [GC 2369521K->1172906K(2815488K), 0.0175460 secs]
SUREFIRE-859: [GC 2402218K->1187301K(2819584K), 0.0158300 secs]
SUREFIRE-859: [GC 2416613K->1194954K(2825728K), 0.0151580 secs]
SUREFIRE-859: [GC 2438602K->1217150K(2829824K), 0.0165740 secs]
SUREFIRE-859: [GC 2460789K->1259110K(2832384K), 0.0193080 secs]
SUREFIRE-859: [GC 2510382K->1303200K(2834944K), 0.0195470 secs]
SUREFIRE-859: [GC 2554528K->1303054K(2834944K), 0.0212770 secs]
SUREFIRE-859: [GC 2560014K->1315782K(2836992K), 0.0262620 secs]
SUREFIRE-859: [GC 2572742K->1338904K(2834432K), 0.0251450 secs]
SUREFIRE-859: [GC 2603498K->1378659K(2838016K), 0.0179240 secs]
SUREFIRE-859: [GC 2643261K->1414181K(2845184K), 0.0176980 secs]
SUREFIRE-859: [GC 2690085K->1439595K(2847232K), 0.0184070 secs]
SUREFIRE-859: [GC 2715499K->1440978K(2849280K), 0.0456840 secs]
SUREFIRE-859: [GC 2723026K->1458249K(2849792K), 0.0251570 secs]
SUREFIRE-859: [GC 2740282K->1499059K(2847744K), 0.0269160 secs]
SUREFIRE-859: [Full GC 1499059K->660879K(3011072K), 0.4064200 secs]
SUREFIRE-859: [GC 1942401K->668968K(3015168K), 0.0164140 secs]
SUREFIRE-859: [GC 1950504K->681090K(3010048K), 0.0160490 secs]
SUREFIRE-859: [GC 1963650K->699928K(3013120K), 0.0179320 secs]
SUREFIRE-859: [GC 1982488K->752136K(3016704K), 0.0191820 secs]
SUREFIRE-859: [GC 2040840K->780199K(3018752K), 0.0236530 secs]
SUREFIRE-859: [GC 2068858K->787739K(3015680K), 0.0205730 secs]
SUREFIRE-859: [GC 2076443K->820753K(3017216K), 0.0191040 secs]
SUREFIRE-859: [GC 2109427K->832012K(3018240K), 0.0293080 secs]
SUREFIRE-859: [GC 2119692K->869327K(2994688K), 0.0163870 secs]
SUREFIRE-859: [GC 2156998K->876267K(3018752K), 0.0153020 secs]
SUREFIRE-859: [GC 2163947K->889181K(2970112K), 0.0184670 secs]
SUREFIRE-859: [GC 2176861K->908680K(3019776K), 0.0181490 secs]
SUREFIRE-859: [GC 2199432K->948617K(3016704K), 0.0260920 secs]
SUREFIRE-859: [GC 2239369K->950900K(3020288K), 0.0349520 secs]
SUREFIRE-859: [GC 2243159K->966438K(3019264K), 0.0242690 secs]
SUREFIRE-859: [GC 2258726K->990216K(3020288K), 0.0219500 secs]
SUREFIRE-859: [GC 2285576K->1013885K(3020288K), 0.0247750 secs]
SUREFIRE-859: [GC 2309245K->1056584K(3021824K), 0.0244320 secs]
SUREFIRE-859: [GC 2353480K->1069863K(3021824K), 0.0330110 secs]
SUREFIRE-859: [GC 2366759K->1079618K(3022336K), 0.0178980 secs]
SUREFIRE-859: [GC 2379074K->1119525K(3022848K), 0.0195650 secs]
SUREFIRE-859: [GC 2418981K->1154699K(3019264K), 0.0219710 secs]
SUREFIRE-859: [GC 2449547K->1152725K(3021824K), 0.0320150 secs]
SUREFIRE-859: [GC 2447573K->1147669K(3021824K), 0.0398160 secs]
SUREFIRE-859: [GC 2444565K->1154995K(3022336K), 0.0207820 secs]
SUREFIRE-859: [GC 2451891K->1150357K(3022848K), 0.0187880 secs]
SUREFIRE-859: [GC 2449301K->1224166K(3022848K), 0.0365120 secs]
SUREFIRE-859: [GC 2523110K->1340908K(2892800K), 0.0400520 secs]
SUREFIRE-859: [GC 2507756K->1453951K(2930688K), 0.0323860 secs]
SUREFIRE-859: [GC 2620799K->1483937K(2917888K), 0.0407100 secs]
SUREFIRE-859: [GC 2599585K->1470647K(2875904K), 0.0263740 secs]
SUREFIRE-859: [GC 2586295K->1393524K(2929152K), 0.0234060 secs]
SUREFIRE-859: [GC 2501992K->1523262K(2916352K), 0.0349770 secs]
SUREFIRE-859: [GC 2631742K->1566869K(2917376K), 0.0471950 secs]
SUREFIRE-859: [GC 2651797K->1617208K(2811904K), 0.0618610 secs]
SUREFIRE-859: [Full GC 1617208K->762840K(3014656K), 0.5265190 secs]
SUREFIRE-859: [GC 1847706K->837407K(3110912K), 0.0248780 secs]
SUREFIRE-859: [GC 1923871K->837854K(3109376K), 0.0235390 secs]
SUREFIRE-859: [GC 1924311K->838894K(3130368K), 0.0171660 secs]
SUREFIRE-859: [GC 1946862K->844201K(2991616K), 0.0112970 secs]
SUREFIRE-859: [GC 1952169K->851854K(3132928K), 0.0233750 secs]
SUREFIRE-859: [GC 1965460K->864883K(3128832K), 0.0223260 secs]
SUREFIRE-859: [GC 1978702K->892629K(3130368K), 0.0293380 secs]
SUREFIRE-859: [GC 2021077K->916403K(3129344K), 0.0244880 secs]
SUREFIRE-859: [GC 2044851K->946850K(3147264K), 0.0161290 secs]
SUREFIRE-859: [GC 2100898K->956940K(3144704K), 0.0178320 secs]
SUREFIRE-859: [GC 2110988K->963090K(3160064K), 0.0199960 secs]
Tests run: 1, Failures: 0, Errors: 0, Skipped: 0, Time elapsed: 641.427 sec - in org.apache.hadoop.hbase.IntegrationTestIngestWithTags

Results :

Failed tests: 
  IntegrationTestRegionReplicaReplication.testIngest:112->runIngestTest:197 Load failed
with error code 1
  IntegrationTestBulkLoad.testBulkLoad:217->runCheck:719 expected:<true> but was:<false>
Tests in error: 
  IntegrationTestIngestWithACL>IntegrationTestBase.setUp:133->setUpCluster:64->IntegrationTestIngest.setUpCluster:84
» IO
  IntegrationTestMTTR.testKillRsHoldingMeta:278->run:319 » Execution java.io.IOE...
  IntegrationTestMTTR.testRestartRsHoldingTable:273->run:319 » Execution java.io...
  IntegrationTestBigLinkedListWithVisibility.testContinuousIngest:636 » Runtime ...
  IntegrationTestWithCellVisibilityLoadAndVerify>IntegrationTestLoadAndVerify.testLoadAndVerify:545->doVerify:293->access$400:79->doVerify:338
» FileAlreadyExists

Tests run: 32, Failures: 2, Errors: 5, Skipped: 2

[WARNING] File encoding has not been set, using platform encoding UTF-8, i.e. build is platform
dependent! The file encoding for reports output files should be provided by the POM property
${project.reporting.outputEncoding}.
[INFO] 
[INFO] --- maven-failsafe-plugin:2.18.1:verify (verify) @ hbase-it ---
[INFO] Failsafe report directory: <https://builds.apache.org/job/HBase-1.2-IT/it.test=IntegrationTestBigLinkedList,jdk=JDK%201.7%20(latest),label=Hadoop/ws/hbase-it/target/failsafe-reports>
[WARNING] File encoding has not been set, using platform encoding UTF-8, i.e. build is platform
dependent! The file encoding for reports output files should be provided by the POM property
${project.reporting.outputEncoding}.
[INFO] ------------------------------------------------------------------------
[INFO] Reactor Summary:
[INFO] 
[INFO] Apache HBase ...................................... SUCCESS [1:48.844s]
[INFO] Apache HBase - Checkstyle ......................... SUCCESS [7.589s]
[INFO] Apache HBase - Resource Bundle .................... SUCCESS [0.266s]
[INFO] Apache HBase - Annotations ........................ SUCCESS [1.025s]
[INFO] Apache HBase - Protocol ........................... SUCCESS [18.920s]
[INFO] Apache HBase - Common ............................. SUCCESS [1:49.954s]
[INFO] Apache HBase - Procedure .......................... SUCCESS [1.391s]
[INFO] Apache HBase - Client ............................. SUCCESS [14.902s]
[INFO] Apache HBase - Hadoop Compatibility ............... SUCCESS [2.592s]
[INFO] Apache HBase - Hadoop Two Compatibility ........... SUCCESS [4.010s]
[INFO] Apache HBase - Prefix Tree ........................ SUCCESS [1.497s]
[INFO] Apache HBase - Server ............................. SUCCESS [1:47.364s]
[INFO] Apache HBase - Testing Util ....................... SUCCESS [3.558s]
[INFO] Apache HBase - Thrift ............................. SUCCESS [11.872s]
[INFO] Apache HBase - Rest ............................... SUCCESS [3.191s]
[INFO] Apache HBase - Shell .............................. SUCCESS [6.628s]
[INFO] Apache HBase - Integration Tests .................. FAILURE [3:15:34.125s]
[INFO] Apache HBase - Examples ........................... SKIPPED
[INFO] Apache HBase - External Block Cache ............... SKIPPED
[INFO] Apache HBase - Assembly ........................... SKIPPED
[INFO] Apache HBase - Shaded ............................. SKIPPED
[INFO] Apache HBase - Shaded - Client .................... SKIPPED
[INFO] Apache HBase - Shaded - Server .................... SKIPPED
[INFO] ------------------------------------------------------------------------
[INFO] BUILD FAILURE
[INFO] ------------------------------------------------------------------------
[INFO] Total time: 3:22:49.798s
[INFO] Finished at: Thu Feb 23 11:06:23 UTC 2017
[INFO] Final Memory: 112M/617M
[INFO] ------------------------------------------------------------------------
[ERROR] Failed to execute goal org.apache.maven.plugins:maven-failsafe-plugin:2.18.1:verify
(verify) on project hbase-it: There was a timeout or other error in the fork -> [Help 1]
[ERROR] 
[ERROR] To see the full stack trace of the errors, re-run Maven with the -e switch.
[ERROR] Re-run Maven using the -X switch to enable full debug logging.
[ERROR] 
[ERROR] For more information about the errors and possible solutions, please read the following
articles:
[ERROR] [Help 1] http://cwiki.apache.org/confluence/display/MAVEN/MojoFailureException
[ERROR] 
[ERROR] After correcting the problems, you can resume the build with the command
[ERROR]   mvn <goals> -rf :hbase-it
Build step 'Invoke top-level Maven targets' marked build as failure
Performing Post build task...
Match found for :.* : True
Logical operation result is TRUE
Running script  : # Post-build task script. TODO: Check this in and have all builds reference
check-in.
pwd && ls
# NOTE!!!! The below code has been copied and pasted from ./dev-tools/run-test.sh
# Do not change here without syncing there and vice-versa.
ZOMBIE_TESTS_COUNT=`jps -v | grep surefirebooter | grep -e '-Dhbase.test' | wc -l`
if [[ $ZOMBIE_TESTS_COUNT != 0 ]] ; then
 echo "Suspicious java process found - waiting 30s to see if there are just slow to stop"
 sleep 30
 ZOMBIE_TESTS_COUNT=`jps -v | grep surefirebooter | grep -e '-Dhbase.test' | wc -l`
 if [[ $ZOMBIE_TESTS_COUNT != 0 ]] ; then
   echo " {color:red}There appear to be $ZOMBIE_TESTS_COUNT zombie tests{color}, they should
have been killed by surefire but survived"
   jps -v | grep surefirebooter | grep -e '-Dhbase.test'
   jps -v | grep surefirebooter | grep -e '-Dhbase.test' | cut -d ' ' -f 1 | xargs -n 1 jstack
   # Exit with error
   exit 1
 else
   echo "We're ok: there is no zombie test, but some tests took some time to stop"
 fi
else
  echo "We're ok: there is no zombie test"
fi
[495466b0] $ /bin/bash -xe /tmp/hudson5337868315179176456.sh
+ pwd
<https://builds.apache.org/job/HBase-1.2-IT/it.test=IntegrationTestBigLinkedList,jdk=JDK%201.7%20(latest),label=Hadoop/ws/>
+ ls
bin
CHANGES.txt
conf
dev-support
hbase-annotations
hbase-assembly
hbase-checkstyle
hbase-client
hbase-common
hbase-examples
hbase-external-blockcache
hbase-hadoop2-compat
hbase-hadoop-compat
hbase-it
hbase-native-client
hbase-prefix-tree
hbase-procedure
hbase-protocol
hbase-resource-bundle
hbase-rest
hbase-server
hbase-shaded
hbase-shell
hbase-testing-util
hbase-thrift
LICENSE.txt
NOTICE.txt
pom.xml
README.txt
src
target
++ jps -v
++ grep surefirebooter
++ grep -e -Dhbase.test
++ wc -l
+ ZOMBIE_TESTS_COUNT=0
+ [[ 0 != 0 ]]
+ echo 'We'\''re ok: there is no zombie test'
We're ok: there is no zombie test
POST BUILD TASK : SUCCESS
END OF POST BUILD TASK : 0
Archiving artifacts
No prior successful build to compare, so performing full copy of artifacts

Mime
View raw message