hbase-builds mailing list archives

Site index · List index
Message view « Date » · « Thread »
Top « Date » · « Thread »
From Apache Jenkins Server <jenk...@builds.apache.org>
Subject Build failed in Jenkins: HBase-1.2-IT » IntegrationTestBigLinkedList,JDK 1.8 (latest),Hadoop #603
Date Wed, 22 Feb 2017 14:47:01 GMT
See <https://builds.apache.org/job/HBase-1.2-IT/it.test=IntegrationTestBigLinkedList,jdk=JDK%201.8%20(latest),label=Hadoop/603/display/redirect?page=changes>

Changes:

[busbey] HBASE-17561 table status page should escape values that may contain

------------------------------------------
[...truncated 2.82 MB...]
     bool UseParNewGC                               = false                              
{product}
     bool UseParallelGC                            := true                               
{product}
     bool UseParallelOldGC                          = true                               
{product}
     bool UsePerfData                               = true                               
{product}
     bool UsePopCountInstruction                    = true                               
{product}
     bool UseRDPCForConstantTableBase               = false                              
{C2 product}
     bool UseRTMDeopt                               = false                              
{ARCH product}
     bool UseRTMLocking                             = false                              
{ARCH product}
     bool UseSHA                                    = false                              
{product}
     bool UseSHA1Intrinsics                         = false                              
{product}
     bool UseSHA256Intrinsics                       = false                              
{product}
     bool UseSHA512Intrinsics                       = false                              
{product}
     bool UseSHM                                    = false                              
{product}
     intx UseSSE                                    = 4                                  
{product}
     bool UseSSE42Intrinsics                        = true                               
{product}
     bool UseSerialGC                               = false                              
{product}
     bool UseSharedSpaces                           = false                              
{product}
     bool UseSignalChaining                         = true                               
{product}
     bool UseSquareToLenIntrinsic                   = false                              
{C2 product}
     bool UseStoreImmI16                            = false                              
{ARCH product}
     bool UseStringDeduplication                    = false                              
{product}
     bool UseSuperWord                              = true                               
{C2 product}
     bool UseTLAB                                   = true                               
{pd product}
     bool UseThreadPriorities                       = true                               
{pd product}
     bool UseTransparentHugePages                   = false                              
{product}
     bool UseTypeProfile                            = true                               
{product}
     bool UseTypeSpeculation                        = true                               
{C2 product}
     bool UseUnalignedLoadStores                    = true                               
{ARCH product}
     bool UseVMInterruptibleIO                      = false                              
{product}
     bool UseXMMForArrayCopy                        = true                               
{product}
     bool UseXmmI2D                                 = false                              
{ARCH product}
     bool UseXmmI2F                                 = false                              
{ARCH product}
     bool UseXmmLoadAndClearUpper                   = true                               
{ARCH product}
     bool UseXmmRegToRegMoveAll                     = true                               
{ARCH product}
     bool VMThreadHintNoPreempt                     = false                              
{product}
     intx VMThreadPriority                          = -1                                 
{product}
     intx VMThreadStackSize                         = 1024                               
{pd product}
     intx ValueMapInitialSize                       = 11                                 
{C1 product}
     intx ValueMapMaxLoopSize                       = 8                                  
{C1 product}
     intx ValueSearchLimit                          = 1000                               
{C2 product}
     bool VerifyMergedCPBytecodes                   = true                               
{product}
     bool VerifySharedSpaces                        = false                              
{product}
     intx WorkAroundNPTLTimedWaitHang               = 1                                  
{product}
    uintx YoungGenerationSizeIncrement              = 20                                 
{product}
    uintx YoungGenerationSizeSupplement             = 80                                 
{product}
    uintx YoungGenerationSizeSupplementDecay        = 8                                  
{product}
    uintx YoungPLABSize                             = 4096                               
{product}
     bool ZeroTLAB                                  = false                              
{product}
     intx hashCode                                  = 5                                  
{product}
Running org.apache.hadoop.hbase.IntegrationTestLazyCfLoading
SUREFIRE-859: [GC (Metadata GC Threshold)  246812K->16456K(1482240K), 0.0232833 secs]
SUREFIRE-859: [Full GC (Metadata GC Threshold)  16456K->15655K(1125376K), 0.0530148 secs]
SUREFIRE-859: [GC (Metadata GC Threshold)  305987K->96683K(1125376K), 0.1327451 secs]
SUREFIRE-859: [Full GC (Metadata GC Threshold)  96683K->85719K(1503744K), 0.0781168 secs]
SUREFIRE-859: [GC (Allocation Failure)  472733K->160541K(1503744K), 0.0439697 secs]
SUREFIRE-859: [GC (Allocation Failure)  547613K->336483K(1688576K), 0.0299916 secs]
SUREFIRE-859: [GC (Allocation Failure)  908387K->470147K(1688576K), 0.0311030 secs]
SUREFIRE-859: [GC (Allocation Failure)  1042037K->662546K(2087936K), 0.0377177 secs]
SUREFIRE-859: [GC (Allocation Failure)  1511301K->699331K(2124800K), 0.0406200 secs]
SUREFIRE-859: [GC (Allocation Failure)  1548227K->850288K(2044416K), 0.0507660 secs]
SUREFIRE-859: [GC (Allocation Failure)  1542512K->893934K(2006016K), 0.0413668 secs]
SUREFIRE-859: [GC (Allocation Failure)  1586158K->995219K(2088960K), 0.0445005 secs]
SUREFIRE-859: [GC (Allocation Failure)  1656209K->1094961K(1775104K), 0.0388099 secs]
SUREFIRE-859: [Full GC (Ergonomics)  1094961K->562434K(2592256K), 0.1921736 secs]
SUREFIRE-859: [GC (Allocation Failure)  1223426K->671704K(2903552K), 0.0241981 secs]
SUREFIRE-859: [GC (Allocation Failure)  1345982K->753994K(2890240K), 0.0237040 secs]
SUREFIRE-859: [GC (Allocation Failure)  1428298K->868798K(2906624K), 0.0262728 secs]
SUREFIRE-859: [GC (Allocation Failure)  1570238K->951107K(2897408K), 0.0261274 secs]
SUREFIRE-859: [GC (Allocation Failure)  1651985K->1147223K(2920960K), 0.0340043 secs]
SUREFIRE-859: [GC (Allocation Failure)  1883029K->1295526K(2919936K), 0.0377271 secs]
SUREFIRE-859: [GC (Allocation Failure)  2032774K->1355448K(2938880K), 0.0405633 secs]
SUREFIRE-859: [GC (Allocation Failure)  2130104K->1539814K(2945024K), 0.0336578 secs]
SUREFIRE-859: [GC (Allocation Failure)  2314470K->1699607K(2956800K), 0.0388810 secs]
SUREFIRE-859: [GC (Allocation Failure)  2511639K->1841563K(2957312K), 0.0479893 secs]
SUREFIRE-859: [Full GC (Ergonomics)  1841563K->428252K(3006464K), 0.1555353 secs]
SUREFIRE-859: [GC (Allocation Failure)  1240269K->485163K(3027968K), 0.0191901 secs]
SUREFIRE-859: [GC (Allocation Failure)  1332011K->553511K(3028480K), 0.0211311 secs]
SUREFIRE-859: [GC (Allocation Failure)  1400359K->741904K(3051008K), 0.0339616 secs]
SUREFIRE-859: [GC (Allocation Failure)  1617936K->895630K(3049984K), 0.0476158 secs]
SUREFIRE-859: [GC (Allocation Failure)  1770545K->945594K(3058176K), 0.0349277 secs]
SUREFIRE-859: [GC (Allocation Failure)  1832378K->1050167K(2915840K), 0.0277951 secs]
SUREFIRE-859: [GC (Allocation Failure)  1936938K->1307824K(2916864K), 0.0434756 secs]
SUREFIRE-859: [GC (Allocation Failure)  2064523K->1489197K(2869248K), 0.0447019 secs]
SUREFIRE-859: [GC (Allocation Failure)  2244082K->1634782K(3000832K), 0.0368349 secs]
SUREFIRE-859: [GC (Allocation Failure)  2395614K->1703132K(2791936K), 0.0365536 secs]
SUREFIRE-859: [GC (Allocation Failure)  2463950K->1731407K(2981376K), 0.0283988 secs]
SUREFIRE-859: [Full GC (Ergonomics)  1731407K->1191148K(3858944K), 0.1997734 secs]
SUREFIRE-859: [GC (Allocation Failure)  1947372K->1203181K(3863552K), 0.0174352 secs]
SUREFIRE-859: [GC (Allocation Failure)  1959405K->1294093K(3858432K), 0.0169459 secs]
SUREFIRE-859: [GC (Allocation Failure)  2065916K->1384831K(3869184K), 0.0278977 secs]
SUREFIRE-859: [GC (Allocation Failure)  2156808K->1456256K(3866624K), 0.0278937 secs]
SUREFIRE-859: [GC (Allocation Failure)  2263680K->1577301K(3880960K), 0.0349384 secs]
SUREFIRE-859: [GC (Allocation Failure)  2384725K->1580799K(3915776K), 0.0283496 secs]
SUREFIRE-859: [GC (Allocation Failure)  2435950K->1580189K(3918336K), 0.0158814 secs]
SUREFIRE-859: [GC (Allocation Failure)  2435741K->1642330K(3905536K), 0.0195562 secs]
SUREFIRE-859: [GC (Allocation Failure)  2507610K->1708399K(3916800K), 0.0202610 secs]
SUREFIRE-859: [GC (Allocation Failure)  2573679K->1950424K(3905024K), 0.0394389 secs]
SUREFIRE-859: [GC (Allocation Failure)  2815682K->2095143K(3824128K), 0.0485623 secs]
SUREFIRE-859: [GC (Allocation Failure)  2960341K->2250610K(3930624K), 0.0596159 secs]
SUREFIRE-859: [GC (Allocation Failure)  3112751K->2305799K(3718144K), 0.0510137 secs]
SUREFIRE-859: [GC (Allocation Failure)  3167672K->2348815K(3930112K), 0.0265557 secs]
SUREFIRE-859: [GC (Allocation Failure)  3225359K->2512678K(3915776K), 0.0560097 secs]
SUREFIRE-859: [GC (Allocation Failure)  3389217K->2581778K(3944448K), 0.0561095 secs]
SUREFIRE-859: [GC (Allocation Failure)  3486994K->2812145K(3939328K), 0.0368615 secs]
SUREFIRE-859: [Full GC (Ergonomics)  2812145K->1855032K(3939328K), 0.2561733 secs]
SUREFIRE-859: [GC (Allocation Failure)  2760218K->2052629K(3916800K), 0.0253788 secs]
SUREFIRE-859: [GC (Allocation Failure)  2933164K->2088948K(3713536K), 0.0331531 secs]
SUREFIRE-859: [GC (Allocation Failure)  2969293K->2106722K(3930624K), 0.0190666 secs]
SUREFIRE-859: [GC (Allocation Failure)  2980460K->2267421K(3834368K), 0.0291886 secs]
SUREFIRE-859: [GC (Allocation Failure)  3142872K->2381833K(3937792K), 0.0413957 secs]
SUREFIRE-859: [GC (Allocation Failure)  3254793K->2387092K(3926016K), 0.0225226 secs]
SUREFIRE-859: [GC (Allocation Failure)  3260045K->2389762K(3928576K), 0.0166392 secs]
SUREFIRE-859: [GC (Allocation Failure)  3263234K->2389465K(3928064K), 0.0211668 secs]
Tests run: 1, Failures: 0, Errors: 0, Skipped: 0, Time elapsed: 83.064 sec - in org.apache.hadoop.hbase.IntegrationTestLazyCfLoading

Results :

Failed tests: 
  IntegrationTestRegionReplicaReplication.testIngest:112->runIngestTest:197 Load failed
with error code 1
  IntegrationTestBulkLoad.testBulkLoad:217->runCheck:719 expected:<true> but was:<false>
Tests in error: 
  IntegrationTestIngestWithACL>IntegrationTestBase.setUp:133->setUpCluster:64->IntegrationTestIngest.setUpCluster:84
» IO
  IntegrationTestMTTR.testKillRsHoldingMeta:278->run:319 » Execution java.io.IOE...
  IntegrationTestMTTR.testRestartRsHoldingTable:273->run:319 » Execution java.io...
  IntegrationTestBigLinkedListWithVisibility.testContinuousIngest:636 » Runtime ...
  IntegrationTestWithCellVisibilityLoadAndVerify>IntegrationTestLoadAndVerify.testLoadAndVerify:545->doVerify:293->access$400:79->doVerify:338
» FileAlreadyExists

Tests run: 32, Failures: 2, Errors: 5, Skipped: 2

[WARNING] File encoding has not been set, using platform encoding ISO-8859-1, i.e. build is
platform dependent! The file encoding for reports output files should be provided by the POM
property ${project.reporting.outputEncoding}.
[INFO] 
[INFO] --- maven-failsafe-plugin:2.18.1:verify (verify) @ hbase-it ---
[INFO] Failsafe report directory: <https://builds.apache.org/job/HBase-1.2-IT/it.test=IntegrationTestBigLinkedList,jdk=JDK%201.8%20(latest),label=Hadoop/ws/hbase-it/target/failsafe-reports>
[WARNING] File encoding has not been set, using platform encoding ISO-8859-1, i.e. build is
platform dependent! The file encoding for reports output files should be provided by the POM
property ${project.reporting.outputEncoding}.
[INFO] ------------------------------------------------------------------------
[INFO] Reactor Summary:
[INFO] 
[INFO] Apache HBase ...................................... SUCCESS [1.594s]
[INFO] Apache HBase - Checkstyle ......................... SUCCESS [0.600s]
[INFO] Apache HBase - Resource Bundle .................... SUCCESS [0.170s]
[INFO] Apache HBase - Annotations ........................ SUCCESS [0.856s]
[INFO] Apache HBase - Protocol ........................... SUCCESS [11.091s]
[INFO] Apache HBase - Common ............................. SUCCESS [6.430s]
[INFO] Apache HBase - Procedure .......................... SUCCESS [1.257s]
[INFO] Apache HBase - Client ............................. SUCCESS [4.013s]
[INFO] Apache HBase - Hadoop Compatibility ............... SUCCESS [0.291s]
[INFO] Apache HBase - Hadoop Two Compatibility ........... SUCCESS [1.048s]
[INFO] Apache HBase - Prefix Tree ........................ SUCCESS [0.943s]
[INFO] Apache HBase - Server ............................. SUCCESS [28.899s]
[INFO] Apache HBase - Testing Util ....................... SUCCESS [1.273s]
[INFO] Apache HBase - Thrift ............................. SUCCESS [4.869s]
[INFO] Apache HBase - Rest ............................... SUCCESS [2.286s]
[INFO] Apache HBase - Shell .............................. SUCCESS [1.036s]
[INFO] Apache HBase - Integration Tests .................. FAILURE [3:17:40.706s]
[INFO] Apache HBase - Examples ........................... SKIPPED
[INFO] Apache HBase - External Block Cache ............... SKIPPED
[INFO] Apache HBase - Assembly ........................... SKIPPED
[INFO] Apache HBase - Shaded ............................. SKIPPED
[INFO] Apache HBase - Shaded - Client .................... SKIPPED
[INFO] Apache HBase - Shaded - Server .................... SKIPPED
[INFO] ------------------------------------------------------------------------
[INFO] BUILD FAILURE
[INFO] ------------------------------------------------------------------------
[INFO] Total time: 3:18:48.409s
[INFO] Finished at: Wed Feb 22 14:46:09 UTC 2017
[INFO] Final Memory: 148M/3269M
[INFO] ------------------------------------------------------------------------
[ERROR] Failed to execute goal org.apache.maven.plugins:maven-failsafe-plugin:2.18.1:verify
(verify) on project hbase-it: There was a timeout or other error in the fork -> [Help 1]
[ERROR] 
[ERROR] To see the full stack trace of the errors, re-run Maven with the -e switch.
[ERROR] Re-run Maven using the -X switch to enable full debug logging.
[ERROR] 
[ERROR] For more information about the errors and possible solutions, please read the following
articles:
[ERROR] [Help 1] http://cwiki.apache.org/confluence/display/MAVEN/MojoFailureException
[ERROR] 
[ERROR] After correcting the problems, you can resume the build with the command
[ERROR]   mvn <goals> -rf :hbase-it
Build step 'Invoke top-level Maven targets' marked build as failure
Performing Post build task...
Match found for :.* : True
Logical operation result is TRUE
Running script  : # Post-build task script. TODO: Check this in and have all builds reference
check-in.
pwd && ls
# NOTE!!!! The below code has been copied and pasted from ./dev-tools/run-test.sh
# Do not change here without syncing there and vice-versa.
ZOMBIE_TESTS_COUNT=`jps -v | grep surefirebooter | grep -e '-Dhbase.test' | wc -l`
if [[ $ZOMBIE_TESTS_COUNT != 0 ]] ; then
 echo "Suspicious java process found - waiting 30s to see if there are just slow to stop"
 sleep 30
 ZOMBIE_TESTS_COUNT=`jps -v | grep surefirebooter | grep -e '-Dhbase.test' | wc -l`
 if [[ $ZOMBIE_TESTS_COUNT != 0 ]] ; then
   echo " {color:red}There appear to be $ZOMBIE_TESTS_COUNT zombie tests{color}, they should
have been killed by surefire but survived"
   jps -v | grep surefirebooter | grep -e '-Dhbase.test'
   jps -v | grep surefirebooter | grep -e '-Dhbase.test' | cut -d ' ' -f 1 | xargs -n 1 jstack
   # Exit with error
   exit 1
 else
   echo "We're ok: there is no zombie test, but some tests took some time to stop"
 fi
else
  echo "We're ok: there is no zombie test"
fi
[6a208e71] $ /bin/bash -xe /tmp/hudson1688775353289570988.sh
+ pwd
<https://builds.apache.org/job/HBase-1.2-IT/it.test=IntegrationTestBigLinkedList,jdk=JDK%201.8%20(latest),label=Hadoop/ws/>
+ ls
bin
CHANGES.txt
conf
dev-support
hbase-annotations
hbase-assembly
hbase-checkstyle
hbase-client
hbase-common
hbase-examples
hbase-external-blockcache
hbase-hadoop2-compat
hbase-hadoop-compat
hbase-it
hbase-native-client
hbase-prefix-tree
hbase-procedure
hbase-protocol
hbase-resource-bundle
hbase-rest
hbase-server
hbase-shaded
hbase-shell
hbase-testing-util
hbase-thrift
LICENSE.txt
NOTICE.txt
pom.xml
README.txt
src
target
++ jps -v
++ grep surefirebooter
++ wc -l
++ grep -e -Dhbase.test
+ ZOMBIE_TESTS_COUNT=0
+ [[ 0 != 0 ]]
+ echo 'We'\''re ok: there is no zombie test'
We're ok: there is no zombie test
POST BUILD TASK : SUCCESS
END OF POST BUILD TASK : 0
Archiving artifacts
No prior successful build to compare, so performing full copy of artifacts

Mime
View raw message