hbase-builds mailing list archives

Site index · List index
Message view « Date » · « Thread »
Top « Date » · « Thread »
From Apache Jenkins Server <jenk...@builds.apache.org>
Subject Build failed in Jenkins: HBase-1.4 » JDK_1_7,Hadoop #613
Date Mon, 06 Feb 2017 23:05:17 GMT
See <https://builds.apache.org/job/HBase-1.4/jdk=JDK_1_7,label=Hadoop/613/changes>

Changes:

[tedyu] HBASE-17601 close() in TableRecordReaderImpl assumes the split has

------------------------------------------
[...truncated 47017 lines...]
[INFO] --- maven-compiler-plugin:2.5.1:testCompile (default-testCompile) @ hbase-rest ---
[INFO] Compiling 39 source files to <https://builds.apache.org/job/HBase-1.4/jdk=JDK_1_7,label=Hadoop/ws/hbase-rest/target/test-classes>
[INFO] 
[INFO] --- maven-surefire-plugin:2.18.1:test (default-test) @ hbase-rest ---
[INFO] Surefire report directory: <https://builds.apache.org/job/HBase-1.4/jdk=JDK_1_7,label=Hadoop/ws/hbase-rest/target/surefire-reports>
[INFO] Using configured provider org.apache.maven.surefire.junitcore.JUnitCoreProvider
[INFO] parallel='none', perCoreThreadCount=true, threadCount=0, useUnlimitedThreads=false,
threadCountSuites=0, threadCountClasses=0, threadCountMethods=0, parallelOptimized=true

-------------------------------------------------------
 T E S T S
-------------------------------------------------------
Running org.apache.hadoop.hbase.rest.TestDeleteRow
Tests run: 2, Failures: 0, Errors: 0, Skipped: 0, Time elapsed: 10.331 sec - in org.apache.hadoop.hbase.rest.TestDeleteRow
Running org.apache.hadoop.hbase.rest.TestResourceFilter
Tests run: 1, Failures: 0, Errors: 0, Skipped: 0, Time elapsed: 1.07 sec - in org.apache.hadoop.hbase.rest.TestResourceFilter
Running org.apache.hadoop.hbase.rest.TestTableResource
Tests run: 8, Failures: 0, Errors: 0, Skipped: 0, Time elapsed: 3.245 sec - in org.apache.hadoop.hbase.rest.TestTableResource
Running org.apache.hadoop.hbase.rest.TestGZIPResponseWrapper
Tests run: 4, Failures: 0, Errors: 0, Skipped: 0, Time elapsed: 0.452 sec - in org.apache.hadoop.hbase.rest.TestGZIPResponseWrapper
Running org.apache.hadoop.hbase.rest.TestVersionResource
Tests run: 7, Failures: 0, Errors: 0, Skipped: 0, Time elapsed: 2.987 sec - in org.apache.hadoop.hbase.rest.TestVersionResource
Running org.apache.hadoop.hbase.rest.TestStatusResource
Tests run: 2, Failures: 0, Errors: 0, Skipped: 0, Time elapsed: 2.499 sec - in org.apache.hadoop.hbase.rest.TestStatusResource
Running org.apache.hadoop.hbase.rest.TestScannersWithFilters
Tests run: 10, Failures: 0, Errors: 0, Skipped: 0, Time elapsed: 5.008 sec - in org.apache.hadoop.hbase.rest.TestScannersWithFilters
Running org.apache.hadoop.hbase.rest.TestScannerResource
Tests run: 5, Failures: 1, Errors: 0, Skipped: 0, Time elapsed: 4.892 sec <<< FAILURE!
- in org.apache.hadoop.hbase.rest.TestScannerResource
testTableDoesNotExist(org.apache.hadoop.hbase.rest.TestScannerResource)  Time elapsed: 0.032
sec  <<< FAILURE!
java.lang.AssertionError: expected:<201> but was:<404>
	at org.junit.Assert.fail(Assert.java:88)
	at org.junit.Assert.failNotEquals(Assert.java:834)
	at org.junit.Assert.assertEquals(Assert.java:645)
	at org.junit.Assert.assertEquals(Assert.java:631)
	at org.apache.hadoop.hbase.rest.TestScannerResource.testTableDoesNotExist(TestScannerResource.java:361)

Tests run: 1, Failures: 1, Errors: 0, Skipped: 0, Time elapsed: 13.283 sec <<< FAILURE!
- in org.apache.hadoop.hbase.rest.TestScannerResource
testTableDoesNotExist(org.apache.hadoop.hbase.rest.TestScannerResource)  Time elapsed: 0.324
sec  <<< FAILURE!
java.lang.AssertionError: expected:<201> but was:<404>
	at org.junit.Assert.fail(Assert.java:88)
	at org.junit.Assert.failNotEquals(Assert.java:834)
	at org.junit.Assert.assertEquals(Assert.java:645)
	at org.junit.Assert.assertEquals(Assert.java:631)
	at org.apache.hadoop.hbase.rest.TestScannerResource.testTableDoesNotExist(TestScannerResource.java:361)

Tests run: 1, Failures: 1, Errors: 0, Skipped: 0, Time elapsed: 22.625 sec <<< FAILURE!
- in org.apache.hadoop.hbase.rest.TestScannerResource
testTableDoesNotExist(org.apache.hadoop.hbase.rest.TestScannerResource)  Time elapsed: 0.266
sec  <<< FAILURE!
java.lang.AssertionError: expected:<201> but was:<404>
	at org.junit.Assert.fail(Assert.java:88)
	at org.junit.Assert.failNotEquals(Assert.java:834)
	at org.junit.Assert.assertEquals(Assert.java:645)
	at org.junit.Assert.assertEquals(Assert.java:631)
	at org.apache.hadoop.hbase.rest.TestScannerResource.testTableDoesNotExist(TestScannerResource.java:361)

Running org.apache.hadoop.hbase.rest.TestMultiRowResource
Tests run: 8, Failures: 0, Errors: 0, Skipped: 0, Time elapsed: 2.991 sec - in org.apache.hadoop.hbase.rest.TestMultiRowResource
Running org.apache.hadoop.hbase.rest.client.TestRemoteTable
Tests run: 9, Failures: 0, Errors: 0, Skipped: 0, Time elapsed: 36.621 sec - in org.apache.hadoop.hbase.rest.client.TestRemoteTable
Running org.apache.hadoop.hbase.rest.client.TestXmlParsing
Tests run: 2, Failures: 0, Errors: 0, Skipped: 0, Time elapsed: 1.009 sec - in org.apache.hadoop.hbase.rest.client.TestXmlParsing
Running org.apache.hadoop.hbase.rest.client.TestRemoteHTableRetries
Tests run: 7, Failures: 0, Errors: 0, Skipped: 0, Time elapsed: 1.643 sec - in org.apache.hadoop.hbase.rest.client.TestRemoteHTableRetries
Running org.apache.hadoop.hbase.rest.client.TestRemoteAdminRetries
Tests run: 7, Failures: 0, Errors: 0, Skipped: 0, Time elapsed: 1.628 sec - in org.apache.hadoop.hbase.rest.client.TestRemoteAdminRetries
Running org.apache.hadoop.hbase.rest.model.TestCellModel
Tests run: 6, Failures: 0, Errors: 0, Skipped: 0, Time elapsed: 1.159 sec - in org.apache.hadoop.hbase.rest.model.TestCellModel
Running org.apache.hadoop.hbase.rest.model.TestTableListModel
Tests run: 6, Failures: 0, Errors: 0, Skipped: 0, Time elapsed: 1.218 sec - in org.apache.hadoop.hbase.rest.model.TestTableListModel
Running org.apache.hadoop.hbase.rest.model.TestVersionModel
Tests run: 6, Failures: 0, Errors: 0, Skipped: 0, Time elapsed: 1.196 sec - in org.apache.hadoop.hbase.rest.model.TestVersionModel
Running org.apache.hadoop.hbase.rest.model.TestRowModel
Tests run: 6, Failures: 0, Errors: 0, Skipped: 0, Time elapsed: 0.542 sec - in org.apache.hadoop.hbase.rest.model.TestRowModel
Running org.apache.hadoop.hbase.rest.model.TestColumnSchemaModel
Tests run: 6, Failures: 0, Errors: 0, Skipped: 0, Time elapsed: 0.559 sec - in org.apache.hadoop.hbase.rest.model.TestColumnSchemaModel
Running org.apache.hadoop.hbase.rest.model.TestTableInfoModel
Tests run: 6, Failures: 0, Errors: 0, Skipped: 0, Time elapsed: 1.208 sec - in org.apache.hadoop.hbase.rest.model.TestTableInfoModel
Running org.apache.hadoop.hbase.rest.model.TestNamespacesModel
Tests run: 6, Failures: 0, Errors: 0, Skipped: 0, Time elapsed: 0.631 sec - in org.apache.hadoop.hbase.rest.model.TestNamespacesModel
Running org.apache.hadoop.hbase.rest.model.TestStorageClusterVersionModel
Tests run: 6, Failures: 0, Errors: 0, Skipped: 0, Time elapsed: 0.535 sec - in org.apache.hadoop.hbase.rest.model.TestStorageClusterVersionModel
Running org.apache.hadoop.hbase.rest.model.TestStorageClusterStatusModel
Tests run: 6, Failures: 0, Errors: 0, Skipped: 0, Time elapsed: 1.303 sec - in org.apache.hadoop.hbase.rest.model.TestStorageClusterStatusModel
Running org.apache.hadoop.hbase.rest.model.TestCellSetModel
Tests run: 6, Failures: 0, Errors: 0, Skipped: 0, Time elapsed: 1.221 sec - in org.apache.hadoop.hbase.rest.model.TestCellSetModel
Running org.apache.hadoop.hbase.rest.model.TestTableSchemaModel
Tests run: 6, Failures: 0, Errors: 0, Skipped: 0, Time elapsed: 1.241 sec - in org.apache.hadoop.hbase.rest.model.TestTableSchemaModel
Running org.apache.hadoop.hbase.rest.model.TestNamespacesInstanceModel
Tests run: 6, Failures: 0, Errors: 0, Skipped: 0, Time elapsed: 0.613 sec - in org.apache.hadoop.hbase.rest.model.TestNamespacesInstanceModel
Running org.apache.hadoop.hbase.rest.model.TestScannerModel
Tests run: 6, Failures: 0, Errors: 0, Skipped: 0, Time elapsed: 1.257 sec - in org.apache.hadoop.hbase.rest.model.TestScannerModel
Running org.apache.hadoop.hbase.rest.model.TestTableRegionModel
Tests run: 8, Failures: 0, Errors: 0, Skipped: 0, Time elapsed: 0.584 sec - in org.apache.hadoop.hbase.rest.model.TestTableRegionModel
Running org.apache.hadoop.hbase.rest.TestScannersWithLabels
Tests run: 2, Failures: 0, Errors: 0, Skipped: 0, Time elapsed: 2.488 sec - in org.apache.hadoop.hbase.rest.TestScannersWithLabels
Running org.apache.hadoop.hbase.rest.TestTableScan
Tests run: 11, Failures: 0, Errors: 0, Skipped: 0, Time elapsed: 12.845 sec - in org.apache.hadoop.hbase.rest.TestTableScan
Running org.apache.hadoop.hbase.rest.TestNamespacesResource
Tests run: 2, Failures: 0, Errors: 0, Skipped: 0, Time elapsed: 9.213 sec - in org.apache.hadoop.hbase.rest.TestNamespacesResource
Running org.apache.hadoop.hbase.rest.TestGzipFilter
Tests run: 2, Failures: 0, Errors: 0, Skipped: 0, Time elapsed: 3.329 sec - in org.apache.hadoop.hbase.rest.TestGzipFilter
Running org.apache.hadoop.hbase.rest.TestGetAndPutResource
Tests run: 21, Failures: 0, Errors: 0, Skipped: 0, Time elapsed: 84.205 sec - in org.apache.hadoop.hbase.rest.TestGetAndPutResource
Running org.apache.hadoop.hbase.rest.TestNamespacesInstanceResource
Tests run: 5, Failures: 0, Errors: 0, Skipped: 0, Time elapsed: 14.046 sec - in org.apache.hadoop.hbase.rest.TestNamespacesInstanceResource
Running org.apache.hadoop.hbase.rest.TestSchemaResource
Tests run: 4, Failures: 0, Errors: 0, Skipped: 0, Time elapsed: 17.522 sec - in org.apache.hadoop.hbase.rest.TestSchemaResource

Results :

Failed tests: 
org.apache.hadoop.hbase.rest.TestScannerResource.testTableDoesNotExist(org.apache.hadoop.hbase.rest.TestScannerResource)
  Run 1: TestScannerResource.testTableDoesNotExist:361 expected:<201> but was:<404>
  Run 2: TestScannerResource.testTableDoesNotExist:361 expected:<201> but was:<404>
  Run 3: TestScannerResource.testTableDoesNotExist:361 expected:<201> but was:<404>


Tests run: 205, Failures: 1, Errors: 0, Skipped: 0

[INFO] ------------------------------------------------------------------------
[INFO] Reactor Summary:
[INFO] 
[INFO] Apache HBase ...................................... SUCCESS [1:41.303s]
[INFO] Apache HBase - Checkstyle ......................... SUCCESS [15.094s]
[INFO] Apache HBase - Resource Bundle .................... SUCCESS [0.297s]
[INFO] Apache HBase - Annotations ........................ SUCCESS [1.554s]
[INFO] Apache HBase - Protocol ........................... SUCCESS [17.094s]
[INFO] Apache HBase - Common ............................. SUCCESS [2:40.838s]
[INFO] Apache HBase - Procedure .......................... SUCCESS [3:38.028s]
[INFO] Apache HBase - Client ............................. SUCCESS [1:44.425s]
[INFO] Apache HBase - Hadoop Compatibility ............... SUCCESS [11.210s]
[INFO] Apache HBase - Hadoop Two Compatibility ........... SUCCESS [19.617s]
[INFO] Apache HBase - Prefix Tree ........................ SUCCESS [11.341s]
[INFO] Apache HBase - Server ............................. SUCCESS [1:27:41.259s]
[INFO] Apache HBase - Testing Util ....................... SUCCESS [2.366s]
[INFO] Apache HBase - Thrift ............................. SUCCESS [3:53.683s]
[INFO] Apache HBase - Rest ............................... FAILURE [7:37.830s]
[INFO] Apache HBase - Shell .............................. SKIPPED
[INFO] Apache HBase - Integration Tests .................. SKIPPED
[INFO] Apache HBase - Examples ........................... SKIPPED
[INFO] Apache HBase - External Block Cache ............... SKIPPED
[INFO] Apache HBase - Assembly ........................... SKIPPED
[INFO] Apache HBase - Shaded ............................. SKIPPED
[INFO] Apache HBase - Shaded - Client .................... SKIPPED
[INFO] Apache HBase - Shaded - Server .................... SKIPPED
[INFO] Apache HBase - Archetypes ......................... SKIPPED
[INFO] Apache HBase - Exemplar for hbase-client archetype  SKIPPED
[INFO] Apache HBase - Exemplar for hbase-shaded-client archetype  SKIPPED
[INFO] Apache HBase - Archetype builder .................. SKIPPED
[INFO] ------------------------------------------------------------------------
[INFO] BUILD FAILURE
[INFO] ------------------------------------------------------------------------
[INFO] Total time: 1:50:47.978s
[INFO] Finished at: Mon Feb 06 23:00:57 UTC 2017
[INFO] Final Memory: 115M/2059M
[INFO] ------------------------------------------------------------------------
[ERROR] Failed to execute goal org.apache.maven.plugins:maven-surefire-plugin:2.18.1:test
(default-test) on project hbase-rest: There are test failures.
[ERROR] 
[ERROR] Please refer to <https://builds.apache.org/job/HBase-1.4/jdk=JDK_1_7,label=Hadoop/ws/hbase-rest/target/surefire-reports>
for the individual test results.
[ERROR] -> [Help 1]
[ERROR] 
[ERROR] To see the full stack trace of the errors, re-run Maven with the -e switch.
[ERROR] Re-run Maven using the -X switch to enable full debug logging.
[ERROR] 
[ERROR] For more information about the errors and possible solutions, please read the following
articles:
[ERROR] [Help 1] http://cwiki.apache.org/confluence/display/MAVEN/MojoFailureException
[ERROR] 
[ERROR] After correcting the problems, you can resume the build with the command
[ERROR]   mvn <goals> -rf :hbase-rest
Build step 'Invoke top-level Maven targets' marked build as failure
Performing Post build task...
Match found for :.* : True
Logical operation result is TRUE
Running script  : # Post-build task script. TODO: Check this in and have all builds reference
check-in.
pwd && ls
# NOTE!!!! The below code has been copied and pasted from ./dev-tools/run-test.sh
# Do not change here without syncing there and vice-versa.
ZOMBIE_TESTS_COUNT=`jps -v | grep surefirebooter | grep -e '-Dhbase.test' | wc -l`
if [[ $ZOMBIE_TESTS_COUNT != 0 ]] ; then
 echo "Suspicious java process found - waiting 30s to see if there are just slow to stop"
 sleep 30
 ZOMBIE_TESTS_COUNT=`jps -v | grep surefirebooter | grep -e '-Dhbase.test' | wc -l`
 if [[ $ZOMBIE_TESTS_COUNT != 0 ]] ; then
   echo " {color:red}There appear to be $ZOMBIE_TESTS_COUNT zombie tests{color}, they should
have been killed by surefire but survived"
   jps -v | grep surefirebooter | grep -e '-Dhbase.test'
   jps -v | grep surefirebooter | grep -e '-Dhbase.test' | cut -d ' ' -f 1 | xargs -n 1 jstack
   # Exit with error
   exit 1
 else
   echo "We're ok: there is no zombie test, but some tests took some time to stop"
 fi
else
  echo "We're ok: there is no zombie test"
fi
Setting JDK_1_7_LATEST__HOME=/home/jenkins/tools/java/latest1.7
Setting JDK_1_8_LATEST__HOME=/home/jenkins/tools/java/latest1.8
[3130e991] $ /bin/bash -xe /tmp/hudson3295708236778112456.sh
+ pwd
<https://builds.apache.org/job/HBase-1.4/jdk=JDK_1_7,label=Hadoop/ws/>
+ ls
bin
CHANGES.txt
conf
dev-support
extra_env_var
hbase-annotations
hbase-archetypes
hbase-assembly
hbase-checkstyle
hbase-client
hbase-common
hbase-examples
hbase-external-blockcache
hbase-hadoop2-compat
hbase-hadoop-compat
hbase-it
hbase-native-client
hbase-prefix-tree
hbase-procedure
hbase-protocol
hbase-resource-bundle
hbase-rest
hbase-server
hbase-shaded
hbase-shell
hbase-testing-util
hbase-thrift
LICENSE.txt
NOTICE.txt
pom.xml
README.txt
src
target
++ jps -v
++ grep surefirebooter
++ grep -e -Dhbase.test
++ wc -l
+ ZOMBIE_TESTS_COUNT=0
+ [[ 0 != 0 ]]
+ echo 'We'\''re ok: there is no zombie test'
We're ok: there is no zombie test
POST BUILD TASK : SUCCESS
END OF POST BUILD TASK : 0
Archiving artifacts
Setting JDK_1_7_LATEST__HOME=/home/jenkins/tools/java/latest1.7
Setting JDK_1_8_LATEST__HOME=/home/jenkins/tools/java/latest1.8
Recording test results
Setting JDK_1_7_LATEST__HOME=/home/jenkins/tools/java/latest1.7
Setting JDK_1_8_LATEST__HOME=/home/jenkins/tools/java/latest1.8
Setting JDK_1_7_LATEST__HOME=/home/jenkins/tools/java/latest1.7
Setting JDK_1_8_LATEST__HOME=/home/jenkins/tools/java/latest1.8

Mime
View raw message