hbase-builds mailing list archives

Site index · List index
Message view « Date » · « Thread »
Top « Date » · « Thread »
From Apache Jenkins Server <jenk...@builds.apache.org>
Subject Build failed in Jenkins: HBase-1.1-JDK8 #1920
Date Sat, 28 Jan 2017 07:33:16 GMT
See <https://builds.apache.org/job/HBase-1.1-JDK8/1920/changes>

Changes:

[apurtell] HBASE-17540 Change SASL server GSSAPI callback log line from DEBUG to

------------------------------------------
[...truncated 3424 lines...]
Java HotSpot(TM) 64-Bit Server VM warning: ignoring option MaxPermSize=256m; support was removed
in 8.0
Java HotSpot(TM) 64-Bit Server VM warning: ignoring option MaxPermSize=256m; support was removed
in 8.0
Java HotSpot(TM) 64-Bit Server VM warning: ignoring option MaxPermSize=256m; support was removed
in 8.0
Java HotSpot(TM) 64-Bit Server VM warning: ignoring option MaxPermSize=256m; support was removed
in 8.0
Running org.apache.hadoop.hbase.filter.TestScanRowPrefix
Java HotSpot(TM) 64-Bit Server VM warning: ignoring option MaxPermSize=256m; support was removed
in 8.0
Java HotSpot(TM) 64-Bit Server VM warning: ignoring option MaxPermSize=256m; support was removed
in 8.0
Java HotSpot(TM) 64-Bit Server VM warning: ignoring option MaxPermSize=256m; support was removed
in 8.0
Tests run: 1, Failures: 0, Errors: 0, Skipped: 0, Time elapsed: 4.633 sec - in org.apache.hadoop.hbase.filter.TestFuzzyRowAndColumnRangeFilter
Java HotSpot(TM) 64-Bit Server VM warning: ignoring option MaxPermSize=256m; support was removed
in 8.0
Running org.apache.hadoop.hbase.filter.TestColumnRangeFilter
Java HotSpot(TM) 64-Bit Server VM warning: ignoring option MaxPermSize=256m; support was removed
in 8.0
Java HotSpot(TM) 64-Bit Server VM warning: ignoring option MaxPermSize=256m; support was removed
in 8.0
Java HotSpot(TM) 64-Bit Server VM warning: ignoring option MaxPermSize=256m; support was removed
in 8.0
Java HotSpot(TM) 64-Bit Server VM warning: ignoring option MaxPermSize=256m; support was removed
in 8.0
Tests run: 1, Failures: 0, Errors: 0, Skipped: 0, Time elapsed: 9.01 sec - in org.apache.hadoop.hbase.filter.TestScanRowPrefix
Java HotSpot(TM) 64-Bit Server VM warning: ignoring option MaxPermSize=256m; support was removed
in 8.0
Tests run: 1, Failures: 0, Errors: 0, Skipped: 0, Time elapsed: 8.632 sec - in org.apache.hadoop.hbase.filter.TestColumnRangeFilter
Java HotSpot(TM) 64-Bit Server VM warning: ignoring option MaxPermSize=256m; support was removed
in 8.0
Java HotSpot(TM) 64-Bit Server VM warning: ignoring option MaxPermSize=256m; support was removed
in 8.0
Java HotSpot(TM) 64-Bit Server VM warning: ignoring option MaxPermSize=256m; support was removed
in 8.0
Java HotSpot(TM) 64-Bit Server VM warning: ignoring option MaxPermSize=256m; support was removed
in 8.0
Java HotSpot(TM) 64-Bit Server VM warning: ignoring option MaxPermSize=256m; support was removed
in 8.0
Java HotSpot(TM) 64-Bit Server VM warning: ignoring option MaxPermSize=256m; support was removed
in 8.0
Java HotSpot(TM) 64-Bit Server VM warning: ignoring option MaxPermSize=256m; support was removed
in 8.0
Running org.apache.hadoop.hbase.mapreduce.TestHFileOutputFormat
Running org.apache.hadoop.hbase.filter.TestFuzzyRowFilterEndToEnd
Running org.apache.hadoop.hbase.filter.TestMultiRowRangeFilter
Running org.apache.hadoop.hbase.filter.TestFilterWrapper
Tests run: 1, Failures: 0, Errors: 0, Skipped: 0, Time elapsed: 6.194 sec - in org.apache.hadoop.hbase.filter.TestFilterWrapper
Java HotSpot(TM) 64-Bit Server VM warning: ignoring option MaxPermSize=256m; support was removed
in 8.0
Running org.apache.hadoop.hbase.mapreduce.TestLoadIncrementalHFilesUseSecurityEndPoint
Tests run: 20, Failures: 0, Errors: 0, Skipped: 0, Time elapsed: 27.601 sec - in org.apache.hadoop.hbase.filter.TestMultiRowRangeFilter
Java HotSpot(TM) 64-Bit Server VM warning: ignoring option MaxPermSize=256m; support was removed
in 8.0
Running org.apache.hadoop.hbase.mapreduce.TestHLogRecordReader
Running org.apache.hadoop.hbase.mapreduce.TestWALPlayer
Tests run: 2, Failures: 0, Errors: 0, Skipped: 0, Time elapsed: 1.241 sec - in org.apache.hadoop.hbase.mapreduce.TestHLogRecordReader
Java HotSpot(TM) 64-Bit Server VM warning: ignoring option MaxPermSize=256m; support was removed
in 8.0
Running org.apache.hadoop.hbase.mapreduce.TestMultiTableInputFormat
Tests run: 4, Failures: 0, Errors: 0, Skipped: 0, Time elapsed: 58.617 sec - in org.apache.hadoop.hbase.mapreduce.TestWALPlayer
Java HotSpot(TM) 64-Bit Server VM warning: ignoring option MaxPermSize=256m; support was removed
in 8.0
Running org.apache.hadoop.hbase.mapreduce.TestImportTSVWithOperationAttributes
Tests run: 2, Failures: 0, Errors: 0, Skipped: 0, Time elapsed: 96.271 sec - in org.apache.hadoop.hbase.mapreduce.TestImportTSVWithOperationAttributes
Java HotSpot(TM) 64-Bit Server VM warning: ignoring option MaxPermSize=256m; support was removed
in 8.0
Java HotSpot(TM) 64-Bit Server VM warning: ignoring option MaxPermSize=256m; support was removed
in 8.0
Tests run: 4, Failures: 0, Errors: 0, Skipped: 0, Time elapsed: 144.609 sec - in org.apache.hadoop.hbase.mapreduce.TestMultiTableInputFormat
Java HotSpot(TM) 64-Bit Server VM warning: ignoring option MaxPermSize=256m; support was removed
in 8.0
Running org.apache.hadoop.hbase.mapreduce.TestWALRecordReader
Tests run: 2, Failures: 0, Errors: 0, Skipped: 0, Time elapsed: 1.368 sec - in org.apache.hadoop.hbase.mapreduce.TestWALRecordReader
Java HotSpot(TM) 64-Bit Server VM warning: ignoring option MaxPermSize=256m; support was removed
in 8.0
Tests run: 4, Failures: 0, Errors: 0, Skipped: 0, Time elapsed: 229.926 sec - in org.apache.hadoop.hbase.filter.TestFuzzyRowFilterEndToEnd
Java HotSpot(TM) 64-Bit Server VM warning: ignoring option MaxPermSize=256m; support was removed
in 8.0
Running org.apache.hadoop.hbase.mapreduce.TestSecureLoadIncrementalHFilesSplitRecovery
Running org.apache.hadoop.hbase.mapreduce.TestTableSnapshotInputFormat
Running org.apache.hadoop.hbase.mapreduce.TestTimeRangeMapRed
Tests run: 5, Failures: 0, Errors: 0, Skipped: 0, Time elapsed: 28.312 sec - in org.apache.hadoop.hbase.mapreduce.TestSecureLoadIncrementalHFilesSplitRecovery
Java HotSpot(TM) 64-Bit Server VM warning: ignoring option MaxPermSize=256m; support was removed
in 8.0
Tests run: 21, Failures: 0, Errors: 0, Skipped: 0, Time elapsed: 259.727 sec - in org.apache.hadoop.hbase.mapreduce.TestLoadIncrementalHFilesUseSecurityEndPoint
Java HotSpot(TM) 64-Bit Server VM warning: ignoring option MaxPermSize=256m; support was removed
in 8.0
Running org.apache.hadoop.hbase.mapreduce.TestImportTSVWithTTLs
Tests run: 1, Failures: 0, Errors: 0, Skipped: 0, Time elapsed: 57.739 sec - in org.apache.hadoop.hbase.mapreduce.TestTimeRangeMapRed
Java HotSpot(TM) 64-Bit Server VM warning: ignoring option MaxPermSize=256m; support was removed
in 8.0
Java HotSpot(TM) 64-Bit Server VM warning: ignoring option MaxPermSize=256m; support was removed
in 8.0
Running org.apache.hadoop.hbase.mapreduce.TestCellCounter
Tests run: 13, Failures: 0, Errors: 0, Skipped: 1, Time elapsed: 317.835 sec - in org.apache.hadoop.hbase.mapreduce.TestHFileOutputFormat
Java HotSpot(TM) 64-Bit Server VM warning: ignoring option MaxPermSize=256m; support was removed
in 8.0
Running org.apache.hadoop.hbase.mapreduce.TestTableInputFormatScan1
Tests run: 1, Failures: 0, Errors: 0, Skipped: 0, Time elapsed: 45.736 sec - in org.apache.hadoop.hbase.mapreduce.TestImportTSVWithTTLs
Java HotSpot(TM) 64-Bit Server VM warning: ignoring option MaxPermSize=256m; support was removed
in 8.0
Running org.apache.hadoop.hbase.mapreduce.TestHRegionPartitioner
Tests run: 1, Failures: 0, Errors: 0, Skipped: 0, Time elapsed: 6.612 sec - in org.apache.hadoop.hbase.mapreduce.TestHRegionPartitioner
Java HotSpot(TM) 64-Bit Server VM warning: ignoring option MaxPermSize=256m; support was removed
in 8.0
Running org.apache.hadoop.hbase.mapreduce.TestLoadIncrementalHFiles
Running org.apache.hadoop.hbase.mapreduce.TestSecureLoadIncrementalHFiles
Tests run: 7, Failures: 0, Errors: 0, Skipped: 0, Time elapsed: 194.044 sec - in org.apache.hadoop.hbase.mapreduce.TestCellCounter
Java HotSpot(TM) 64-Bit Server VM warning: ignoring option MaxPermSize=256m; support was removed
in 8.0
Running org.apache.hadoop.hbase.mapreduce.TestTableInputFormat
Tests run: 7, Failures: 0, Errors: 0, Skipped: 0, Time elapsed: 214.67 sec - in org.apache.hadoop.hbase.mapreduce.TestTableInputFormatScan1
Java HotSpot(TM) 64-Bit Server VM warning: ignoring option MaxPermSize=256m; support was removed
in 8.0
Running org.apache.hadoop.hbase.mapreduce.TestTableInputFormatScan2
Tests run: 8, Failures: 0, Errors: 0, Skipped: 0, Time elapsed: 362.28 sec - in org.apache.hadoop.hbase.mapreduce.TestTableSnapshotInputFormat
Java HotSpot(TM) 64-Bit Server VM warning: ignoring option MaxPermSize=256m; support was removed
in 8.0
Tests run: 8, Failures: 0, Errors: 0, Skipped: 0, Time elapsed: 95.5 sec - in org.apache.hadoop.hbase.mapreduce.TestTableInputFormat
Java HotSpot(TM) 64-Bit Server VM warning: ignoring option MaxPermSize=256m; support was removed
in 8.0
Java HotSpot(TM) 64-Bit Server VM warning: ignoring option MaxPermSize=256m; support was removed
in 8.0
Running org.apache.hadoop.hbase.mapreduce.TestImportExport
Tests run: 21, Failures: 0, Errors: 0, Skipped: 0, Time elapsed: 278.292 sec - in org.apache.hadoop.hbase.mapreduce.TestLoadIncrementalHFiles
Java HotSpot(TM) 64-Bit Server VM warning: ignoring option MaxPermSize=256m; support was removed
in 8.0
Tests run: 21, Failures: 0, Errors: 0, Skipped: 0, Time elapsed: 281.969 sec - in org.apache.hadoop.hbase.mapreduce.TestSecureLoadIncrementalHFiles
Java HotSpot(TM) 64-Bit Server VM warning: ignoring option MaxPermSize=256m; support was removed
in 8.0
Running org.apache.hadoop.hbase.mapreduce.TestRowCounter
Running org.apache.hadoop.hbase.mapreduce.TestLoadIncrementalHFilesSplitRecovery
Running org.apache.hadoop.hbase.mapreduce.TestCopyTable
Tests run: 5, Failures: 0, Errors: 0, Skipped: 0, Time elapsed: 41.134 sec - in org.apache.hadoop.hbase.mapreduce.TestLoadIncrementalHFilesSplitRecovery
Java HotSpot(TM) 64-Bit Server VM warning: ignoring option MaxPermSize=256m; support was removed
in 8.0
Running org.apache.hadoop.hbase.mapreduce.TestHFileOutputFormat2
Tests run: 7, Failures: 0, Errors: 0, Skipped: 0, Time elapsed: 228.057 sec - in org.apache.hadoop.hbase.mapreduce.TestTableInputFormatScan2
Java HotSpot(TM) 64-Bit Server VM warning: ignoring option MaxPermSize=256m; support was removed
in 8.0
Java HotSpot(TM) 64-Bit Server VM warning: ignoring option MaxPermSize=256m; support was removed
in 8.0
Tests run: 5, Failures: 0, Errors: 0, Skipped: 0, Time elapsed: 161.778 sec - in org.apache.hadoop.hbase.mapreduce.TestCopyTable
Java HotSpot(TM) 64-Bit Server VM warning: ignoring option MaxPermSize=256m; support was removed
in 8.0
Running org.apache.hadoop.hbase.mapreduce.TestMultithreadedTableMapper
Tests run: 6, Failures: 0, Errors: 0, Skipped: 0, Time elapsed: 194.285 sec - in org.apache.hadoop.hbase.mapreduce.TestRowCounter
Java HotSpot(TM) 64-Bit Server VM warning: ignoring option MaxPermSize=256m; support was removed
in 8.0
Running org.apache.hadoop.hbase.mapreduce.TestImportTSVWithVisibilityLabels
Running org.apache.hadoop.hbase.mapreduce.TestImportTsv
Tests run: 1, Failures: 0, Errors: 0, Skipped: 0, Time elapsed: 101.799 sec - in org.apache.hadoop.hbase.mapreduce.TestMultithreadedTableMapper
Java HotSpot(TM) 64-Bit Server VM warning: ignoring option MaxPermSize=256m; support was removed
in 8.0
Running org.apache.hadoop.hbase.mapreduce.TestTableMapReduce
Tests run: 13, Failures: 0, Errors: 0, Skipped: 1, Time elapsed: 307.651 sec - in org.apache.hadoop.hbase.mapreduce.TestHFileOutputFormat2
Java HotSpot(TM) 64-Bit Server VM warning: ignoring option MaxPermSize=256m; support was removed
in 8.0
Tests run: 12, Failures: 0, Errors: 0, Skipped: 0, Time elapsed: 403.286 sec - in org.apache.hadoop.hbase.mapreduce.TestImportExport
Tests run: 2, Failures: 0, Errors: 0, Skipped: 0, Time elapsed: 142.836 sec - in org.apache.hadoop.hbase.mapreduce.TestTableMapReduce
Tests run: 7, Failures: 0, Errors: 0, Skipped: 0, Time elapsed: 291.909 sec - in org.apache.hadoop.hbase.mapreduce.TestImportTSVWithVisibilityLabels
Tests run: 11, Failures: 0, Errors: 0, Skipped: 0, Time elapsed: 308.162 sec - in org.apache.hadoop.hbase.mapreduce.TestImportTsv

Results :

Tests in error: 
org.apache.hadoop.hbase.client.TestMetaWithReplicas.testMetaTableReplicaAssignment(org.apache.hadoop.hbase.client.TestMetaWithReplicas)
  Run 1: TestMetaWithReplicas.testMetaTableReplicaAssignment:446 NullPointer
  Run 2: TestMetaWithReplicas.testMetaTableReplicaAssignment:446 NullPointer
  Run 3: TestMetaWithReplicas.testMetaTableReplicaAssignment:446 NullPointer

Flaked tests: 
org.apache.hadoop.hbase.client.TestSnapshotCloneIndependence.testOnlineSnapshotDeleteIndependent(org.apache.hadoop.hbase.client.TestSnapshotCloneIndependence)
  Run 1: TestSnapshotCloneIndependence.testOnlineSnapshotDeleteIndependent:182->runTestSnapshotDeleteIndependent:425
expected:<17576> but was:<14046>
  Run 2: PASS


Tests run: 2530, Failures: 0, Errors: 1, Skipped: 20, Flakes: 1

[INFO] ------------------------------------------------------------------------
[INFO] Reactor Summary:
[INFO] 
[INFO] Apache HBase ....................................... SUCCESS [  6.710 s]
[INFO] Apache HBase - Checkstyle .......................... SUCCESS [  0.895 s]
[INFO] Apache HBase - Resource Bundle ..................... SUCCESS [  0.198 s]
[INFO] Apache HBase - Annotations ......................... SUCCESS [  1.091 s]
[INFO] Apache HBase - Protocol ............................ SUCCESS [ 12.778 s]
[INFO] Apache HBase - Common .............................. SUCCESS [01:18 min]
[INFO] Apache HBase - Procedure ........................... SUCCESS [02:51 min]
[INFO] Apache HBase - Client .............................. SUCCESS [01:19 min]
[INFO] Apache HBase - Hadoop Compatibility ................ SUCCESS [  7.543 s]
[INFO] Apache HBase - Hadoop Two Compatibility ............ SUCCESS [  7.128 s]
[INFO] Apache HBase - Prefix Tree ......................... SUCCESS [  7.967 s]
[INFO] Apache HBase - Server .............................. FAILURE [  01:46 h]
[INFO] Apache HBase - Testing Util ........................ SKIPPED
[INFO] Apache HBase - Thrift .............................. SKIPPED
[INFO] Apache HBase - Rest ................................ SKIPPED
[INFO] Apache HBase - Shell ............................... SKIPPED
[INFO] Apache HBase - Integration Tests ................... SKIPPED
[INFO] Apache HBase - Examples ............................ SKIPPED
[INFO] Apache HBase - Assembly ............................ SKIPPED
[INFO] Apache HBase - Shaded .............................. SKIPPED
[INFO] Apache HBase - Shaded - Client ..................... SKIPPED
[INFO] Apache HBase - Shaded - Server ..................... SKIPPED
[INFO] ------------------------------------------------------------------------
[INFO] BUILD FAILURE
[INFO] ------------------------------------------------------------------------
[INFO] Total time: 01:52 h
[INFO] Finished at: 2017-01-28T07:29:54+00:00
[INFO] Final Memory: 61M/1027M
[INFO] ------------------------------------------------------------------------
[ERROR] Failed to execute goal org.apache.maven.plugins:maven-surefire-plugin:2.18.1:test
(secondPartTestsExecution) on project hbase-server: There are test failures.
[ERROR] 
[ERROR] Please refer to <https://builds.apache.org/job/HBase-1.1-JDK8/ws/hbase-server/target/surefire-reports>
for the individual test results.
[ERROR] -> [Help 1]
[ERROR] 
[ERROR] To see the full stack trace of the errors, re-run Maven with the -e switch.
[ERROR] Re-run Maven using the -X switch to enable full debug logging.
[ERROR] 
[ERROR] For more information about the errors and possible solutions, please read the following
articles:
[ERROR] [Help 1] http://cwiki.apache.org/confluence/display/MAVEN/MojoFailureException
[ERROR] 
[ERROR] After correcting the problems, you can resume the build with the command
[ERROR]   mvn <goals> -rf :hbase-server
Build step 'Invoke top-level Maven targets' marked build as failure
Performing Post build task...
Match found for :.* : True
Logical operation result is TRUE
Running script  : # Post-build task script. TODO: Check this in and have all builds reference
check-in.
pwd && ls
# NOTE!!!! The below code has been copied and pasted from ./dev-tools/run-test.sh
# Do not change here without syncing there and vice-versa.
ZOMBIE_TESTS_COUNT=`jps -v | grep surefirebooter | grep -e '-Dhbase.test' | wc -l`
if [[ $ZOMBIE_TESTS_COUNT != 0 ]] ; then
 echo "Suspicious java process found - waiting 30s to see if there are just slow to stop"
 sleep 30
 ZOMBIE_TESTS_COUNT=`jps -v | grep surefirebooter | grep -e '-Dhbase.test' | wc -l`
 if [[ $ZOMBIE_TESTS_COUNT != 0 ]] ; then
   echo " {color:red}There appear to be $ZOMBIE_TESTS_COUNT zombie tests{color}, they should
have been killed by surefire but survived"
   jps -v | grep surefirebooter | grep -e '-Dhbase.test'
   jps -v | grep surefirebooter | grep -e '-Dhbase.test' | cut -d ' ' -f 1 | xargs -n 1 jstack
   # Exit with error
   exit 1
 else
   echo "We're ok: there is no zombie test, but some tests took some time to stop"
 fi
else
  echo "We're ok: there is no zombie test"
fi
[HBase-1.1-JDK8] $ /bin/bash -xe /tmp/hudson2632391670556573905.sh
+ pwd
<https://builds.apache.org/job/HBase-1.1-JDK8/ws/>
+ ls
bin
CHANGES.txt
conf
dev-support
hbase-annotations
hbase-assembly
hbase-checkstyle
hbase-client
hbase-common
hbase-examples
hbase-hadoop2-compat
hbase-hadoop-compat
hbase-it
hbase-native-client
hbase-prefix-tree
hbase-procedure
hbase-protocol
hbase-resource-bundle
hbase-rest
hbase-server
hbase-shaded
hbase-shell
hbase-testing-util
hbase-thrift
LICENSE.txt
NOTICE.txt
pom.xml
README.txt
src
target
++ jps -v
++ grep surefirebooter
++ grep -e -Dhbase.test
++ wc -l
+ ZOMBIE_TESTS_COUNT=0
+ [[ 0 != 0 ]]
+ echo 'We'\''re ok: there is no zombie test'
We're ok: there is no zombie test
POST BUILD TASK : SUCCESS
END OF POST BUILD TASK : 0
Archiving artifacts
Recording test results
Updating HBASE-17540

Mime
View raw message