hbase-builds mailing list archives

Site index · List index
Message view « Date » · « Thread »
Top « Date » · « Thread »
From Apache Jenkins Server <jenk...@builds.apache.org>
Subject Build failed in Jenkins: HBase-1.2-IT » IntegrationTestBigLinkedList,JDK 1.8 (latest),Hadoop #585
Date Mon, 23 Jan 2017 23:35:39 GMT
See <https://builds.apache.org/job/HBase-1.2-IT/it.test=IntegrationTestBigLinkedList,jdk=JDK%201.8%20(latest),label=Hadoop/585/changes>

Changes:

[stack] HBASE-17357 FIX PerformanceEvaluation parameters parsing triggers NPE.

------------------------------------------
[...truncated 28717 lines...]
1295/1479 KB   
1299/1479 KB   
1303/1479 KB   
1307/1479 KB   
1311/1479 KB   
1315/1479 KB   
1319/1479 KB   
1323/1479 KB   
1327/1479 KB   
1331/1479 KB   
1335/1479 KB   
1339/1479 KB   
1343/1479 KB   
1347/1479 KB   
1351/1479 KB   
1355/1479 KB   
1359/1479 KB   
1363/1479 KB   
1367/1479 KB   
1371/1479 KB   
1375/1479 KB   
1379/1479 KB   
1383/1479 KB   
1387/1479 KB   
1391/1479 KB   
1395/1479 KB   
1399/1479 KB   
1403/1479 KB   
1407/1479 KB   
1411/1479 KB   
1415/1479 KB   
1419/1479 KB   
1423/1479 KB   
1427/1479 KB   
1431/1479 KB   
1435/1479 KB   
1439/1479 KB   
1443/1479 KB   
1447/1479 KB   
1451/1479 KB   
1455/1479 KB   
1459/1479 KB   
1463/1479 KB   
1467/1479 KB   
1471/1479 KB   
1475/1479 KB   
1479/1479 KB   
1479/1479 KB   
               
Downloaded: http://repo.maven.apache.org/maven2/org/apache/ant/ant/1.8.1/ant-1.8.1.jar (1479
KB at 26406.8 KB/sec)
[INFO] Executing tasks

main:
     [exec] bash: /home/jenkins/jenkins-slave/workspace/HBase-1.2-IT/it.test/IntegrationTestBigLinkedList/jdk/JDK:
No such file or directory
     [exec] Result: 127
[INFO] Executed tasks
[INFO] 
[INFO] --- build-helper-maven-plugin:1.9.1:add-source (versionInfo-source) @ hbase-common
---
[INFO] Source directory: <https://builds.apache.org/job/HBase-1.2-IT/it.test=IntegrationTestBigLinkedList,jdk=JDK%201.8%20(latest),label=Hadoop/ws/hbase-common/target/generated-sources/java>
added.
[INFO] 
[INFO] --- maven-remote-resources-plugin:1.5:process (default) @ hbase-common ---
[INFO] 
[INFO] --- maven-resources-plugin:2.6:resources (default-resources) @ hbase-common ---
[INFO] Using 'UTF-8' encoding to copy filtered resources.
[INFO] Copying 1 resource
[INFO] Copying 3 resources
[INFO] 
[INFO] --- maven-antrun-plugin:1.6:run (default) @ hbase-common ---
[INFO] Executing tasks

main:
[INFO] Executed tasks
[INFO] 
[INFO] --- maven-compiler-plugin:2.5.1:compile (default-compile) @ hbase-common ---
[INFO] Compiling 193 source files to <https://builds.apache.org/job/HBase-1.2-IT/it.test=IntegrationTestBigLinkedList,jdk=JDK%201.8%20(latest),label=Hadoop/ws/hbase-common/target/classes>
[INFO] -------------------------------------------------------------
[ERROR] COMPILATION ERROR : 
[INFO] -------------------------------------------------------------
[ERROR] <https://builds.apache.org/job/HBase-1.2-IT/it.test=IntegrationTestBigLinkedList,jdk=JDK%201.8%20(latest),label=Hadoop/ws/hbase-common/src/main/java/org/apache/hadoop/hbase/util/UnsafeAccess.java>:[30,15]
Unsafe is internal proprietary API and may be removed in a future release
[ERROR] <https://builds.apache.org/job/HBase-1.2-IT/it.test=IntegrationTestBigLinkedList,jdk=JDK%201.8%20(latest),label=Hadoop/ws/hbase-common/src/main/java/org/apache/hadoop/hbase/util/Bytes.java>:[49,15]
Unsafe is internal proprietary API and may be removed in a future release
[ERROR] <https://builds.apache.org/job/HBase-1.2-IT/it.test=IntegrationTestBigLinkedList,jdk=JDK%201.8%20(latest),label=Hadoop/ws/hbase-common/src/main/java/org/apache/hadoop/hbase/util/VersionInfo.java>:[26,30]
error: cannot find symbol
[ERROR]   symbol:   class Version
  location: package org.apache.hadoop.hbase
warning: unknown enum constant When.ALWAYS
  reason: class file for javax.annotation.meta.When not found
<https://builds.apache.org/job/HBase-1.2-IT/it.test=IntegrationTestBigLinkedList,jdk=JDK%201.8%20(latest),label=Hadoop/ws/hbase-common/src/main/java/org/apache/hadoop/hbase/util/UnsafeAccess.java>:[40,22]
Unsafe is internal proprietary API and may be removed in a future release
[ERROR] <https://builds.apache.org/job/HBase-1.2-IT/it.test=IntegrationTestBigLinkedList,jdk=JDK%201.8%20(latest),label=Hadoop/ws/hbase-common/src/main/java/org/apache/hadoop/hbase/util/UnsafeAccess.java>:[46,17]
Unsafe is internal proprietary API and may be removed in a future release
[ERROR] <https://builds.apache.org/job/HBase-1.2-IT/it.test=IntegrationTestBigLinkedList,jdk=JDK%201.8%20(latest),label=Hadoop/ws/hbase-common/src/main/java/org/apache/hadoop/hbase/util/UnsafeAccess.java>:[50,20]
Unsafe is internal proprietary API and may be removed in a future release
[ERROR] <https://builds.apache.org/job/HBase-1.2-IT/it.test=IntegrationTestBigLinkedList,jdk=JDK%201.8%20(latest),label=Hadoop/ws/hbase-common/src/main/java/org/apache/hadoop/hbase/util/Bytes.java>:[1318,19]
Unsafe is internal proprietary API and may be removed in a future release
[ERROR] <https://builds.apache.org/job/HBase-1.2-IT/it.test=IntegrationTestBigLinkedList,jdk=JDK%201.8%20(latest),label=Hadoop/ws/hbase-common/src/main/java/org/apache/hadoop/hbase/util/VersionInfo.java>:[43,11]
error: cannot find symbol
[ERROR]   symbol:   variable Version
  location: class VersionInfo
<https://builds.apache.org/job/HBase-1.2-IT/it.test=IntegrationTestBigLinkedList,jdk=JDK%201.8%20(latest),label=Hadoop/ws/hbase-common/src/main/java/org/apache/hadoop/hbase/util/VersionInfo.java>:[51,11]
error: cannot find symbol
[ERROR]   symbol:   variable Version
  location: class VersionInfo
<https://builds.apache.org/job/HBase-1.2-IT/it.test=IntegrationTestBigLinkedList,jdk=JDK%201.8%20(latest),label=Hadoop/ws/hbase-common/src/main/java/org/apache/hadoop/hbase/util/VersionInfo.java>:[59,11]
error: cannot find symbol
[ERROR]   symbol:   variable Version
  location: class VersionInfo
<https://builds.apache.org/job/HBase-1.2-IT/it.test=IntegrationTestBigLinkedList,jdk=JDK%201.8%20(latest),label=Hadoop/ws/hbase-common/src/main/java/org/apache/hadoop/hbase/util/VersionInfo.java>:[67,11]
error: cannot find symbol
[ERROR]   symbol:   variable Version
  location: class VersionInfo
<https://builds.apache.org/job/HBase-1.2-IT/it.test=IntegrationTestBigLinkedList,jdk=JDK%201.8%20(latest),label=Hadoop/ws/hbase-common/src/main/java/org/apache/hadoop/hbase/util/VersionInfo.java>:[75,11]
error: cannot find symbol
[ERROR]   symbol:   variable Version
  location: class VersionInfo
<https://builds.apache.org/job/HBase-1.2-IT/it.test=IntegrationTestBigLinkedList,jdk=JDK%201.8%20(latest),label=Hadoop/ws/hbase-common/src/main/java/org/apache/hadoop/hbase/util/VersionInfo.java>:[92,11]
error: cannot find symbol
[INFO] 13 errors 
[INFO] -------------------------------------------------------------
[INFO] ------------------------------------------------------------------------
[INFO] Reactor Summary:
[INFO] 
[INFO] Apache HBase ...................................... SUCCESS [1:49.886s]
[INFO] Apache HBase - Checkstyle ......................... SUCCESS [7.499s]
[INFO] Apache HBase - Resource Bundle .................... SUCCESS [0.241s]
[INFO] Apache HBase - Annotations ........................ SUCCESS [1.207s]
[INFO] Apache HBase - Protocol ........................... SUCCESS [18.536s]
[INFO] Apache HBase - Common ............................. FAILURE [1:36.247s]
[INFO] Apache HBase - Procedure .......................... SKIPPED
[INFO] Apache HBase - Client ............................. SKIPPED
[INFO] Apache HBase - Hadoop Compatibility ............... SKIPPED
[INFO] Apache HBase - Hadoop Two Compatibility ........... SKIPPED
[INFO] Apache HBase - Prefix Tree ........................ SKIPPED
[INFO] Apache HBase - Server ............................. SKIPPED
[INFO] Apache HBase - Testing Util ....................... SKIPPED
[INFO] Apache HBase - Thrift ............................. SKIPPED
[INFO] Apache HBase - Rest ............................... SKIPPED
[INFO] Apache HBase - Shell .............................. SKIPPED
[INFO] Apache HBase - Integration Tests .................. SKIPPED
[INFO] Apache HBase - Examples ........................... SKIPPED
[INFO] Apache HBase - External Block Cache ............... SKIPPED
[INFO] Apache HBase - Assembly ........................... SKIPPED
[INFO] Apache HBase - Shaded ............................. SKIPPED
[INFO] Apache HBase - Shaded - Client .................... SKIPPED
[INFO] Apache HBase - Shaded - Server .................... SKIPPED
[INFO] ------------------------------------------------------------------------
[INFO] BUILD FAILURE
[INFO] ------------------------------------------------------------------------
[INFO] Total time: 4:24.932s
[INFO] Finished at: Mon Jan 23 23:35:37 UTC 2017
[INFO] Final Memory: 63M/948M
[INFO] ------------------------------------------------------------------------
[ERROR] Failed to execute goal org.apache.maven.plugins:maven-compiler-plugin:2.5.1:compile
(default-compile) on project hbase-common: Compilation failure: Compilation failure:
[ERROR] <https://builds.apache.org/job/HBase-1.2-IT/it.test=IntegrationTestBigLinkedList,jdk=JDK%201.8%20(latest),label=Hadoop/ws/hbase-common/src/main/java/org/apache/hadoop/hbase/util/UnsafeAccess.java>:[30,15]
Unsafe is internal proprietary API and may be removed in a future release
[ERROR] <https://builds.apache.org/job/HBase-1.2-IT/it.test=IntegrationTestBigLinkedList,jdk=JDK%201.8%20(latest),label=Hadoop/ws/hbase-common/src/main/java/org/apache/hadoop/hbase/util/Bytes.java>:[49,15]
Unsafe is internal proprietary API and may be removed in a future release
[ERROR] <https://builds.apache.org/job/HBase-1.2-IT/it.test=IntegrationTestBigLinkedList,jdk=JDK%201.8%20(latest),label=Hadoop/ws/hbase-common/src/main/java/org/apache/hadoop/hbase/util/VersionInfo.java>:[26,30]
error: cannot find symbol
[ERROR] symbol:   class Version
[ERROR] location: package org.apache.hadoop.hbase
[ERROR] warning: unknown enum constant When.ALWAYS
[ERROR] reason: class file for javax.annotation.meta.When not found
[ERROR] <https://builds.apache.org/job/HBase-1.2-IT/it.test=IntegrationTestBigLinkedList,jdk=JDK%201.8%20(latest),label=Hadoop/ws/hbase-common/src/main/java/org/apache/hadoop/hbase/util/UnsafeAccess.java>:[40,22]
Unsafe is internal proprietary API and may be removed in a future release
[ERROR] <https://builds.apache.org/job/HBase-1.2-IT/it.test=IntegrationTestBigLinkedList,jdk=JDK%201.8%20(latest),label=Hadoop/ws/hbase-common/src/main/java/org/apache/hadoop/hbase/util/UnsafeAccess.java>:[46,17]
Unsafe is internal proprietary API and may be removed in a future release
[ERROR] <https://builds.apache.org/job/HBase-1.2-IT/it.test=IntegrationTestBigLinkedList,jdk=JDK%201.8%20(latest),label=Hadoop/ws/hbase-common/src/main/java/org/apache/hadoop/hbase/util/UnsafeAccess.java>:[50,20]
Unsafe is internal proprietary API and may be removed in a future release
[ERROR] <https://builds.apache.org/job/HBase-1.2-IT/it.test=IntegrationTestBigLinkedList,jdk=JDK%201.8%20(latest),label=Hadoop/ws/hbase-common/src/main/java/org/apache/hadoop/hbase/util/Bytes.java>:[1318,19]
Unsafe is internal proprietary API and may be removed in a future release
[ERROR] <https://builds.apache.org/job/HBase-1.2-IT/it.test=IntegrationTestBigLinkedList,jdk=JDK%201.8%20(latest),label=Hadoop/ws/hbase-common/src/main/java/org/apache/hadoop/hbase/util/VersionInfo.java>:[43,11]
error: cannot find symbol
[ERROR] symbol:   variable Version
[ERROR] location: class VersionInfo
[ERROR] <https://builds.apache.org/job/HBase-1.2-IT/it.test=IntegrationTestBigLinkedList,jdk=JDK%201.8%20(latest),label=Hadoop/ws/hbase-common/src/main/java/org/apache/hadoop/hbase/util/VersionInfo.java>:[51,11]
error: cannot find symbol
[ERROR] symbol:   variable Version
[ERROR] location: class VersionInfo
[ERROR] <https://builds.apache.org/job/HBase-1.2-IT/it.test=IntegrationTestBigLinkedList,jdk=JDK%201.8%20(latest),label=Hadoop/ws/hbase-common/src/main/java/org/apache/hadoop/hbase/util/VersionInfo.java>:[59,11]
error: cannot find symbol
[ERROR] symbol:   variable Version
[ERROR] location: class VersionInfo
[ERROR] <https://builds.apache.org/job/HBase-1.2-IT/it.test=IntegrationTestBigLinkedList,jdk=JDK%201.8%20(latest),label=Hadoop/ws/hbase-common/src/main/java/org/apache/hadoop/hbase/util/VersionInfo.java>:[67,11]
error: cannot find symbol
[ERROR] symbol:   variable Version
[ERROR] location: class VersionInfo
[ERROR] <https://builds.apache.org/job/HBase-1.2-IT/it.test=IntegrationTestBigLinkedList,jdk=JDK%201.8%20(latest),label=Hadoop/ws/hbase-common/src/main/java/org/apache/hadoop/hbase/util/VersionInfo.java>:[75,11]
error: cannot find symbol
[ERROR] symbol:   variable Version
[ERROR] location: class VersionInfo
[ERROR] <https://builds.apache.org/job/HBase-1.2-IT/it.test=IntegrationTestBigLinkedList,jdk=JDK%201.8%20(latest),label=Hadoop/ws/hbase-common/src/main/java/org/apache/hadoop/hbase/util/VersionInfo.java>:[92,11]
error: cannot find symbol
[ERROR] -> [Help 1]
[ERROR] 
[ERROR] To see the full stack trace of the errors, re-run Maven with the -e switch.
[ERROR] Re-run Maven using the -X switch to enable full debug logging.
[ERROR] 
[ERROR] For more information about the errors and possible solutions, please read the following
articles:
[ERROR] [Help 1] http://cwiki.apache.org/confluence/display/MAVEN/MojoFailureException
[ERROR] 
[ERROR] After correcting the problems, you can resume the build with the command
[ERROR]   mvn <goals> -rf :hbase-common
Build step 'Invoke top-level Maven targets' marked build as failure
Performing Post build task...
Match found for :.* : True
Logical operation result is TRUE
Running script  : # Post-build task script. TODO: Check this in and have all builds reference
check-in.
pwd && ls
# NOTE!!!! The below code has been copied and pasted from ./dev-tools/run-test.sh
# Do not change here without syncing there and vice-versa.
ZOMBIE_TESTS_COUNT=`jps -v | grep surefirebooter | grep -e '-Dhbase.test' | wc -l`
if [[ $ZOMBIE_TESTS_COUNT != 0 ]] ; then
 echo "Suspicious java process found - waiting 30s to see if there are just slow to stop"
 sleep 30
 ZOMBIE_TESTS_COUNT=`jps -v | grep surefirebooter | grep -e '-Dhbase.test' | wc -l`
 if [[ $ZOMBIE_TESTS_COUNT != 0 ]] ; then
   echo " {color:red}There appear to be $ZOMBIE_TESTS_COUNT zombie tests{color}, they should
have been killed by surefire but survived"
   jps -v | grep surefirebooter | grep -e '-Dhbase.test'
   jps -v | grep surefirebooter | grep -e '-Dhbase.test' | cut -d ' ' -f 1 | xargs -n 1 jstack
   # Exit with error
   exit 1
 else
   echo "We're ok: there is no zombie test, but some tests took some time to stop"
 fi
else
  echo "We're ok: there is no zombie test"
fi
[Hadoop] $ /bin/bash -xe /tmp/hudson6256384273114310387.sh
+ pwd
<https://builds.apache.org/job/HBase-1.2-IT/it.test=IntegrationTestBigLinkedList,jdk=JDK%201.8%20(latest),label=Hadoop/ws/>
+ ls
bin
CHANGES.txt
conf
dev-support
hbase-annotations
hbase-assembly
hbase-checkstyle
hbase-client
hbase-common
hbase-examples
hbase-external-blockcache
hbase-hadoop2-compat
hbase-hadoop-compat
hbase-it
hbase-native-client
hbase-prefix-tree
hbase-procedure
hbase-protocol
hbase-resource-bundle
hbase-rest
hbase-server
hbase-shaded
hbase-shell
hbase-testing-util
hbase-thrift
LICENSE.txt
NOTICE.txt
pom.xml
README.txt
src
target
++ jps -v
++ grep surefirebooter
++ wc -l
++ grep -e -Dhbase.test
+ ZOMBIE_TESTS_COUNT=0
+ [[ 0 != 0 ]]
+ echo 'We'\''re ok: there is no zombie test'
We're ok: there is no zombie test
POST BUILD TASK : SUCCESS
END OF POST BUILD TASK : 0
Archiving artifacts

Mime
View raw message