hbase-builds mailing list archives

Site index · List index
Message view « Date » · « Thread »
Top « Date » · « Thread »
From Apache Jenkins Server <jenk...@builds.apache.org>
Subject Build failed in Jenkins: HBase-1.4 » JDK_1_7,Hadoop #566
Date Thu, 15 Dec 2016 13:56:31 GMT
See <https://builds.apache.org/job/HBase-1.4/jdk=JDK_1_7,label=Hadoop/566/changes>

Changes:

[yangzhe1991] HBASE-17296 Provide per peer throttling for replication

------------------------------------------
[...truncated 47086 lines...]
[INFO] --- maven-enforcer-plugin:1.4.1:enforce (min-maven-min-java-banned-xerces) @ hbase-thrift
---
[INFO] 
[INFO] --- maven-enforcer-plugin:1.4.1:enforce (banned-jsr305) @ hbase-thrift ---
[INFO] 
[INFO] --- buildnumber-maven-plugin:1.3:create-timestamp (default) @ hbase-thrift ---
[INFO] 
[INFO] --- maven-antrun-plugin:1.6:run (generate) @ hbase-thrift ---
[INFO] Executing tasks

main:
    [mkdir] Created dir: <https://builds.apache.org/job/HBase-1.4/jdk=JDK_1_7,label=Hadoop/ws/hbase-thrift/target/hbase-webapps>
     [copy] Copying 17 files to <https://builds.apache.org/job/HBase-1.4/jdk=JDK_1_7,label=Hadoop/ws/hbase-thrift/target/hbase-webapps>
log4j:WARN No appenders could be found for logger (org.mortbay.log).
log4j:WARN Please initialize the log4j system properly.
log4j:WARN See http://logging.apache.org/log4j/1.2/faq.html#noconfig for more info.
    [mkdir] Created dir: <https://builds.apache.org/job/HBase-1.4/jdk=JDK_1_7,label=Hadoop/ws/hbase-thrift/target/hbase-webapps/thrift/WEB-INF>
[INFO] Executed tasks
[INFO] 
[INFO] --- build-helper-maven-plugin:1.9.1:add-source (jspcSource-packageInfo-source) @ hbase-thrift
---
[INFO] Source directory: <https://builds.apache.org/job/HBase-1.4/jdk=JDK_1_7,label=Hadoop/ws/hbase-thrift/target/generated-sources/java>
added.
[INFO] 
[INFO] --- maven-remote-resources-plugin:1.5:process (process-resource-bundles) @ hbase-thrift
---
[INFO] 
[INFO] --- maven-resources-plugin:2.7:resources (default-resources) @ hbase-thrift ---
[INFO] Using 'UTF-8' encoding to copy filtered resources.
[INFO] Copying 18 resources
[INFO] Copying 3 resources
[INFO] 
[INFO] --- maven-compiler-plugin:2.5.1:compile (default-compile) @ hbase-thrift ---
[INFO] Compiling 54 source files to <https://builds.apache.org/job/HBase-1.4/jdk=JDK_1_7,label=Hadoop/ws/hbase-thrift/target/classes>
[INFO] 
[INFO] --- maven-dependency-plugin:2.10:build-classpath (create-mrapp-generated-classpath)
@ hbase-thrift ---
[INFO] Wrote classpath file '<https://builds.apache.org/job/HBase-1.4/jdk=JDK_1_7,label=Hadoop/ws/hbase-thrift/target/test-classes/mrapp-generated-classpath'.>
[INFO] 
[INFO] --- maven-resources-plugin:2.7:testResources (default-testResources) @ hbase-thrift
---
[INFO] Using 'UTF-8' encoding to copy filtered resources.
[INFO] Copying 2 resources to META-INF/
[INFO] Copying 3 resources
[INFO] Copying 3 resources
[INFO] 
[INFO] --- maven-compiler-plugin:2.5.1:testCompile (default-testCompile) @ hbase-thrift ---
[INFO] Compiling 6 source files to <https://builds.apache.org/job/HBase-1.4/jdk=JDK_1_7,label=Hadoop/ws/hbase-thrift/target/test-classes>
[INFO] 
[INFO] --- maven-surefire-plugin:2.18.1:test (default-test) @ hbase-thrift ---
[INFO] Surefire report directory: <https://builds.apache.org/job/HBase-1.4/jdk=JDK_1_7,label=Hadoop/ws/hbase-thrift/target/surefire-reports>
[INFO] Using configured provider org.apache.maven.surefire.junitcore.JUnitCoreProvider
[INFO] parallel='none', perCoreThreadCount=true, threadCount=0, useUnlimitedThreads=false,
threadCountSuites=0, threadCountClasses=0, threadCountMethods=0, parallelOptimized=true

-------------------------------------------------------
 T E S T S
-------------------------------------------------------
Running org.apache.hadoop.hbase.thrift.TestThriftHttpServer
Tests run: 2, Failures: 0, Errors: 1, Skipped: 0, Time elapsed: 604.3 sec <<< FAILURE!
- in org.apache.hadoop.hbase.thrift.TestThriftHttpServer
testRunThriftServerWithHeaderBufferLength(org.apache.hadoop.hbase.thrift.TestThriftHttpServer)
 Time elapsed: 600.014 sec  <<< ERROR!
org.junit.runners.model.TestTimedOutException: test timed out after 600000 milliseconds
	at java.net.SocketInputStream.socketRead0(Native Method)
	at java.net.SocketInputStream.read(SocketInputStream.java:152)
	at java.net.SocketInputStream.read(SocketInputStream.java:122)
	at java.io.BufferedInputStream.fill(BufferedInputStream.java:235)
	at java.io.BufferedInputStream.read1(BufferedInputStream.java:275)
	at java.io.BufferedInputStream.read(BufferedInputStream.java:334)
	at sun.net.www.http.HttpClient.parseHTTPHeader(HttpClient.java:690)
	at sun.net.www.http.HttpClient.parseHTTP(HttpClient.java:633)
	at sun.net.www.protocol.http.HttpURLConnection.getInputStream(HttpURLConnection.java:1324)
	at java.net.HttpURLConnection.getResponseCode(HttpURLConnection.java:468)
	at org.apache.thrift.transport.THttpClient.flush(THttpClient.java:347)
	at org.apache.thrift.TServiceClient.sendBase(TServiceClient.java:73)
	at org.apache.thrift.TServiceClient.sendBase(TServiceClient.java:62)
	at org.apache.hadoop.hbase.thrift.generated.Hbase$Client.send_getTableNames(Hbase.java:901)
	at org.apache.hadoop.hbase.thrift.generated.Hbase$Client.getTableNames(Hbase.java:894)
	at org.apache.hadoop.hbase.thrift.TestThriftServer.checkTableList(TestThriftServer.java:240)
	at org.apache.hadoop.hbase.thrift.TestThriftHttpServer.talkToThriftServer(TestThriftHttpServer.java:187)
	at org.apache.hadoop.hbase.thrift.TestThriftHttpServer.runThriftServer(TestThriftHttpServer.java:147)
	at org.apache.hadoop.hbase.thrift.TestThriftHttpServer.testRunThriftServerWithHeaderBufferLength(TestThriftHttpServer.java:113)

Tests run: 1, Failures: 0, Errors: 1, Skipped: 0, Time elapsed: 620.522 sec <<< FAILURE!
- in org.apache.hadoop.hbase.thrift.TestThriftHttpServer
testRunThriftServerWithHeaderBufferLength(org.apache.hadoop.hbase.thrift.TestThriftHttpServer)
 Time elapsed: 10.153 sec  <<< ERROR!
java.lang.NullPointerException: null
	at org.apache.hadoop.hbase.util.JvmPauseMonitor.stop(JvmPauseMonitor.java:93)
	at org.apache.hadoop.hbase.thrift.ThriftServerRunner.shutdown(ThriftServerRunner.java:373)
	at org.apache.hadoop.hbase.thrift.ThriftServer.stop(ThriftServer.java:221)
	at org.apache.hadoop.hbase.thrift.TestThriftHttpServer.stopHttpServerThread(TestThriftHttpServer.java:195)
	at org.apache.hadoop.hbase.thrift.TestThriftHttpServer.runThriftServer(TestThriftHttpServer.java:151)
	at org.apache.hadoop.hbase.thrift.TestThriftHttpServer.testRunThriftServerWithHeaderBufferLength(TestThriftHttpServer.java:113)

Tests run: 1, Failures: 0, Errors: 1, Skipped: 0, Time elapsed: 636.634 sec <<< FAILURE!
- in org.apache.hadoop.hbase.thrift.TestThriftHttpServer
testRunThriftServerWithHeaderBufferLength(org.apache.hadoop.hbase.thrift.TestThriftHttpServer)
 Time elapsed: 10.049 sec  <<< ERROR!
java.lang.NullPointerException: null
	at org.apache.hadoop.hbase.util.JvmPauseMonitor.stop(JvmPauseMonitor.java:93)
	at org.apache.hadoop.hbase.thrift.ThriftServerRunner.shutdown(ThriftServerRunner.java:373)
	at org.apache.hadoop.hbase.thrift.ThriftServer.stop(ThriftServer.java:221)
	at org.apache.hadoop.hbase.thrift.TestThriftHttpServer.stopHttpServerThread(TestThriftHttpServer.java:195)
	at org.apache.hadoop.hbase.thrift.TestThriftHttpServer.runThriftServer(TestThriftHttpServer.java:151)
	at org.apache.hadoop.hbase.thrift.TestThriftHttpServer.testRunThriftServerWithHeaderBufferLength(TestThriftHttpServer.java:113)

Running org.apache.hadoop.hbase.thrift.TestThriftServerCmdLine
Tests run: 32, Failures: 0, Errors: 0, Skipped: 0, Time elapsed: 51.653 sec - in org.apache.hadoop.hbase.thrift.TestThriftServerCmdLine
Running org.apache.hadoop.hbase.thrift.TestThriftServer
Tests run: 1, Failures: 0, Errors: 0, Skipped: 0, Time elapsed: 72.407 sec - in org.apache.hadoop.hbase.thrift.TestThriftServer
Running org.apache.hadoop.hbase.thrift.TestCallQueue
Tests run: 18, Failures: 0, Errors: 0, Skipped: 0, Time elapsed: 0.449 sec - in org.apache.hadoop.hbase.thrift.TestCallQueue
Running org.apache.hadoop.hbase.thrift2.TestThriftHBaseServiceHandler
Tests run: 24, Failures: 0, Errors: 0, Skipped: 0, Time elapsed: 38.164 sec - in org.apache.hadoop.hbase.thrift2.TestThriftHBaseServiceHandler
Running org.apache.hadoop.hbase.thrift2.TestThriftHBaseServiceHandlerWithLabels
Tests run: 6, Failures: 0, Errors: 0, Skipped: 0, Time elapsed: 1.488 sec - in org.apache.hadoop.hbase.thrift2.TestThriftHBaseServiceHandlerWithLabels

Results :

Tests in error: 
org.apache.hadoop.hbase.thrift.TestThriftHttpServer.testRunThriftServerWithHeaderBufferLength(org.apache.hadoop.hbase.thrift.TestThriftHttpServer)
  Run 1: TestThriftHttpServer.testRunThriftServerWithHeaderBufferLength:113->runThriftServer:147->talkToThriftServer:187
» TestTimedOut
  Run 2: TestThriftHttpServer.testRunThriftServerWithHeaderBufferLength:113->runThriftServer:151->stopHttpServerThread:195
» NullPointer
  Run 3: TestThriftHttpServer.testRunThriftServerWithHeaderBufferLength:113->runThriftServer:151->stopHttpServerThread:195
» NullPointer


Tests run: 83, Failures: 0, Errors: 1, Skipped: 0

[INFO] ------------------------------------------------------------------------
[INFO] Reactor Summary:
[INFO] 
[INFO] Apache HBase ...................................... SUCCESS [1:41.043s]
[INFO] Apache HBase - Checkstyle ......................... SUCCESS [15.874s]
[INFO] Apache HBase - Resource Bundle .................... SUCCESS [0.231s]
[INFO] Apache HBase - Annotations ........................ SUCCESS [1.161s]
[INFO] Apache HBase - Protocol ........................... SUCCESS [17.175s]
[INFO] Apache HBase - Common ............................. SUCCESS [2:36.552s]
[INFO] Apache HBase - Procedure .......................... SUCCESS [3:26.808s]
[INFO] Apache HBase - Client ............................. SUCCESS [1:41.477s]
[INFO] Apache HBase - Hadoop Compatibility ............... SUCCESS [9.609s]
[INFO] Apache HBase - Hadoop Two Compatibility ........... SUCCESS [17.339s]
[INFO] Apache HBase - Prefix Tree ........................ SUCCESS [9.760s]
[INFO] Apache HBase - Server ............................. SUCCESS [1:25:15.794s]
[INFO] Apache HBase - Testing Util ....................... SUCCESS [2.419s]
[INFO] Apache HBase - Thrift ............................. FAILURE [14:23.642s]
[INFO] Apache HBase - Rest ............................... SKIPPED
[INFO] Apache HBase - Shell .............................. SKIPPED
[INFO] Apache HBase - Integration Tests .................. SKIPPED
[INFO] Apache HBase - Examples ........................... SKIPPED
[INFO] Apache HBase - External Block Cache ............... SKIPPED
[INFO] Apache HBase - Assembly ........................... SKIPPED
[INFO] Apache HBase - Shaded ............................. SKIPPED
[INFO] Apache HBase - Shaded - Client .................... SKIPPED
[INFO] Apache HBase - Shaded - Server .................... SKIPPED
[INFO] Apache HBase - Archetypes ......................... SKIPPED
[INFO] Apache HBase - Exemplar for hbase-client archetype  SKIPPED
[INFO] Apache HBase - Exemplar for hbase-shaded-client archetype  SKIPPED
[INFO] Apache HBase - Archetype builder .................. SKIPPED
[INFO] ------------------------------------------------------------------------
[INFO] BUILD FAILURE
[INFO] ------------------------------------------------------------------------
[INFO] Total time: 1:50:50.614s
[INFO] Finished at: Thu Dec 15 13:51:12 UTC 2016
[INFO] Final Memory: 108M/1067M
[INFO] ------------------------------------------------------------------------
[ERROR] Failed to execute goal org.apache.maven.plugins:maven-surefire-plugin:2.18.1:test
(default-test) on project hbase-thrift: There are test failures.
[ERROR] 
[ERROR] Please refer to <https://builds.apache.org/job/HBase-1.4/jdk=JDK_1_7,label=Hadoop/ws/hbase-thrift/target/surefire-reports>
for the individual test results.
[ERROR] -> [Help 1]
[ERROR] 
[ERROR] To see the full stack trace of the errors, re-run Maven with the -e switch.
[ERROR] Re-run Maven using the -X switch to enable full debug logging.
[ERROR] 
[ERROR] For more information about the errors and possible solutions, please read the following
articles:
[ERROR] [Help 1] http://cwiki.apache.org/confluence/display/MAVEN/MojoFailureException
[ERROR] 
[ERROR] After correcting the problems, you can resume the build with the command
[ERROR]   mvn <goals> -rf :hbase-thrift
Build step 'Invoke top-level Maven targets' marked build as failure
Performing Post build task...
Match found for :.* : True
Logical operation result is TRUE
Running script  : # Post-build task script. TODO: Check this in and have all builds reference
check-in.
pwd && ls
# NOTE!!!! The below code has been copied and pasted from ./dev-tools/run-test.sh
# Do not change here without syncing there and vice-versa.
ZOMBIE_TESTS_COUNT=`jps -v | grep surefirebooter | grep -e '-Dhbase.test' | wc -l`
if [[ $ZOMBIE_TESTS_COUNT != 0 ]] ; then
 echo "Suspicious java process found - waiting 30s to see if there are just slow to stop"
 sleep 30
 ZOMBIE_TESTS_COUNT=`jps -v | grep surefirebooter | grep -e '-Dhbase.test' | wc -l`
 if [[ $ZOMBIE_TESTS_COUNT != 0 ]] ; then
   echo " {color:red}There appear to be $ZOMBIE_TESTS_COUNT zombie tests{color}, they should
have been killed by surefire but survived"
   jps -v | grep surefirebooter | grep -e '-Dhbase.test'
   jps -v | grep surefirebooter | grep -e '-Dhbase.test' | cut -d ' ' -f 1 | xargs -n 1 jstack
   # Exit with error
   exit 1
 else
   echo "We're ok: there is no zombie test, but some tests took some time to stop"
 fi
else
  echo "We're ok: there is no zombie test"
fi
Setting JDK_1_7_LATEST__HOME=/home/jenkins/tools/java/latest1.7
Setting JDK_1_8_LATEST__HOME=/home/jenkins/tools/java/latest1.8
[3130e991] $ /bin/bash -xe /tmp/hudson3269622568485801990.sh
+ pwd
<https://builds.apache.org/job/HBase-1.4/jdk=JDK_1_7,label=Hadoop/ws/>
+ ls
bin
CHANGES.txt
conf
dev-support
extra_env_var
hbase-annotations
hbase-archetypes
hbase-assembly
hbase-checkstyle
hbase-client
hbase-common
hbase-examples
hbase-external-blockcache
hbase-hadoop2-compat
hbase-hadoop-compat
hbase-it
hbase-native-client
hbase-prefix-tree
hbase-procedure
hbase-protocol
hbase-resource-bundle
hbase-rest
hbase-server
hbase-shaded
hbase-shell
hbase-testing-util
hbase-thrift
LICENSE.txt
NOTICE.txt
pom.xml
README.txt
src
target
++ jps -v
++ grep -e -Dhbase.test
++ grep surefirebooter
++ wc -l
+ ZOMBIE_TESTS_COUNT=0
+ [[ 0 != 0 ]]
+ echo 'We'\''re ok: there is no zombie test'
We're ok: there is no zombie test
POST BUILD TASK : SUCCESS
END OF POST BUILD TASK : 0
Archiving artifacts
Setting JDK_1_7_LATEST__HOME=/home/jenkins/tools/java/latest1.7
Setting JDK_1_8_LATEST__HOME=/home/jenkins/tools/java/latest1.8
Recording test results
Setting JDK_1_7_LATEST__HOME=/home/jenkins/tools/java/latest1.7
Setting JDK_1_8_LATEST__HOME=/home/jenkins/tools/java/latest1.8
Setting JDK_1_7_LATEST__HOME=/home/jenkins/tools/java/latest1.7
Setting JDK_1_8_LATEST__HOME=/home/jenkins/tools/java/latest1.8

Mime
View raw message