hbase-builds mailing list archives

Site index · List index
Message view « Date » · « Thread »
Top « Date » · « Thread »
From Apache Jenkins Server <jenk...@builds.apache.org>
Subject Build failed in Jenkins: HBase-1.4 » JDK_1_8,yahoo-not-h2 #512
Date Wed, 02 Nov 2016 18:00:25 GMT
See <https://builds.apache.org/job/HBase-1.4/jdk=JDK_1_8,label=yahoo-not-h2/512/changes>

Changes:

[liyu] HBASE-16972 Log more details for Scan#next request when responseTooSlow

------------------------------------------
[...truncated 46302 lines...]
	at org.apache.hadoop.hbase.mapreduce.MultiTableSnapshotInputFormat.setInput(MultiTableSnapshotInputFormat.java:106)
	at org.apache.hadoop.hbase.mapreduce.TableMapReduceUtil.initMultiTableSnapshotMapperJob(TableMapReduceUtil.java:319)
	at org.apache.hadoop.hbase.mapreduce.TestMultiTableSnapshotInputFormat.initJob(TestMultiTableSnapshotInputFormat.java:73)

Running org.apache.hadoop.hbase.mapreduce.TestLoadIncrementalHFilesUseSecurityEndPoint
Tests run: 2, Failures: 0, Errors: 0, Skipped: 0, Time elapsed: 26.909 sec - in org.apache.hadoop.hbase.mapreduce.TestImportTSVWithOperationAttributes
Tests run: 4, Failures: 0, Errors: 4, Skipped: 0, Time elapsed: 42.589 sec <<< FAILURE!
- in org.apache.hadoop.hbase.mapreduce.TestMultiTableSnapshotInputFormat
testScanEmptyToAPP(org.apache.hadoop.hbase.mapreduce.TestMultiTableSnapshotInputFormat)  Time
elapsed: 0.05 sec  <<< ERROR!
java.lang.IllegalArgumentException: Restore directory cannot be a sub directory of HBase root
directory. RootDir: <https://builds.apache.org/job/HBase-1.4/jdk=JDK_1_8,label=yahoo-not-h2/ws/hbase-server/target/test-data/d42f4e44-037d-4c4e-bf05-28eae35cc596,>
restoreDir: <https://builds.apache.org/job/HBase-1.4/jdk=JDK_1_8,label=yahoo-not-h2/ws/hbase-server/target/test-data/d42f4e44-037d-4c4e-bf05-28eae35cc596/scantest1_snapshot__7327d3ad-aa19-4038-8077-38266e42ea87>
	at org.apache.hadoop.hbase.snapshot.RestoreSnapshotHelper.copySnapshotForScanner(RestoreSnapshotHelper.java:720)
	at org.apache.hadoop.hbase.mapreduce.MultiTableSnapshotInputFormatImpl.restoreSnapshot(MultiTableSnapshotInputFormatImpl.java:249)
	at org.apache.hadoop.hbase.mapreduce.MultiTableSnapshotInputFormatImpl.restoreSnapshots(MultiTableSnapshotInputFormatImpl.java:243)
	at org.apache.hadoop.hbase.mapreduce.MultiTableSnapshotInputFormatImpl.setInput(MultiTableSnapshotInputFormatImpl.java:80)
	at org.apache.hadoop.hbase.mapreduce.MultiTableSnapshotInputFormat.setInput(MultiTableSnapshotInputFormat.java:106)
	at org.apache.hadoop.hbase.mapreduce.TableMapReduceUtil.initMultiTableSnapshotMapperJob(TableMapReduceUtil.java:319)
	at org.apache.hadoop.hbase.mapreduce.TestMultiTableSnapshotInputFormat.initJob(TestMultiTableSnapshotInputFormat.java:73)

testScanYZYToEmpty(org.apache.hadoop.hbase.mapreduce.TestMultiTableSnapshotInputFormat)  Time
elapsed: 0.03 sec  <<< ERROR!
java.lang.IllegalArgumentException: Restore directory cannot be a sub directory of HBase root
directory. RootDir: <https://builds.apache.org/job/HBase-1.4/jdk=JDK_1_8,label=yahoo-not-h2/ws/hbase-server/target/test-data/d42f4e44-037d-4c4e-bf05-28eae35cc596,>
restoreDir: <https://builds.apache.org/job/HBase-1.4/jdk=JDK_1_8,label=yahoo-not-h2/ws/hbase-server/target/test-data/d42f4e44-037d-4c4e-bf05-28eae35cc596/scantest1_snapshot__110b102e-c21d-4de4-be79-b5cda9dd63e3>
	at org.apache.hadoop.hbase.snapshot.RestoreSnapshotHelper.copySnapshotForScanner(RestoreSnapshotHelper.java:720)
	at org.apache.hadoop.hbase.mapreduce.MultiTableSnapshotInputFormatImpl.restoreSnapshot(MultiTableSnapshotInputFormatImpl.java:249)
	at org.apache.hadoop.hbase.mapreduce.MultiTableSnapshotInputFormatImpl.restoreSnapshots(MultiTableSnapshotInputFormatImpl.java:243)
	at org.apache.hadoop.hbase.mapreduce.MultiTableSnapshotInputFormatImpl.setInput(MultiTableSnapshotInputFormatImpl.java:80)
	at org.apache.hadoop.hbase.mapreduce.MultiTableSnapshotInputFormat.setInput(MultiTableSnapshotInputFormat.java:106)
	at org.apache.hadoop.hbase.mapreduce.TableMapReduceUtil.initMultiTableSnapshotMapperJob(TableMapReduceUtil.java:319)
	at org.apache.hadoop.hbase.mapreduce.TestMultiTableSnapshotInputFormat.initJob(TestMultiTableSnapshotInputFormat.java:73)

testScanEmptyToEmpty(org.apache.hadoop.hbase.mapreduce.TestMultiTableSnapshotInputFormat)
 Time elapsed: 0.038 sec  <<< ERROR!
java.lang.IllegalArgumentException: Restore directory cannot be a sub directory of HBase root
directory. RootDir: <https://builds.apache.org/job/HBase-1.4/jdk=JDK_1_8,label=yahoo-not-h2/ws/hbase-server/target/test-data/d42f4e44-037d-4c4e-bf05-28eae35cc596,>
restoreDir: <https://builds.apache.org/job/HBase-1.4/jdk=JDK_1_8,label=yahoo-not-h2/ws/hbase-server/target/test-data/d42f4e44-037d-4c4e-bf05-28eae35cc596/scantest1_snapshot__35ecaa3f-3aa5-48ea-b1db-5616731ed1d3>
	at org.apache.hadoop.hbase.snapshot.RestoreSnapshotHelper.copySnapshotForScanner(RestoreSnapshotHelper.java:720)
	at org.apache.hadoop.hbase.mapreduce.MultiTableSnapshotInputFormatImpl.restoreSnapshot(MultiTableSnapshotInputFormatImpl.java:249)
	at org.apache.hadoop.hbase.mapreduce.MultiTableSnapshotInputFormatImpl.restoreSnapshots(MultiTableSnapshotInputFormatImpl.java:243)
	at org.apache.hadoop.hbase.mapreduce.MultiTableSnapshotInputFormatImpl.setInput(MultiTableSnapshotInputFormatImpl.java:80)
	at org.apache.hadoop.hbase.mapreduce.MultiTableSnapshotInputFormat.setInput(MultiTableSnapshotInputFormat.java:106)
	at org.apache.hadoop.hbase.mapreduce.TableMapReduceUtil.initMultiTableSnapshotMapperJob(TableMapReduceUtil.java:319)
	at org.apache.hadoop.hbase.mapreduce.TestMultiTableSnapshotInputFormat.initJob(TestMultiTableSnapshotInputFormat.java:73)

testScanOBBToOPP(org.apache.hadoop.hbase.mapreduce.TestMultiTableSnapshotInputFormat)  Time
elapsed: 0.025 sec  <<< ERROR!
java.lang.IllegalArgumentException: Restore directory cannot be a sub directory of HBase root
directory. RootDir: <https://builds.apache.org/job/HBase-1.4/jdk=JDK_1_8,label=yahoo-not-h2/ws/hbase-server/target/test-data/d42f4e44-037d-4c4e-bf05-28eae35cc596,>
restoreDir: <https://builds.apache.org/job/HBase-1.4/jdk=JDK_1_8,label=yahoo-not-h2/ws/hbase-server/target/test-data/d42f4e44-037d-4c4e-bf05-28eae35cc596/scantest1_snapshot__f9b715ae-1465-4667-b168-b87052251c72>
	at org.apache.hadoop.hbase.snapshot.RestoreSnapshotHelper.copySnapshotForScanner(RestoreSnapshotHelper.java:720)
	at org.apache.hadoop.hbase.mapreduce.MultiTableSnapshotInputFormatImpl.restoreSnapshot(MultiTableSnapshotInputFormatImpl.java:249)
	at org.apache.hadoop.hbase.mapreduce.MultiTableSnapshotInputFormatImpl.restoreSnapshots(MultiTableSnapshotInputFormatImpl.java:243)
	at org.apache.hadoop.hbase.mapreduce.MultiTableSnapshotInputFormatImpl.setInput(MultiTableSnapshotInputFormatImpl.java:80)
	at org.apache.hadoop.hbase.mapreduce.MultiTableSnapshotInputFormat.setInput(MultiTableSnapshotInputFormat.java:106)
	at org.apache.hadoop.hbase.mapreduce.TableMapReduceUtil.initMultiTableSnapshotMapperJob(TableMapReduceUtil.java:319)
	at org.apache.hadoop.hbase.mapreduce.TestMultiTableSnapshotInputFormat.initJob(TestMultiTableSnapshotInputFormat.java:73)

Tests run: 7, Failures: 0, Errors: 0, Skipped: 0, Time elapsed: 43.765 sec - in org.apache.hadoop.hbase.mapreduce.TestTableInputFormatScan1
Running org.apache.hadoop.hbase.mapreduce.TestWALRecordReader
Tests run: 2, Failures: 0, Errors: 0, Skipped: 0, Time elapsed: 2.037 sec - in org.apache.hadoop.hbase.mapreduce.TestWALRecordReader
Tests run: 5, Failures: 0, Errors: 0, Skipped: 0, Time elapsed: 66.195 sec - in org.apache.hadoop.hbase.mapreduce.TestCopyTable
Running org.apache.hadoop.hbase.mapreduce.TestImportExport
Running org.apache.hadoop.hbase.mapreduce.TestMultiTableInputFormat
Running org.apache.hadoop.hbase.mapreduce.TestTableInputFormatScan2
Running org.apache.hadoop.hbase.mapreduce.TestHashTable
Tests run: 1, Failures: 0, Errors: 0, Skipped: 0, Time elapsed: 15.492 sec - in org.apache.hadoop.hbase.mapreduce.TestHashTable
Tests run: 4, Failures: 0, Errors: 0, Skipped: 0, Time elapsed: 33.838 sec - in org.apache.hadoop.hbase.mapreduce.TestMultiTableInputFormat
Running org.apache.hadoop.hbase.mapreduce.TestLoadIncrementalHFiles
Tests run: 7, Failures: 0, Errors: 0, Skipped: 0, Time elapsed: 38.641 sec - in org.apache.hadoop.hbase.mapreduce.TestTableInputFormatScan2
Running org.apache.hadoop.hbase.mapreduce.TestTimeRangeMapRed
Running org.apache.hadoop.hbase.mapreduce.TestImportTsv
Tests run: 1, Failures: 0, Errors: 0, Skipped: 0, Time elapsed: 7.843 sec - in org.apache.hadoop.hbase.mapreduce.TestTimeRangeMapRed
Running org.apache.hadoop.hbase.mapreduce.TestImportTSVWithVisibilityLabels

Results :

Tests in error: 
org.apache.hadoop.hbase.mapred.TestMultiTableSnapshotInputFormat.testScanEmptyToAPP(org.apache.hadoop.hbase.mapred.TestMultiTableSnapshotInputFormat)
  Run 1: TestMultiTableSnapshotInputFormat>MultiTableInputFormatTestBase.testScanEmptyToAPP:209->MultiTableInputFormatTestBase.testScan:262->runJob:60
» IllegalArgument
  Run 2: TestMultiTableSnapshotInputFormat>MultiTableInputFormatTestBase.testScanEmptyToAPP:209->MultiTableInputFormatTestBase.testScan:262->runJob:60
» IllegalArgument
  Run 3: TestMultiTableSnapshotInputFormat>MultiTableInputFormatTestBase.testScanEmptyToAPP:209->MultiTableInputFormatTestBase.testScan:262->runJob:60
» IllegalArgument

org.apache.hadoop.hbase.mapred.TestMultiTableSnapshotInputFormat.testScanEmptyToEmpty(org.apache.hadoop.hbase.mapred.TestMultiTableSnapshotInputFormat)
  Run 1: TestMultiTableSnapshotInputFormat>MultiTableInputFormatTestBase.testScanEmptyToEmpty:203->MultiTableInputFormatTestBase.testScan:262->runJob:60
» IllegalArgument
  Run 2: TestMultiTableSnapshotInputFormat>MultiTableInputFormatTestBase.testScanEmptyToEmpty:203->MultiTableInputFormatTestBase.testScan:262->runJob:60
» IllegalArgument
  Run 3: TestMultiTableSnapshotInputFormat>MultiTableInputFormatTestBase.testScanEmptyToEmpty:203->MultiTableInputFormatTestBase.testScan:262->runJob:60
» IllegalArgument

org.apache.hadoop.hbase.mapred.TestMultiTableSnapshotInputFormat.testScanOBBToOPP(org.apache.hadoop.hbase.mapred.TestMultiTableSnapshotInputFormat)
  Run 1: TestMultiTableSnapshotInputFormat>MultiTableInputFormatTestBase.testScanOBBToOPP:215->MultiTableInputFormatTestBase.testScan:262->runJob:60
» IllegalArgument
  Run 2: TestMultiTableSnapshotInputFormat>MultiTableInputFormatTestBase.testScanOBBToOPP:215->MultiTableInputFormatTestBase.testScan:262->runJob:60
» IllegalArgument
  Run 3: TestMultiTableSnapshotInputFormat>MultiTableInputFormatTestBase.testScanOBBToOPP:215->MultiTableInputFormatTestBase.testScan:262->runJob:60
» IllegalArgument

org.apache.hadoop.hbase.mapred.TestMultiTableSnapshotInputFormat.testScanYZYToEmpty(org.apache.hadoop.hbase.mapred.TestMultiTableSnapshotInputFormat)
  Run 1: TestMultiTableSnapshotInputFormat>MultiTableInputFormatTestBase.testScanYZYToEmpty:221->MultiTableInputFormatTestBase.testScan:262->runJob:60
» IllegalArgument
  Run 2: TestMultiTableSnapshotInputFormat>MultiTableInputFormatTestBase.testScanYZYToEmpty:221->MultiTableInputFormatTestBase.testScan:262->runJob:60
» IllegalArgument
  Run 3: TestMultiTableSnapshotInputFormat>MultiTableInputFormatTestBase.testScanYZYToEmpty:221->MultiTableInputFormatTestBase.testScan:262->runJob:60
» IllegalArgument

org.apache.hadoop.hbase.mapreduce.TestMultiTableSnapshotInputFormat.testScanEmptyToAPP(org.apache.hadoop.hbase.mapreduce.TestMultiTableSnapshotInputFormat)
  Run 1: TestMultiTableSnapshotInputFormat>MultiTableInputFormatTestBase.testScanEmptyToAPP:209->MultiTableInputFormatTestBase.testScan:262->MultiTableInputFormatTestBase.runJob:269->initJob:73
» IllegalArgument
  Run 2: TestMultiTableSnapshotInputFormat>MultiTableInputFormatTestBase.testScanEmptyToAPP:209->MultiTableInputFormatTestBase.testScan:262->MultiTableInputFormatTestBase.runJob:269->initJob:73
» IllegalArgument
  Run 3: TestMultiTableSnapshotInputFormat>MultiTableInputFormatTestBase.testScanEmptyToAPP:209->MultiTableInputFormatTestBase.testScan:262->MultiTableInputFormatTestBase.runJob:269->initJob:73
» IllegalArgument

org.apache.hadoop.hbase.mapreduce.TestMultiTableSnapshotInputFormat.testScanEmptyToEmpty(org.apache.hadoop.hbase.mapreduce.TestMultiTableSnapshotInputFormat)
  Run 1: TestMultiTableSnapshotInputFormat>MultiTableInputFormatTestBase.testScanEmptyToEmpty:203->MultiTableInputFormatTestBase.testScan:262->MultiTableInputFormatTestBase.runJob:269->initJob:73
» IllegalArgument
  Run 2: TestMultiTableSnapshotInputFormat>MultiTableInputFormatTestBase.testScanEmptyToEmpty:203->MultiTableInputFormatTestBase.testScan:262->MultiTableInputFormatTestBase.runJob:269->initJob:73
» IllegalArgument
  Run 3: TestMultiTableSnapshotInputFormat>MultiTableInputFormatTestBase.testScanEmptyToEmpty:203->MultiTableInputFormatTestBase.testScan:262->MultiTableInputFormatTestBase.runJob:269->initJob:73
» IllegalArgument

org.apache.hadoop.hbase.mapreduce.TestMultiTableSnapshotInputFormat.testScanOBBToOPP(org.apache.hadoop.hbase.mapreduce.TestMultiTableSnapshotInputFormat)
  Run 1: TestMultiTableSnapshotInputFormat>MultiTableInputFormatTestBase.testScanOBBToOPP:215->MultiTableInputFormatTestBase.testScan:262->MultiTableInputFormatTestBase.runJob:269->initJob:73
» IllegalArgument
  Run 2: TestMultiTableSnapshotInputFormat>MultiTableInputFormatTestBase.testScanOBBToOPP:215->MultiTableInputFormatTestBase.testScan:262->MultiTableInputFormatTestBase.runJob:269->initJob:73
» IllegalArgument
  Run 3: TestMultiTableSnapshotInputFormat>MultiTableInputFormatTestBase.testScanOBBToOPP:215->MultiTableInputFormatTestBase.testScan:262->MultiTableInputFormatTestBase.runJob:269->initJob:73
» IllegalArgument

org.apache.hadoop.hbase.mapreduce.TestMultiTableSnapshotInputFormat.testScanYZYToEmpty(org.apache.hadoop.hbase.mapreduce.TestMultiTableSnapshotInputFormat)
  Run 1: TestMultiTableSnapshotInputFormat>MultiTableInputFormatTestBase.testScanYZYToEmpty:221->MultiTableInputFormatTestBase.testScan:262->MultiTableInputFormatTestBase.runJob:269->initJob:73
» IllegalArgument
  Run 2: TestMultiTableSnapshotInputFormat>MultiTableInputFormatTestBase.testScanYZYToEmpty:221->MultiTableInputFormatTestBase.testScan:262->MultiTableInputFormatTestBase.runJob:269->initJob:73
» IllegalArgument
  Run 3: TestMultiTableSnapshotInputFormat>MultiTableInputFormatTestBase.testScanYZYToEmpty:221->MultiTableInputFormatTestBase.testScan:262->MultiTableInputFormatTestBase.runJob:269->initJob:73
» IllegalArgument

  TestReplicationKillSlaveRS.killOneSlaveRS » RetriesExhausted Failed after atte...

Tests run: 1540, Failures: 0, Errors: 9, Skipped: 39

[INFO] ------------------------------------------------------------------------
[INFO] Reactor Summary:
[INFO] 
[INFO] Apache HBase ...................................... SUCCESS [1:51.195s]
[INFO] Apache HBase - Checkstyle ......................... SUCCESS [9.710s]
[INFO] Apache HBase - Resource Bundle .................... SUCCESS [0.158s]
[INFO] Apache HBase - Annotations ........................ SUCCESS [0.986s]
[INFO] Apache HBase - Protocol ........................... SUCCESS [19.921s]
[INFO] Apache HBase - Common ............................. SUCCESS [2:46.525s]
[INFO] Apache HBase - Procedure .......................... SUCCESS [3:41.587s]
[INFO] Apache HBase - Client ............................. SUCCESS [1:42.757s]
[INFO] Apache HBase - Hadoop Compatibility ............... SUCCESS [10.335s]
[INFO] Apache HBase - Hadoop Two Compatibility ........... SUCCESS [12.418s]
[INFO] Apache HBase - Prefix Tree ........................ SUCCESS [9.812s]
[INFO] Apache HBase - Server ............................. FAILURE [1:28:41.537s]
[INFO] Apache HBase - Testing Util ....................... SKIPPED
[INFO] Apache HBase - Thrift ............................. SKIPPED
[INFO] Apache HBase - Rest ............................... SKIPPED
[INFO] Apache HBase - Shell .............................. SKIPPED
[INFO] Apache HBase - Integration Tests .................. SKIPPED
[INFO] Apache HBase - Examples ........................... SKIPPED
[INFO] Apache HBase - External Block Cache ............... SKIPPED
[INFO] Apache HBase - Assembly ........................... SKIPPED
[INFO] Apache HBase - Shaded ............................. SKIPPED
[INFO] Apache HBase - Shaded - Client .................... SKIPPED
[INFO] Apache HBase - Shaded - Server .................... SKIPPED
[INFO] Apache HBase - Archetypes ......................... SKIPPED
[INFO] Apache HBase - Exemplar for hbase-client archetype  SKIPPED
[INFO] Apache HBase - Exemplar for hbase-shaded-client archetype  SKIPPED
[INFO] Apache HBase - Archetype builder .................. SKIPPED
[INFO] ------------------------------------------------------------------------
[INFO] BUILD FAILURE
[INFO] ------------------------------------------------------------------------
[INFO] Total time: 1:40:19.947s
[INFO] Finished at: Wed Nov 02 17:54:32 UTC 2016
[INFO] Final Memory: 404M/732M
[INFO] ------------------------------------------------------------------------
[ERROR] Failed to execute goal org.apache.maven.plugins:maven-surefire-plugin:2.18.1:test
(secondPartTestsExecution) on project hbase-server: ExecutionException: java.lang.RuntimeException:
java.lang.RuntimeException: org.apache.maven.surefire.report.ReporterException: When writing
xml report stdout/stderr: /tmp/stderr7573453956833375628deferred (No such file or directory)
-> [Help 1]
[ERROR] 
[ERROR] To see the full stack trace of the errors, re-run Maven with the -e switch.
[ERROR] Re-run Maven using the -X switch to enable full debug logging.
[ERROR] 
[ERROR] For more information about the errors and possible solutions, please read the following
articles:
[ERROR] [Help 1] http://cwiki.apache.org/confluence/display/MAVEN/MojoFailureException
[ERROR] 
[ERROR] After correcting the problems, you can resume the build with the command
[ERROR]   mvn <goals> -rf :hbase-server
Build step 'Invoke top-level Maven targets' marked build as failure
Performing Post build task...
Match found for :.* : True
Logical operation result is TRUE
Running script  : # Post-build task script. TODO: Check this in and have all builds reference
check-in.
pwd && ls
# NOTE!!!! The below code has been copied and pasted from ./dev-tools/run-test.sh
# Do not change here without syncing there and vice-versa.
ZOMBIE_TESTS_COUNT=`jps -v | grep surefirebooter | grep -e '-Dhbase.test' | wc -l`
if [[ $ZOMBIE_TESTS_COUNT != 0 ]] ; then
 echo "Suspicious java process found - waiting 30s to see if there are just slow to stop"
 sleep 30
 ZOMBIE_TESTS_COUNT=`jps -v | grep surefirebooter | grep -e '-Dhbase.test' | wc -l`
 if [[ $ZOMBIE_TESTS_COUNT != 0 ]] ; then
   echo " {color:red}There appear to be $ZOMBIE_TESTS_COUNT zombie tests{color}, they should
have been killed by surefire but survived"
   jps -v | grep surefirebooter | grep -e '-Dhbase.test'
   jps -v | grep surefirebooter | grep -e '-Dhbase.test' | cut -d ' ' -f 1 | xargs -n 1 jstack
   # Exit with error
   exit 1
 else
   echo "We're ok: there is no zombie test, but some tests took some time to stop"
 fi
else
  echo "We're ok: there is no zombie test"
fi
Setting JDK_1_7_LATEST__HOME=/home/jenkins/tools/java/latest1.7
Setting JDK_1_8_LATEST__HOME=/home/jenkins/tools/java/latest1.8
[yahoo-not-h2] $ /bin/bash -xe /tmp/hudson5068067890816209609.sh
+ pwd
<https://builds.apache.org/job/HBase-1.4/jdk=JDK_1_8,label=yahoo-not-h2/ws/>
+ ls
bin
CHANGES.txt
conf
dev-support
extra_env_var
hbase-annotations
hbase-archetypes
hbase-assembly
hbase-checkstyle
hbase-client
hbase-common
hbase-examples
hbase-external-blockcache
hbase-hadoop2-compat
hbase-hadoop-compat
hbase-it
hbase-native-client
hbase-prefix-tree
hbase-procedure
hbase-protocol
hbase-resource-bundle
hbase-rest
hbase-server
hbase-shaded
hbase-shell
hbase-testing-util
hbase-thrift
LICENSE.txt
NOTICE.txt
pom.xml
README.txt
src
target
++ jps -v
++ grep surefirebooter
++ grep -e -Dhbase.test
++ wc -l
+ ZOMBIE_TESTS_COUNT=4
+ [[ 4 != 0 ]]
+ echo 'Suspicious java process found - waiting 30s to see if there are just slow to stop'
Suspicious java process found - waiting 30s to see if there are just slow to stop
+ sleep 30
++ jps -v
++ grep surefirebooter
++ wc -l
++ grep -e -Dhbase.test
+ ZOMBIE_TESTS_COUNT=0
+ [[ 0 != 0 ]]
+ echo 'We'\''re ok: there is no zombie test, but some tests took some time to stop'
We're ok: there is no zombie test, but some tests took some time to stop
POST BUILD TASK : SUCCESS
END OF POST BUILD TASK : 0
Archiving artifacts
Setting JDK_1_7_LATEST__HOME=/home/jenkins/tools/java/latest1.7
Setting JDK_1_8_LATEST__HOME=/home/jenkins/tools/java/latest1.8
Recording test results
Setting JDK_1_7_LATEST__HOME=/home/jenkins/tools/java/latest1.7
Setting JDK_1_8_LATEST__HOME=/home/jenkins/tools/java/latest1.8
Setting JDK_1_7_LATEST__HOME=/home/jenkins/tools/java/latest1.7
Setting JDK_1_8_LATEST__HOME=/home/jenkins/tools/java/latest1.8

Mime
View raw message