hbase-builds mailing list archives

Site index · List index
Message view « Date » · « Thread »
Top « Date » · « Thread »
From Apache Jenkins Server <jenk...@builds.apache.org>
Subject Build failed in Jenkins: HBASE-16264 » JDK 1.8 (latest),yahoo-not-h2 #15
Date Sat, 01 Oct 2016 19:15:39 GMT
See <https://builds.apache.org/job/HBASE-16264/jdk=JDK%201.8%20(latest),label=yahoo-not-h2/15/changes>

Changes:

[stack] Forgot to add shaded google

------------------------------------------
[...truncated 3045 lines...]
[INFO] 
[INFO] --- maven-resources-plugin:2.6:testResources (default-testResources) @ hbase-annotations
---
[INFO] Using 'UTF-8' encoding to copy filtered resources.
[INFO] skip non existing resourceDirectory <https://builds.apache.org/job/HBASE-16264/jdk=JDK%201.8%20(latest),label=yahoo-not-h2/ws/hbase-annotations/src/test/resources>
[INFO] Copying 3 resources
[INFO] 
[INFO] --- maven-compiler-plugin:3.2:testCompile (default-testCompile) @ hbase-annotations
---
[INFO] Nothing to compile - all classes are up to date
[INFO] 
[INFO] --- maven-surefire-plugin:2.18.1:test (default-test) @ hbase-annotations ---
[INFO] Tests are skipped.
[INFO] 
[INFO] --- maven-surefire-plugin:2.18.1:test (secondPartTestsExecution) @ hbase-annotations
---
[INFO] Tests are skipped.
[INFO] 
[INFO] --- maven-jar-plugin:2.4:test-jar (default) @ hbase-annotations ---
[INFO] Building jar: <https://builds.apache.org/job/HBASE-16264/jdk=JDK%201.8%20(latest),label=yahoo-not-h2/ws/hbase-annotations/target/hbase-annotations-2.0.0-SNAPSHOT-tests.jar>
[INFO] 
[INFO] --- maven-jar-plugin:2.4:jar (default-jar) @ hbase-annotations ---
[INFO] Building jar: <https://builds.apache.org/job/HBASE-16264/jdk=JDK%201.8%20(latest),label=yahoo-not-h2/ws/hbase-annotations/target/hbase-annotations-2.0.0-SNAPSHOT.jar>
[INFO] 
[INFO] --- maven-checkstyle-plugin:2.17:checkstyle (default-cli) @ hbase-annotations ---
[INFO] There are 5 errors reported by Checkstyle 6.18 with hbase/checkstyle.xml ruleset.
[INFO]                                                                         
[INFO] ------------------------------------------------------------------------
[INFO] Building Apache HBase - Common 2.0.0-SNAPSHOT
[INFO] ------------------------------------------------------------------------
[INFO] 
[INFO] --- maven-enforcer-plugin:1.0.1:enforce (min-maven-min-java-banned-xerces) @ hbase-common
---
[INFO] 
[INFO] --- maven-enforcer-plugin:1.0.1:enforce (banned-jsr305) @ hbase-common ---
[INFO] 
[INFO] --- buildnumber-maven-plugin:1.3:create-timestamp (default) @ hbase-common ---
[INFO] 
[INFO] --- maven-antrun-plugin:1.8:run (generate) @ hbase-common ---
[INFO] Executing tasks

main:
     [exec] ~/jenkins-slave/workspace/HBASE-16264/05166ef6/hbase-common ~/jenkins-slave/workspace/HBASE-16264/05166ef6/hbase-common
     [exec] ~/jenkins-slave/workspace/HBASE-16264/05166ef6/hbase-common
[INFO] Executed tasks
[INFO] 
[INFO] --- build-helper-maven-plugin:1.9.1:add-source (versionInfo-source) @ hbase-common
---
[INFO] Source directory: <https://builds.apache.org/job/HBASE-16264/jdk=JDK%201.8%20(latest),label=yahoo-not-h2/ws/hbase-common/target/generated-sources/java>
added.
[INFO] 
[INFO] --- maven-remote-resources-plugin:1.5:process (default) @ hbase-common ---
[INFO] 
[INFO] --- maven-resources-plugin:2.6:resources (default-resources) @ hbase-common ---
[INFO] Using 'UTF-8' encoding to copy filtered resources.
[INFO] Copying 1 resource
[INFO] Copying 3 resources
[INFO] 
[INFO] --- maven-antrun-plugin:1.8:run (default) @ hbase-common ---
[INFO] Executing tasks

main:
[INFO] Executed tasks
[INFO] 
[INFO] --- maven-compiler-plugin:3.2:compile (default-compile) @ hbase-common ---
[INFO] Compiling 2 source files to <https://builds.apache.org/job/HBASE-16264/jdk=JDK%201.8%20(latest),label=yahoo-not-h2/ws/hbase-common/target/classes>
[INFO] 
[INFO] --- maven-dependency-plugin:2.1:build-classpath (create-mrapp-generated-classpath)
@ hbase-common ---
[INFO] Skipped writing classpath file '<https://builds.apache.org/job/HBASE-16264/jdk=JDK%201.8%20(latest),label=yahoo-not-h2/ws/hbase-common/target/test-classes/mrapp-generated-classpath'.>
 No changes found.
[INFO] 
[INFO] --- maven-resources-plugin:2.6:testResources (default-testResources) @ hbase-common
---
[INFO] Using 'UTF-8' encoding to copy filtered resources.
[INFO] Copying 1 resource to META-INF/
[INFO] Copying 3 resources
[INFO] 
[INFO] --- maven-compiler-plugin:3.2:testCompile (default-testCompile) @ hbase-common ---
[INFO] Nothing to compile - all classes are up to date
[INFO] 
[INFO] --- maven-surefire-plugin:2.18.1:test (default-test) @ hbase-common ---
[INFO] Tests are skipped.
[INFO] 
[INFO] --- maven-surefire-plugin:2.18.1:test (secondPartTestsExecution) @ hbase-common ---
[INFO] Tests are skipped.
[INFO] 
[INFO] --- maven-source-plugin:2.2.1:jar-no-fork (attach-sources) @ hbase-common ---
[INFO] Building jar: <https://builds.apache.org/job/HBASE-16264/jdk=JDK%201.8%20(latest),label=yahoo-not-h2/ws/hbase-common/target/hbase-common-2.0.0-SNAPSHOT-sources.jar>
[INFO] 
[INFO] --- maven-jar-plugin:2.4:test-jar (default) @ hbase-common ---
[INFO] Building jar: <https://builds.apache.org/job/HBASE-16264/jdk=JDK%201.8%20(latest),label=yahoo-not-h2/ws/hbase-common/target/hbase-common-2.0.0-SNAPSHOT-tests.jar>
[INFO] 
[INFO] --- maven-jar-plugin:2.4:jar (default-jar) @ hbase-common ---
[INFO] Building jar: <https://builds.apache.org/job/HBASE-16264/jdk=JDK%201.8%20(latest),label=yahoo-not-h2/ws/hbase-common/target/hbase-common-2.0.0-SNAPSHOT.jar>
[INFO] 
[INFO] --- maven-checkstyle-plugin:2.17:checkstyle (default-cli) @ hbase-common ---
[INFO] There are 1316 errors reported by Checkstyle 6.18 with hbase/checkstyle.xml ruleset.
[INFO]                                                                         
[INFO] ------------------------------------------------------------------------
[INFO] Building Apache HBase - Protocol 2.0.0-SNAPSHOT
[INFO] ------------------------------------------------------------------------
[INFO] 
[INFO] --- maven-enforcer-plugin:1.0.1:enforce (min-maven-min-java-banned-xerces) @ hbase-protocol
---
[INFO] 
[INFO] --- maven-enforcer-plugin:1.0.1:enforce (banned-jsr305) @ hbase-protocol ---
[INFO] 
[INFO] --- buildnumber-maven-plugin:1.3:create-timestamp (default) @ hbase-protocol ---
[INFO] 
[INFO] --- maven-remote-resources-plugin:1.5:process (default) @ hbase-protocol ---
[INFO] 
[INFO] --- maven-resources-plugin:2.6:resources (default-resources) @ hbase-protocol ---
[INFO] Using 'UTF-8' encoding to copy filtered resources.
[INFO] skip non existing resourceDirectory <https://builds.apache.org/job/HBASE-16264/jdk=JDK%201.8%20(latest),label=yahoo-not-h2/ws/hbase-protocol/src/main/resources>
[INFO] Copying 3 resources
[INFO] 
[INFO] --- maven-compiler-plugin:3.2:compile (default-compile) @ hbase-protocol ---
[INFO] Nothing to compile - all classes are up to date
[INFO] 
[INFO] --- maven-resources-plugin:2.6:testResources (default-testResources) @ hbase-protocol
---
[INFO] Using 'UTF-8' encoding to copy filtered resources.
[INFO] skip non existing resourceDirectory <https://builds.apache.org/job/HBASE-16264/jdk=JDK%201.8%20(latest),label=yahoo-not-h2/ws/hbase-protocol/src/test/resources>
[INFO] Copying 3 resources
[INFO] 
[INFO] --- maven-compiler-plugin:3.2:testCompile (default-testCompile) @ hbase-protocol ---
[INFO] No sources to compile
[INFO] 
[INFO] --- maven-surefire-plugin:2.18.1:test (default-test) @ hbase-protocol ---
[INFO] Tests are skipped.
[INFO] 
[INFO] --- maven-surefire-plugin:2.18.1:test (secondPartTestsExecution) @ hbase-protocol ---
[INFO] Tests are skipped.
[INFO] 
[INFO] --- maven-source-plugin:2.2.1:jar-no-fork (attach-sources) @ hbase-protocol ---
[INFO] Building jar: <https://builds.apache.org/job/HBASE-16264/jdk=JDK%201.8%20(latest),label=yahoo-not-h2/ws/hbase-protocol/target/hbase-protocol-2.0.0-SNAPSHOT-sources.jar>
[INFO] 
[INFO] --- maven-jar-plugin:2.4:test-jar (default) @ hbase-protocol ---
[INFO] Building jar: <https://builds.apache.org/job/HBASE-16264/jdk=JDK%201.8%20(latest),label=yahoo-not-h2/ws/hbase-protocol/target/hbase-protocol-2.0.0-SNAPSHOT-tests.jar>
[INFO] 
[INFO] --- maven-jar-plugin:2.4:jar (default-jar) @ hbase-protocol ---
[INFO] Building jar: <https://builds.apache.org/job/HBASE-16264/jdk=JDK%201.8%20(latest),label=yahoo-not-h2/ws/hbase-protocol/target/hbase-protocol-2.0.0-SNAPSHOT.jar>
[INFO] 
[INFO] --- maven-checkstyle-plugin:2.17:checkstyle (default-cli) @ hbase-protocol ---
[INFO] There are 3 errors reported by Checkstyle 6.18 with hbase/checkstyle.xml ruleset.
[INFO]                                                                         
[INFO] ------------------------------------------------------------------------
[INFO] Building Apache HBase - Shaded Protocol 2.0.0-SNAPSHOT
[INFO] ------------------------------------------------------------------------
[INFO] 
[INFO] --- maven-enforcer-plugin:1.0.1:enforce (min-maven-min-java-banned-xerces) @ hbase-protocol-shaded
---
[INFO] 
[INFO] --- maven-enforcer-plugin:1.0.1:enforce (banned-jsr305) @ hbase-protocol-shaded ---
[INFO] 
[INFO] --- buildnumber-maven-plugin:1.3:create-timestamp (default) @ hbase-protocol-shaded
---
[INFO] 
[INFO] --- maven-remote-resources-plugin:1.5:process (default) @ hbase-protocol-shaded ---
[INFO] 
[INFO] --- maven-resources-plugin:2.6:resources (default-resources) @ hbase-protocol-shaded
---
[INFO] Using 'UTF-8' encoding to copy filtered resources.
[INFO] skip non existing resourceDirectory <https://builds.apache.org/job/HBASE-16264/jdk=JDK%201.8%20(latest),label=yahoo-not-h2/ws/hbase-protocol-shaded/src/main/resources>
[INFO] Copying 3 resources
[INFO] 
[INFO] --- maven-compiler-plugin:3.2:compile (default-compile) @ hbase-protocol-shaded ---
[INFO] Nothing to compile - all classes are up to date
[INFO] 
[INFO] --- maven-resources-plugin:2.6:testResources (default-testResources) @ hbase-protocol-shaded
---
[INFO] Using 'UTF-8' encoding to copy filtered resources.
[INFO] skip non existing resourceDirectory <https://builds.apache.org/job/HBASE-16264/jdk=JDK%201.8%20(latest),label=yahoo-not-h2/ws/hbase-protocol-shaded/src/test/resources>
[INFO] Copying 3 resources
[INFO] 
[INFO] --- maven-compiler-plugin:3.2:testCompile (default-testCompile) @ hbase-protocol-shaded
---
[INFO] No sources to compile
[INFO] 
[INFO] --- maven-surefire-plugin:2.18.1:test (default-test) @ hbase-protocol-shaded ---
[INFO] Tests are skipped.
[INFO] 
[INFO] --- maven-surefire-plugin:2.18.1:test (secondPartTestsExecution) @ hbase-protocol-shaded
---
[INFO] Tests are skipped.
[INFO] 
[INFO] --- maven-source-plugin:2.2.1:jar-no-fork (attach-sources) @ hbase-protocol-shaded
---
[INFO] Building jar: <https://builds.apache.org/job/HBASE-16264/jdk=JDK%201.8%20(latest),label=yahoo-not-h2/ws/hbase-protocol-shaded/target/hbase-protocol-shaded-2.0.0-SNAPSHOT-sources.jar>
[INFO] 
[INFO] --- maven-jar-plugin:2.4:test-jar (default) @ hbase-protocol-shaded ---
[INFO] Building jar: <https://builds.apache.org/job/HBASE-16264/jdk=JDK%201.8%20(latest),label=yahoo-not-h2/ws/hbase-protocol-shaded/target/hbase-protocol-shaded-2.0.0-SNAPSHOT-tests.jar>
[INFO] 
[INFO] --- maven-jar-plugin:2.4:jar (default-jar) @ hbase-protocol-shaded ---
[INFO] Building jar: <https://builds.apache.org/job/HBASE-16264/jdk=JDK%201.8%20(latest),label=yahoo-not-h2/ws/hbase-protocol-shaded/target/hbase-protocol-shaded-2.0.0-SNAPSHOT.jar>
[INFO] ------------------------------------------------------------------------
[INFO] Reactor Summary:
[INFO] 
[INFO] Apache HBase ...................................... SUCCESS [4.794s]
[INFO] Apache HBase - Checkstyle ......................... SUCCESS [1.099s]
[INFO] Apache HBase - Resource Bundle .................... SUCCESS [0.656s]
[INFO] Apache HBase - Annotations ........................ SUCCESS [1.663s]
[INFO] Apache HBase - Common ............................. SUCCESS [18.941s]
[INFO] Apache HBase - Protocol ........................... SUCCESS [1:28.541s]
[INFO] Apache HBase - Shaded Protocol .................... FAILURE [2.592s]
[INFO] Apache HBase - Procedure .......................... SKIPPED
[INFO] Apache HBase - Client ............................. SKIPPED
[INFO] Apache HBase - Hadoop Compatibility ............... SKIPPED
[INFO] Apache HBase - Hadoop Two Compatibility ........... SKIPPED
[INFO] Apache HBase - Prefix Tree ........................ SKIPPED
[INFO] Apache HBase - Server ............................. SKIPPED
[INFO] Apache HBase - Testing Util ....................... SKIPPED
[INFO] Apache HBase - Thrift ............................. SKIPPED
[INFO] Apache HBase - RSGroup ............................ SKIPPED
[INFO] Apache HBase - Shell .............................. SKIPPED
[INFO] Apache HBase - Coprocessor Endpoint ............... SKIPPED
[INFO] Apache HBase - Integration Tests .................. SKIPPED
[INFO] Apache HBase - Examples ........................... SKIPPED
[INFO] Apache HBase - Rest ............................... SKIPPED
[INFO] Apache HBase - External Block Cache ............... SKIPPED
[INFO] Apache HBase - Spark .............................. SKIPPED
[INFO] Apache HBase - Assembly ........................... SKIPPED
[INFO] Apache HBase - Shaded ............................. SKIPPED
[INFO] Apache HBase - Shaded - Client .................... SKIPPED
[INFO] Apache HBase - Shaded - Server .................... SKIPPED
[INFO] Apache HBase - Archetypes ......................... SKIPPED
[INFO] Apache HBase - Exemplar for hbase-client archetype  SKIPPED
[INFO] Apache HBase - Exemplar for hbase-shaded-client archetype  SKIPPED
[INFO] Apache HBase - Archetype builder .................. SKIPPED
[INFO] ------------------------------------------------------------------------
[INFO] BUILD FAILURE
[INFO] ------------------------------------------------------------------------
[INFO] Total time: 1:59.737s
[INFO] Finished at: Sat Oct 01 19:14:23 UTC 2016
[INFO] Final Memory: 132M/4420M
[INFO] ------------------------------------------------------------------------
[ERROR] Failed to execute goal org.apache.maven.plugins:maven-jar-plugin:2.4:jar (default-jar)
on project hbase-protocol-shaded: Error assembling JAR: A zip file cannot include itself ->
[Help 1]
[ERROR] 
[ERROR] To see the full stack trace of the errors, re-run Maven with the -e switch.
[ERROR] Re-run Maven using the -X switch to enable full debug logging.
[ERROR] 
[ERROR] For more information about the errors and possible solutions, please read the following
articles:
[ERROR] [Help 1] http://cwiki.apache.org/confluence/display/MAVEN/MojoExecutionException
[ERROR] 
[ERROR] After correcting the problems, you can resume the build with the command
[ERROR]   mvn <goals> -rf :hbase-protocol-shaded
Build step 'Invoke top-level Maven targets' marked build as failure
Performing Post build task...
Match found for :.* : True
Logical operation result is TRUE
Running script  : # Run zombie detector script
./dev-support/zombie-detector.sh --jenkins ${BUILD_ID}
[05166ef6] $ /bin/bash -xe /tmp/hudson5662236249111107888.sh
+ ./dev-support/zombie-detector.sh --jenkins 15
Sat Oct  1 19:14:25 UTC 2016 We're ok: there is no zombie test


    {color:green}+1 zombies{color}. No zombie tests found running at the end of the build.
POST BUILD TASK : SUCCESS
END OF POST BUILD TASK : 0
Archiving artifacts
Compressed 5.25 MB of artifacts by 50.6% relative to #8
Recording test results
ERROR: Step ?Publish JUnit test result report? failed: No test report files were found. Configuration
error?
[FINDBUGS] Skipping publisher since build result is FAILURE
[CHECKSTYLE] Skipping publisher since build result is FAILURE

Mime
View raw message