hbase-builds mailing list archives

Site index · List index
Message view « Date » · « Thread »
Top « Date » · « Thread »
From Apache Jenkins Server <jenk...@builds.apache.org>
Subject Build failed in Jenkins: HBase-1.4 » JDK_1_7,yahoo-not-h2 #457
Date Mon, 10 Oct 2016 14:28:47 GMT
See <https://builds.apache.org/job/HBase-1.4/jdk=JDK_1_7,label=yahoo-not-h2/457/changes>

Changes:

[busbey] HBASE-16701 rely on test category timeout instead of defining one on a

------------------------------------------
[...truncated 46411 lines...]
Running org.apache.hadoop.hbase.master.procedure.TestModifyTableProcedure
Tests run: 7, Failures: 0, Errors: 0, Skipped: 0, Time elapsed: 23.828 sec - in org.apache.hadoop.hbase.master.procedure.TestDeleteNamespaceProcedure
Running org.apache.hadoop.hbase.master.procedure.TestWALProcedureStoreOnHDFS
Tests run: 7, Failures: 0, Errors: 0, Skipped: 0, Time elapsed: 171.735 sec - in org.apache.hadoop.hbase.master.TestMasterFailover
Tests run: 5, Failures: 0, Errors: 0, Skipped: 0, Time elapsed: 43.018 sec - in org.apache.hadoop.hbase.master.procedure.TestModifyColumnFamilyProcedure
Running org.apache.hadoop.hbase.master.procedure.TestMasterProcedureEvents
Tests run: 8, Failures: 0, Errors: 0, Skipped: 0, Time elapsed: 59.927 sec - in org.apache.hadoop.hbase.master.procedure.TestCreateTableProcedure
Tests run: 2, Failures: 0, Errors: 0, Skipped: 0, Time elapsed: 15.439 sec - in org.apache.hadoop.hbase.master.procedure.TestMasterProcedureEvents
Running org.apache.hadoop.hbase.master.procedure.TestDisableTableProcedure
Tests run: 3, Failures: 0, Errors: 0, Skipped: 0, Time elapsed: 52.974 sec - in org.apache.hadoop.hbase.master.procedure.TestWALProcedureStoreOnHDFS
Running org.apache.hadoop.hbase.master.procedure.TestTruncateTableProcedure
Running org.apache.hadoop.hbase.master.procedure.TestDeleteColumnFamilyProcedureFromClient
Tests run: 8, Failures: 0, Errors: 0, Skipped: 0, Time elapsed: 77.888 sec - in org.apache.hadoop.hbase.master.procedure.TestModifyTableProcedure
Tests run: 4, Failures: 0, Errors: 0, Skipped: 0, Time elapsed: 29.117 sec - in org.apache.hadoop.hbase.master.procedure.TestDisableTableProcedure
Running org.apache.hadoop.hbase.master.procedure.TestDeleteTableProcedure
Running org.apache.hadoop.hbase.master.procedure.TestCreateTableProcedure2
Running org.apache.hadoop.hbase.master.procedure.TestCreateNamespaceProcedure
Tests run: 2, Failures: 0, Errors: 0, Skipped: 0, Time elapsed: 29.067 sec - in org.apache.hadoop.hbase.master.procedure.TestDeleteColumnFamilyProcedureFromClient
Running org.apache.hadoop.hbase.master.procedure.TestServerCrashProcedure
Tests run: 1, Failures: 0, Errors: 0, Skipped: 0, Time elapsed: 18.146 sec - in org.apache.hadoop.hbase.master.procedure.TestCreateTableProcedure2
Tests run: 8, Failures: 0, Errors: 0, Skipped: 0, Time elapsed: 16.428 sec - in org.apache.hadoop.hbase.master.procedure.TestCreateNamespaceProcedure
Tests run: 7, Failures: 0, Errors: 0, Skipped: 0, Time elapsed: 32.796 sec - in org.apache.hadoop.hbase.master.procedure.TestDeleteTableProcedure
Running org.apache.hadoop.hbase.master.TestMasterStatusServlet
Tests run: 4, Failures: 0, Errors: 0, Skipped: 0, Time elapsed: 2.256 sec - in org.apache.hadoop.hbase.master.TestMasterStatusServlet
Running org.apache.hadoop.hbase.master.procedure.TestDeleteColumnFamilyProcedure
Running org.apache.hadoop.hbase.master.handler.TestEnableTableHandler
Running org.apache.hadoop.hbase.master.procedure.TestProcedureAdmin
Tests run: 6, Failures: 0, Errors: 0, Skipped: 0, Time elapsed: 64.339 sec - in org.apache.hadoop.hbase.master.procedure.TestTruncateTableProcedure
Tests run: 1, Failures: 0, Errors: 0, Skipped: 0, Time elapsed: 33.324 sec - in org.apache.hadoop.hbase.master.procedure.TestServerCrashProcedure
Running org.apache.hadoop.hbase.master.handler.TestCreateTableHandler
Running org.apache.hadoop.hbase.master.TestMasterNoCluster
Tests run: 5, Failures: 0, Errors: 0, Skipped: 0, Time elapsed: 24.648 sec - in org.apache.hadoop.hbase.master.procedure.TestProcedureAdmin
Tests run: 3, Failures: 0, Errors: 0, Skipped: 0, Time elapsed: 18.715 sec - in org.apache.hadoop.hbase.master.TestMasterNoCluster
Running org.apache.hadoop.hbase.master.normalizer.TestSimpleRegionNormalizerOnCluster
Tests run: 8, Failures: 0, Errors: 0, Skipped: 0, Time elapsed: 58.239 sec - in org.apache.hadoop.hbase.master.procedure.TestDeleteColumnFamilyProcedure
Running org.apache.hadoop.hbase.master.TestMaster
Running org.apache.hadoop.hbase.master.TestGetLastFlushedSequenceId
Tests run: 3, Failures: 0, Errors: 0, Skipped: 0, Time elapsed: 54.61 sec - in org.apache.hadoop.hbase.master.handler.TestCreateTableHandler
Running org.apache.hadoop.hbase.master.snapshot.TestSnapshotFileCache
Tests run: 4, Failures: 0, Errors: 0, Skipped: 0, Time elapsed: 22.737 sec - in org.apache.hadoop.hbase.master.TestMaster
Tests run: 3, Failures: 0, Errors: 0, Skipped: 0, Time elapsed: 88.121 sec - in org.apache.hadoop.hbase.master.handler.TestEnableTableHandler
Tests run: 1, Failures: 0, Errors: 0, Skipped: 0, Time elapsed: 29.813 sec - in org.apache.hadoop.hbase.master.TestGetLastFlushedSequenceId
Running org.apache.hadoop.hbase.master.TestMasterFailoverBalancerPersistence
Tests run: 2, Failures: 0, Errors: 0, Skipped: 0, Time elapsed: 40.176 sec - in org.apache.hadoop.hbase.master.normalizer.TestSimpleRegionNormalizerOnCluster
Running org.apache.hadoop.hbase.master.TestAssignmentManagerMetrics
Running org.apache.hadoop.hbase.master.TestMetaShutdownHandler
Tests run: 1, Failures: 0, Errors: 0, Skipped: 0, Time elapsed: 10.914 sec - in org.apache.hadoop.hbase.master.TestAssignmentManagerMetrics
Running org.apache.hadoop.hbase.master.TestGetInfoPort
Running org.apache.hadoop.hbase.master.TestMasterMetrics
Tests run: 1, Failures: 0, Errors: 0, Skipped: 0, Time elapsed: 24.568 sec - in org.apache.hadoop.hbase.master.TestMasterFailoverBalancerPersistence
Running org.apache.hadoop.hbase.master.TestRollingRestart
Tests run: 3, Failures: 0, Errors: 0, Skipped: 0, Time elapsed: 2.397 sec - in org.apache.hadoop.hbase.master.TestMasterMetrics
Running org.apache.hadoop.hbase.master.TestMasterShutdown
Tests run: 4, Failures: 0, Errors: 0, Skipped: 0, Time elapsed: 40.469 sec - in org.apache.hadoop.hbase.master.snapshot.TestSnapshotFileCache
Running org.apache.hadoop.hbase.master.TestRestartCluster
Tests run: 1, Failures: 0, Errors: 0, Skipped: 0, Time elapsed: 19.495 sec - in org.apache.hadoop.hbase.master.TestGetInfoPort
Running org.apache.hadoop.hbase.master.cleaner.TestLogsCleaner
Tests run: 1, Failures: 0, Errors: 0, Skipped: 0, Time elapsed: 32.149 sec - in org.apache.hadoop.hbase.master.TestMetaShutdownHandler
Tests run: 3, Failures: 0, Errors: 0, Skipped: 0, Time elapsed: 12.814 sec - in org.apache.hadoop.hbase.master.cleaner.TestLogsCleaner
Tests run: 2, Failures: 0, Errors: 0, Skipped: 0, Time elapsed: 37.132 sec - in org.apache.hadoop.hbase.master.TestMasterShutdown
Running org.apache.hadoop.hbase.master.cleaner.TestHFileCleaner
Running org.apache.hadoop.hbase.master.TestMasterTransitions
Tests run: 3, Failures: 0, Errors: 0, Skipped: 3, Time elapsed: 0.001 sec - in org.apache.hadoop.hbase.master.TestMasterTransitions
Tests run: 3, Failures: 0, Errors: 0, Skipped: 0, Time elapsed: 1.328 sec - in org.apache.hadoop.hbase.master.cleaner.TestHFileCleaner
Running org.apache.hadoop.hbase.master.TestClusterStatusPublisher
Tests run: 3, Failures: 0, Errors: 0, Skipped: 0, Time elapsed: 0.512 sec - in org.apache.hadoop.hbase.master.TestClusterStatusPublisher
Running org.apache.hadoop.hbase.master.cleaner.TestSnapshotFromMaster
Tests run: 1, Failures: 0, Errors: 0, Skipped: 0, Time elapsed: 54.982 sec - in org.apache.hadoop.hbase.master.TestRollingRestart
Running org.apache.hadoop.hbase.master.TestHMasterRPCException
Running org.apache.hadoop.hbase.master.TestMasterMetricsWrapper
Tests run: 1, Failures: 0, Errors: 0, Skipped: 0, Time elapsed: 5.783 sec - in org.apache.hadoop.hbase.master.TestHMasterRPCException
Running org.apache.hadoop.hbase.master.TestTableLockManager
Tests run: 1, Failures: 0, Errors: 0, Skipped: 0, Time elapsed: 3.078 sec - in org.apache.hadoop.hbase.master.TestMasterMetricsWrapper
Running org.apache.hadoop.hbase.master.TestAssignmentListener
Tests run: 2, Failures: 0, Errors: 0, Skipped: 0, Time elapsed: 17.481 sec - in org.apache.hadoop.hbase.master.TestAssignmentListener
Running org.apache.hadoop.hbase.master.TestOpenedRegionHandler
Running org.apache.hadoop.hbase.master.TestWarmupRegion
Tests run: 3, Failures: 0, Errors: 0, Skipped: 0, Time elapsed: 87.583 sec - in org.apache.hadoop.hbase.master.TestRestartCluster
Running org.apache.hadoop.hbase.master.balancer.TestDefaultLoadBalancer
Tests run: 1, Failures: 0, Errors: 0, Skipped: 0, Time elapsed: 2.42 sec - in org.apache.hadoop.hbase.master.balancer.TestDefaultLoadBalancer
Running org.apache.hadoop.hbase.master.balancer.TestStochasticLoadBalancer
Tests run: 4, Failures: 0, Errors: 0, Skipped: 0, Time elapsed: 57.687 sec - in org.apache.hadoop.hbase.master.cleaner.TestSnapshotFromMaster
Running org.apache.hadoop.hbase.master.balancer.TestBaseLoadBalancer
Tests run: 7, Failures: 0, Errors: 0, Skipped: 0, Time elapsed: 1.027 sec - in org.apache.hadoop.hbase.master.balancer.TestBaseLoadBalancer
Tests run: 2, Failures: 0, Errors: 0, Skipped: 0, Time elapsed: 28.335 sec - in org.apache.hadoop.hbase.master.TestOpenedRegionHandler
Running org.apache.hadoop.hbase.master.TestMasterRestartAfterDisablingTable
Running org.apache.hadoop.hbase.master.balancer.TestStochasticLoadBalancer2
Tests run: 1, Failures: 0, Errors: 0, Skipped: 0, Time elapsed: 53.746 sec - in org.apache.hadoop.hbase.master.TestWarmupRegion
Tests run: 1, Failures: 0, Errors: 0, Skipped: 0, Time elapsed: 30.405 sec - in org.apache.hadoop.hbase.master.TestMasterRestartAfterDisablingTable
Running org.apache.hadoop.hbase.master.TestDistributedLogSplitting
Running org.apache.hadoop.hbase.master.TestAssignmentManagerOnCluster
Tests run: 4, Failures: 0, Errors: 0, Skipped: 0, Time elapsed: 127.532 sec - in org.apache.hadoop.hbase.master.TestTableLockManager
Running org.apache.hadoop.hbase.TestMetaTableAccessorNoCluster
Tests run: 2, Failures: 0, Errors: 0, Skipped: 0, Time elapsed: 3.481 sec - in org.apache.hadoop.hbase.TestMetaTableAccessorNoCluster
Running org.apache.hadoop.hbase.mapred.TestTableSnapshotInputFormat
Tests run: 18, Failures: 0, Errors: 0, Skipped: 15, Time elapsed: 81.677 sec - in org.apache.hadoop.hbase.master.TestDistributedLogSplitting
Running org.apache.hadoop.hbase.mapred.TestMultiTableSnapshotInputFormat
Tests run: 4, Failures: 0, Errors: 0, Skipped: 0, Time elapsed: 47.372 sec - in org.apache.hadoop.hbase.mapred.TestMultiTableSnapshotInputFormat
Running org.apache.hadoop.hbase.mapred.TestTableMapReduceUtil
Tests run: 21, Failures: 0, Errors: 0, Skipped: 0, Time elapsed: 198.379 sec - in org.apache.hadoop.hbase.master.TestAssignmentManagerOnCluster
Tests run: 7, Failures: 0, Errors: 0, Skipped: 0, Time elapsed: 164.338 sec - in org.apache.hadoop.hbase.mapred.TestTableSnapshotInputFormat
Running org.apache.hadoop.hbase.mapred.TestTableMapReduce

Results :

Tests in error: 
  TestClusterId.testClusterId:85 » IO Shutting down

Tests run: 2389, Failures: 0, Errors: 1, Skipped: 53

Running org.apache.hadoop.hbase.mapred.TestTableInputFormat
[INFO] ------------------------------------------------------------------------
[INFO] Reactor Summary:
[INFO] 
[INFO] Apache HBase ...................................... SUCCESS [1:54.230s]
[INFO] Apache HBase - Checkstyle ......................... SUCCESS [10.638s]
[INFO] Apache HBase - Resource Bundle .................... SUCCESS [0.256s]
[INFO] Apache HBase - Annotations ........................ SUCCESS [1.635s]
[INFO] Apache HBase - Protocol ........................... SUCCESS [22.462s]
[INFO] Apache HBase - Common ............................. SUCCESS [3:12.544s]
[INFO] Apache HBase - Procedure .......................... SUCCESS [3:52.308s]
[INFO] Apache HBase - Client ............................. SUCCESS [1:53.478s]
[INFO] Apache HBase - Hadoop Compatibility ............... SUCCESS [10.845s]
[INFO] Apache HBase - Hadoop Two Compatibility ........... SUCCESS [14.226s]
[INFO] Apache HBase - Prefix Tree ........................ SUCCESS [11.623s]
[INFO] Apache HBase - Server ............................. FAILURE [2:03:44.085s]
[INFO] Apache HBase - Testing Util ....................... SKIPPED
[INFO] Apache HBase - Thrift ............................. SKIPPED
[INFO] Apache HBase - Rest ............................... SKIPPED
[INFO] Apache HBase - Shell .............................. SKIPPED
[INFO] Apache HBase - Integration Tests .................. SKIPPED
[INFO] Apache HBase - Examples ........................... SKIPPED
[INFO] Apache HBase - External Block Cache ............... SKIPPED
[INFO] Apache HBase - Assembly ........................... SKIPPED
[INFO] Apache HBase - Shaded ............................. SKIPPED
[INFO] Apache HBase - Shaded - Client .................... SKIPPED
[INFO] Apache HBase - Shaded - Server .................... SKIPPED
[INFO] Apache HBase - Archetypes ......................... SKIPPED
[INFO] Apache HBase - Exemplar for hbase-client archetype  SKIPPED
[INFO] Apache HBase - Exemplar for hbase-shaded-client archetype  SKIPPED
[INFO] Apache HBase - Archetype builder .................. SKIPPED
[INFO] ------------------------------------------------------------------------
[INFO] BUILD FAILURE
[INFO] ------------------------------------------------------------------------
[INFO] Total time: 2:16:24.005s
[INFO] Finished at: Mon Oct 10 14:19:00 UTC 2016
[INFO] Final Memory: 486M/612M
[INFO] ------------------------------------------------------------------------
[ERROR] Failed to execute goal org.apache.maven.plugins:maven-surefire-plugin:2.18.1:test
(secondPartTestsExecution) on project hbase-server: ExecutionException: java.lang.RuntimeException:
java.lang.RuntimeException: org.apache.maven.surefire.report.ReporterException: When writing
xml report stdout/stderr: /tmp/stderr1696560452228727758deferred (No such file or directory)
-> [Help 1]
[ERROR] 
[ERROR] To see the full stack trace of the errors, re-run Maven with the -e switch.
[ERROR] Re-run Maven using the -X switch to enable full debug logging.
[ERROR] 
[ERROR] For more information about the errors and possible solutions, please read the following
articles:
[ERROR] [Help 1] http://cwiki.apache.org/confluence/display/MAVEN/MojoFailureException
[ERROR] 
[ERROR] After correcting the problems, you can resume the build with the command
[ERROR]   mvn <goals> -rf :hbase-server
Build step 'Invoke top-level Maven targets' marked build as failure
Performing Post build task...
Match found for :.* : True
Logical operation result is TRUE
Running script  : # Post-build task script. TODO: Check this in and have all builds reference
check-in.
pwd && ls
# NOTE!!!! The below code has been copied and pasted from ./dev-tools/run-test.sh
# Do not change here without syncing there and vice-versa.
ZOMBIE_TESTS_COUNT=`jps -v | grep surefirebooter | grep -e '-Dhbase.test' | wc -l`
if [[ $ZOMBIE_TESTS_COUNT != 0 ]] ; then
 echo "Suspicious java process found - waiting 30s to see if there are just slow to stop"
 sleep 30
 ZOMBIE_TESTS_COUNT=`jps -v | grep surefirebooter | grep -e '-Dhbase.test' | wc -l`
 if [[ $ZOMBIE_TESTS_COUNT != 0 ]] ; then
   echo " {color:red}There appear to be $ZOMBIE_TESTS_COUNT zombie tests{color}, they should
have been killed by surefire but survived"
   jps -v | grep surefirebooter | grep -e '-Dhbase.test'
   jps -v | grep surefirebooter | grep -e '-Dhbase.test' | cut -d ' ' -f 1 | xargs -n 1 jstack
   # Exit with error
   exit 1
 else
   echo "We're ok: there is no zombie test, but some tests took some time to stop"
 fi
else
  echo "We're ok: there is no zombie test"
fi
Setting JDK_1_7_LATEST__HOME=/home/jenkins/tools/java/latest1.7
Setting JDK_1_8_LATEST__HOME=/home/jenkins/tools/java/latest1.8
[yahoo-not-h2] $ /bin/bash -xe /tmp/hudson2181407956951904172.sh
+ pwd
<https://builds.apache.org/job/HBase-1.4/jdk=JDK_1_7,label=yahoo-not-h2/ws/>
+ ls
bin
CHANGES.txt
conf
dev-support
extra_env_var
hbase-annotations
hbase-archetypes
hbase-assembly
hbase-checkstyle
hbase-client
hbase-common
hbase-examples
hbase-external-blockcache
hbase-hadoop2-compat
hbase-hadoop-compat
hbase-it
hbase-native-client
hbase-prefix-tree
hbase-procedure
hbase-protocol
hbase-resource-bundle
hbase-rest
hbase-server
hbase-shaded
hbase-shell
hbase-testing-util
hbase-thrift
LICENSE.txt
NOTICE.txt
pom.xml
README.txt
src
target
++ grep surefirebooter
++ jps -v
++ grep -e -Dhbase.test
++ wc -l
+ ZOMBIE_TESTS_COUNT=2
+ [[ 2 != 0 ]]
+ echo 'Suspicious java process found - waiting 30s to see if there are just slow to stop'
Suspicious java process found - waiting 30s to see if there are just slow to stop
+ sleep 30
++ jps -v
++ grep surefirebooter
++ grep -e -Dhbase.test
++ wc -l
+ ZOMBIE_TESTS_COUNT=0
+ [[ 0 != 0 ]]
+ echo 'We'\''re ok: there is no zombie test, but some tests took some time to stop'
We're ok: there is no zombie test, but some tests took some time to stop
POST BUILD TASK : SUCCESS
END OF POST BUILD TASK : 0
Archiving artifacts
Setting JDK_1_7_LATEST__HOME=/home/jenkins/tools/java/latest1.7
Setting JDK_1_8_LATEST__HOME=/home/jenkins/tools/java/latest1.8
Recording test results
Setting JDK_1_7_LATEST__HOME=/home/jenkins/tools/java/latest1.7
Setting JDK_1_8_LATEST__HOME=/home/jenkins/tools/java/latest1.8
Setting JDK_1_7_LATEST__HOME=/home/jenkins/tools/java/latest1.7
Setting JDK_1_8_LATEST__HOME=/home/jenkins/tools/java/latest1.8

Mime
View raw message