hbase-builds mailing list archives

Site index · List index
Message view « Date » · « Thread »
Top « Date » · « Thread »
From Apache Jenkins Server <jenk...@builds.apache.org>
Subject Build failed in Jenkins: HBase-Trunk_matrix » JDK 1.8 (latest),yahoo-not-h2 #1530
Date Sat, 03 Sep 2016 01:27:38 GMT
See <https://builds.apache.org/job/HBase-Trunk_matrix/jdk=JDK%201.8%20(latest),label=yahoo-not-h2/1530/changes>

Changes:

[appy] HBASE-16538 Changes the way version information is stored during build.

[matteo.bertozzi] HBASE-16552 MiniHBaseCluster#getServerWith() does not ignore stopped RSs

------------------------------------------
[...truncated 357 lines...]
[INFO] 
[INFO] --- maven-jar-plugin:2.4:jar (default-jar) @ hbase-annotations ---
[INFO] Building jar: <https://builds.apache.org/job/HBase-Trunk_matrix/jdk=JDK%201.8%20(latest),label=yahoo-not-h2/ws/hbase-annotations/target/hbase-annotations-2.0.0-SNAPSHOT.jar>
[INFO] 
[INFO] --- findbugs-maven-plugin:3.0.0:findbugs (default-cli) @ hbase-annotations ---
[INFO] Fork Value is true
[INFO] Done FindBugs Analysis....
[INFO]                                                                         
[INFO] ------------------------------------------------------------------------
[INFO] Building Apache HBase - Protocol 2.0.0-SNAPSHOT
[INFO] ------------------------------------------------------------------------
[INFO] 
[INFO] --- maven-clean-plugin:2.5:clean (default-clean) @ hbase-protocol ---
[INFO] 
[INFO] --- maven-enforcer-plugin:1.0.1:enforce (min-maven-min-java-banned-xerces) @ hbase-protocol
---
[INFO] 
[INFO] --- maven-enforcer-plugin:1.0.1:enforce (banned-jsr305) @ hbase-protocol ---
[INFO] 
[INFO] --- buildnumber-maven-plugin:1.3:create-timestamp (default) @ hbase-protocol ---
[INFO] 
[INFO] --- maven-remote-resources-plugin:1.5:process (default) @ hbase-protocol ---
[INFO] 
[INFO] --- maven-resources-plugin:2.6:resources (default-resources) @ hbase-protocol ---
[INFO] Using 'UTF-8' encoding to copy filtered resources.
[INFO] skip non existing resourceDirectory <https://builds.apache.org/job/HBase-Trunk_matrix/jdk=JDK%201.8%20(latest),label=yahoo-not-h2/ws/hbase-protocol/src/main/resources>
[INFO] Copying 3 resources
[INFO] 
[INFO] --- maven-compiler-plugin:3.2:compile (default-compile) @ hbase-protocol ---
[INFO] Compiling 58 source files to <https://builds.apache.org/job/HBase-Trunk_matrix/jdk=JDK%201.8%20(latest),label=yahoo-not-h2/ws/hbase-protocol/target/classes>
[INFO] 
[INFO] --- maven-resources-plugin:2.6:testResources (default-testResources) @ hbase-protocol
---
[INFO] Using 'UTF-8' encoding to copy filtered resources.
[INFO] skip non existing resourceDirectory <https://builds.apache.org/job/HBase-Trunk_matrix/jdk=JDK%201.8%20(latest),label=yahoo-not-h2/ws/hbase-protocol/src/test/resources>
[INFO] Copying 3 resources
[INFO] 
[INFO] --- maven-compiler-plugin:3.2:testCompile (default-testCompile) @ hbase-protocol ---
[INFO] No sources to compile
[INFO] 
[INFO] --- maven-surefire-plugin:2.18.1:test (default-test) @ hbase-protocol ---
[INFO] Tests are skipped.
[INFO] 
[INFO] --- maven-surefire-plugin:2.18.1:test (secondPartTestsExecution) @ hbase-protocol ---
[INFO] Tests are skipped.
[INFO] 
[INFO] --- maven-source-plugin:2.2.1:jar-no-fork (attach-sources) @ hbase-protocol ---
[INFO] Building jar: <https://builds.apache.org/job/HBase-Trunk_matrix/jdk=JDK%201.8%20(latest),label=yahoo-not-h2/ws/hbase-protocol/target/hbase-protocol-2.0.0-SNAPSHOT-sources.jar>
[INFO] 
[INFO] --- maven-jar-plugin:2.4:test-jar (default) @ hbase-protocol ---
[INFO] Building jar: <https://builds.apache.org/job/HBase-Trunk_matrix/jdk=JDK%201.8%20(latest),label=yahoo-not-h2/ws/hbase-protocol/target/hbase-protocol-2.0.0-SNAPSHOT-tests.jar>
[INFO] 
[INFO] --- maven-jar-plugin:2.4:jar (default-jar) @ hbase-protocol ---
[INFO] Building jar: <https://builds.apache.org/job/HBase-Trunk_matrix/jdk=JDK%201.8%20(latest),label=yahoo-not-h2/ws/hbase-protocol/target/hbase-protocol-2.0.0-SNAPSHOT.jar>
[INFO] 
[INFO] --- findbugs-maven-plugin:3.0.0:findbugs (default-cli) @ hbase-protocol ---
[INFO] Fork Value is true
[INFO] Done FindBugs Analysis....
[INFO]                                                                         
[INFO] ------------------------------------------------------------------------
[INFO] Building Apache HBase - Common 2.0.0-SNAPSHOT
[INFO] ------------------------------------------------------------------------
[INFO] 
[INFO] --- maven-clean-plugin:2.5:clean (default-clean) @ hbase-common ---
[INFO] 
[INFO] --- maven-enforcer-plugin:1.0.1:enforce (min-maven-min-java-banned-xerces) @ hbase-common
---
[INFO] 
[INFO] --- maven-enforcer-plugin:1.0.1:enforce (banned-jsr305) @ hbase-common ---
[INFO] 
[INFO] --- buildnumber-maven-plugin:1.3:create-timestamp (default) @ hbase-common ---
[INFO] 
[INFO] --- maven-antrun-plugin:1.8:run (generate) @ hbase-common ---
[INFO] Executing tasks

main:
     [exec] bash: /home/jenkins/jenkins-slave/workspace/HBase-Trunk_matrix/jdk/JDK: No such
file or directory
     [exec] Result: 127
[INFO] Executed tasks
[INFO] 
[INFO] --- build-helper-maven-plugin:1.9.1:add-source (versionInfo-source) @ hbase-common
---
[INFO] Source directory: <https://builds.apache.org/job/HBase-Trunk_matrix/jdk=JDK%201.8%20(latest),label=yahoo-not-h2/ws/hbase-common/target/generated-sources/java>
added.
[INFO] 
[INFO] --- maven-remote-resources-plugin:1.5:process (default) @ hbase-common ---
[INFO] 
[INFO] --- maven-resources-plugin:2.6:resources (default-resources) @ hbase-common ---
[INFO] Using 'UTF-8' encoding to copy filtered resources.
[INFO] Copying 1 resource
[INFO] Copying 3 resources
[INFO] 
[INFO] --- maven-antrun-plugin:1.8:run (default) @ hbase-common ---
[INFO] Executing tasks

main:
[INFO] Executed tasks
[INFO] 
[INFO] --- maven-compiler-plugin:3.2:compile (default-compile) @ hbase-common ---
[INFO] Compiling 236 source files to <https://builds.apache.org/job/HBase-Trunk_matrix/jdk=JDK%201.8%20(latest),label=yahoo-not-h2/ws/hbase-common/target/classes>
[INFO] <https://builds.apache.org/job/HBase-Trunk_matrix/jdk=JDK%201.8%20(latest),label=yahoo-not-h2/ws/hbase-common/src/main/java/org/apache/hadoop/hbase/TableName.java>:
Some input files use or override a deprecated API.
[INFO] <https://builds.apache.org/job/HBase-Trunk_matrix/jdk=JDK%201.8%20(latest),label=yahoo-not-h2/ws/hbase-common/src/main/java/org/apache/hadoop/hbase/TableName.java>:
Recompile with -Xlint:deprecation for details.
[INFO] <https://builds.apache.org/job/HBase-Trunk_matrix/jdk=JDK%201.8%20(latest),label=yahoo-not-h2/ws/hbase-common/src/main/java/org/apache/hadoop/hbase/types/CopyOnWriteArrayMap.java>:
Some input files use unchecked or unsafe operations.
[INFO] <https://builds.apache.org/job/HBase-Trunk_matrix/jdk=JDK%201.8%20(latest),label=yahoo-not-h2/ws/hbase-common/src/main/java/org/apache/hadoop/hbase/types/CopyOnWriteArrayMap.java>:
Recompile with -Xlint:unchecked for details.
[INFO] -------------------------------------------------------------
[WARNING] COMPILATION WARNING : 
[INFO] -------------------------------------------------------------
[WARNING] <https://builds.apache.org/job/HBase-Trunk_matrix/jdk=JDK%201.8%20(latest),label=yahoo-not-h2/ws/hbase-common/src/main/java/org/apache/hadoop/hbase/util/Bytes.java>:[51,16]
sun.misc.Unsafe is internal proprietary API and may be removed in a future release
[WARNING] <https://builds.apache.org/job/HBase-Trunk_matrix/jdk=JDK%201.8%20(latest),label=yahoo-not-h2/ws/hbase-common/src/main/java/org/apache/hadoop/hbase/util/UnsafeAccess.java>:[31,16]
sun.misc.Unsafe is internal proprietary API and may be removed in a future release
[WARNING] <https://builds.apache.org/job/HBase-Trunk_matrix/jdk=JDK%201.8%20(latest),label=yahoo-not-h2/ws/hbase-common/src/main/java/org/apache/hadoop/hbase/util/UnsafeAccess.java>:[32,18]
sun.nio.ch.DirectBuffer is internal proprietary API and may be removed in a future release
[WARNING] <https://builds.apache.org/job/HBase-Trunk_matrix/jdk=JDK%201.8%20(latest),label=yahoo-not-h2/ws/hbase-common/src/main/java/org/apache/hadoop/hbase/util/ByteBufferUtils.java>:[36,18]
sun.nio.ch.DirectBuffer is internal proprietary API and may be removed in a future release
[WARNING] <https://builds.apache.org/job/HBase-Trunk_matrix/jdk=JDK%201.8%20(latest),label=yahoo-not-h2/ws/hbase-common/src/main/java/org/apache/hadoop/hbase/nio/SingleByteBuff.java>:[28,18]
sun.nio.ch.DirectBuffer is internal proprietary API and may be removed in a future release
[WARNING] unknown enum constant javax.annotation.meta.When.ALWAYS
  reason: class file for javax.annotation.meta.When not found
[WARNING] <https://builds.apache.org/job/HBase-Trunk_matrix/jdk=JDK%201.8%20(latest),label=yahoo-not-h2/ws/hbase-common/src/main/java/org/apache/hadoop/hbase/util/Bytes.java>:[1482,20]
sun.misc.Unsafe is internal proprietary API and may be removed in a future release
[WARNING] <https://builds.apache.org/job/HBase-Trunk_matrix/jdk=JDK%201.8%20(latest),label=yahoo-not-h2/ws/hbase-common/src/main/java/org/apache/hadoop/hbase/util/UnsafeAccess.java>:[40,16]
sun.misc.Unsafe is internal proprietary API and may be removed in a future release
[WARNING] <https://builds.apache.org/job/HBase-Trunk_matrix/jdk=JDK%201.8%20(latest),label=yahoo-not-h2/ws/hbase-common/src/main/java/org/apache/hadoop/hbase/util/UnsafeAccess.java>:[53,18]
sun.misc.Unsafe is internal proprietary API and may be removed in a future release
[WARNING] <https://builds.apache.org/job/HBase-Trunk_matrix/jdk=JDK%201.8%20(latest),label=yahoo-not-h2/ws/hbase-common/src/main/java/org/apache/hadoop/hbase/util/UnsafeAccess.java>:[57,21]
sun.misc.Unsafe is internal proprietary API and may be removed in a future release
[WARNING] <https://builds.apache.org/job/HBase-Trunk_matrix/jdk=JDK%201.8%20(latest),label=yahoo-not-h2/ws/hbase-common/src/main/java/org/apache/hadoop/hbase/util/UnsafeAccess.java>:[203,35]
sun.nio.ch.DirectBuffer is internal proprietary API and may be removed in a future release
[WARNING] <https://builds.apache.org/job/HBase-Trunk_matrix/jdk=JDK%201.8%20(latest),label=yahoo-not-h2/ws/hbase-common/src/main/java/org/apache/hadoop/hbase/util/UnsafeAccess.java>:[245,33]
sun.nio.ch.DirectBuffer is internal proprietary API and may be removed in a future release
[WARNING] <https://builds.apache.org/job/HBase-Trunk_matrix/jdk=JDK%201.8%20(latest),label=yahoo-not-h2/ws/hbase-common/src/main/java/org/apache/hadoop/hbase/util/UnsafeAccess.java>:[287,34]
sun.nio.ch.DirectBuffer is internal proprietary API and may be removed in a future release
[WARNING] <https://builds.apache.org/job/HBase-Trunk_matrix/jdk=JDK%201.8%20(latest),label=yahoo-not-h2/ws/hbase-common/src/main/java/org/apache/hadoop/hbase/util/UnsafeAccess.java>:[304,26]
sun.nio.ch.DirectBuffer is internal proprietary API and may be removed in a future release
[WARNING] <https://builds.apache.org/job/HBase-Trunk_matrix/jdk=JDK%201.8%20(latest),label=yahoo-not-h2/ws/hbase-common/src/main/java/org/apache/hadoop/hbase/util/UnsafeAccess.java>:[324,37]
sun.nio.ch.DirectBuffer is internal proprietary API and may be removed in a future release
[WARNING] <https://builds.apache.org/job/HBase-Trunk_matrix/jdk=JDK%201.8%20(latest),label=yahoo-not-h2/ws/hbase-common/src/main/java/org/apache/hadoop/hbase/util/UnsafeAccess.java>:[358,35]
sun.nio.ch.DirectBuffer is internal proprietary API and may be removed in a future release
[WARNING] <https://builds.apache.org/job/HBase-Trunk_matrix/jdk=JDK%201.8%20(latest),label=yahoo-not-h2/ws/hbase-common/src/main/java/org/apache/hadoop/hbase/util/UnsafeAccess.java>:[382,34]
sun.nio.ch.DirectBuffer is internal proprietary API and may be removed in a future release
[WARNING] <https://builds.apache.org/job/HBase-Trunk_matrix/jdk=JDK%201.8%20(latest),label=yahoo-not-h2/ws/hbase-common/src/main/java/org/apache/hadoop/hbase/util/UnsafeAccess.java>:[388,36]
sun.nio.ch.DirectBuffer is internal proprietary API and may be removed in a future release
[WARNING] <https://builds.apache.org/job/HBase-Trunk_matrix/jdk=JDK%201.8%20(latest),label=yahoo-not-h2/ws/hbase-common/src/main/java/org/apache/hadoop/hbase/util/UnsafeAccess.java>:[409,28]
sun.nio.ch.DirectBuffer is internal proprietary API and may be removed in a future release
[WARNING] <https://builds.apache.org/job/HBase-Trunk_matrix/jdk=JDK%201.8%20(latest),label=yahoo-not-h2/ws/hbase-common/src/main/java/org/apache/hadoop/hbase/util/UnsafeAccess.java>:[428,27]
sun.nio.ch.DirectBuffer is internal proprietary API and may be removed in a future release
[WARNING] <https://builds.apache.org/job/HBase-Trunk_matrix/jdk=JDK%201.8%20(latest),label=yahoo-not-h2/ws/hbase-common/src/main/java/org/apache/hadoop/hbase/util/UnsafeAccess.java>:[443,27]
sun.nio.ch.DirectBuffer is internal proprietary API and may be removed in a future release
[WARNING] <https://builds.apache.org/job/HBase-Trunk_matrix/jdk=JDK%201.8%20(latest),label=yahoo-not-h2/ws/hbase-common/src/main/java/org/apache/hadoop/hbase/util/UnsafeAccess.java>:[459,34]
sun.nio.ch.DirectBuffer is internal proprietary API and may be removed in a future release
[WARNING] <https://builds.apache.org/job/HBase-Trunk_matrix/jdk=JDK%201.8%20(latest),label=yahoo-not-h2/ws/hbase-common/src/main/java/org/apache/hadoop/hbase/util/ByteBufferUtils.java>:[604,29]
sun.nio.ch.DirectBuffer is internal proprietary API and may be removed in a future release
[WARNING] <https://builds.apache.org/job/HBase-Trunk_matrix/jdk=JDK%201.8%20(latest),label=yahoo-not-h2/ws/hbase-common/src/main/java/org/apache/hadoop/hbase/util/ByteBufferUtils.java>:[610,29]
sun.nio.ch.DirectBuffer is internal proprietary API and may be removed in a future release
[WARNING] <https://builds.apache.org/job/HBase-Trunk_matrix/jdk=JDK%201.8%20(latest),label=yahoo-not-h2/ws/hbase-common/src/main/java/org/apache/hadoop/hbase/util/ByteBufferUtils.java>:[644,29]
sun.nio.ch.DirectBuffer is internal proprietary API and may be removed in a future release
[WARNING] <https://builds.apache.org/job/HBase-Trunk_matrix/jdk=JDK%201.8%20(latest),label=yahoo-not-h2/ws/hbase-common/src/main/java/org/apache/hadoop/hbase/util/ByteBufferUtils.java>:[669,29]
sun.nio.ch.DirectBuffer is internal proprietary API and may be removed in a future release
[WARNING] <https://builds.apache.org/job/HBase-Trunk_matrix/jdk=JDK%201.8%20(latest),label=yahoo-not-h2/ws/hbase-common/src/main/java/org/apache/hadoop/hbase/nio/SingleByteBuff.java>:[53,29]
sun.nio.ch.DirectBuffer is internal proprietary API and may be removed in a future release
[INFO] 27 warnings 
[INFO] -------------------------------------------------------------
[INFO] -------------------------------------------------------------
[ERROR] COMPILATION ERROR : 
[INFO] -------------------------------------------------------------
[ERROR] <https://builds.apache.org/job/HBase-Trunk_matrix/jdk=JDK%201.8%20(latest),label=yahoo-not-h2/ws/hbase-common/src/main/java/org/apache/hadoop/hbase/util/VersionInfo.java>:[26,31]
cannot find symbol
  symbol:   class Version
  location: package org.apache.hadoop.hbase
[ERROR] <https://builds.apache.org/job/HBase-Trunk_matrix/jdk=JDK%201.8%20(latest),label=yahoo-not-h2/ws/hbase-common/src/main/java/org/apache/hadoop/hbase/util/VersionInfo.java>:[43,12]
cannot find symbol
  symbol:   variable Version
  location: class org.apache.hadoop.hbase.util.VersionInfo
[ERROR] <https://builds.apache.org/job/HBase-Trunk_matrix/jdk=JDK%201.8%20(latest),label=yahoo-not-h2/ws/hbase-common/src/main/java/org/apache/hadoop/hbase/util/VersionInfo.java>:[51,12]
cannot find symbol
  symbol:   variable Version
  location: class org.apache.hadoop.hbase.util.VersionInfo
[ERROR] <https://builds.apache.org/job/HBase-Trunk_matrix/jdk=JDK%201.8%20(latest),label=yahoo-not-h2/ws/hbase-common/src/main/java/org/apache/hadoop/hbase/util/VersionInfo.java>:[59,12]
cannot find symbol
  symbol:   variable Version
  location: class org.apache.hadoop.hbase.util.VersionInfo
[ERROR] <https://builds.apache.org/job/HBase-Trunk_matrix/jdk=JDK%201.8%20(latest),label=yahoo-not-h2/ws/hbase-common/src/main/java/org/apache/hadoop/hbase/util/VersionInfo.java>:[67,12]
cannot find symbol
  symbol:   variable Version
  location: class org.apache.hadoop.hbase.util.VersionInfo
[ERROR] <https://builds.apache.org/job/HBase-Trunk_matrix/jdk=JDK%201.8%20(latest),label=yahoo-not-h2/ws/hbase-common/src/main/java/org/apache/hadoop/hbase/util/VersionInfo.java>:[75,12]
cannot find symbol
  symbol:   variable Version
  location: class org.apache.hadoop.hbase.util.VersionInfo
[ERROR] <https://builds.apache.org/job/HBase-Trunk_matrix/jdk=JDK%201.8%20(latest),label=yahoo-not-h2/ws/hbase-common/src/main/java/org/apache/hadoop/hbase/util/VersionInfo.java>:[92,12]
cannot find symbol
  symbol:   variable Version
  location: class org.apache.hadoop.hbase.util.VersionInfo
[INFO] 7 errors 
[INFO] -------------------------------------------------------------
[INFO] ------------------------------------------------------------------------
[INFO] Reactor Summary:
[INFO] 
[INFO] Apache HBase ...................................... SUCCESS [1.818s]
[INFO] Apache HBase - Checkstyle ......................... SUCCESS [0.812s]
[INFO] Apache HBase - Resource Bundle .................... SUCCESS [0.190s]
[INFO] Apache HBase - Annotations ........................ SUCCESS [6.030s]
[INFO] Apache HBase - Protocol ........................... SUCCESS [1:43.222s]
[INFO] Apache HBase - Common ............................. FAILURE [2.954s]
[INFO] Apache HBase - Procedure .......................... SKIPPED
[INFO] Apache HBase - Client ............................. SKIPPED
[INFO] Apache HBase - Hadoop Compatibility ............... SKIPPED
[INFO] Apache HBase - Hadoop Two Compatibility ........... SKIPPED
[INFO] Apache HBase - Prefix Tree ........................ SKIPPED
[INFO] Apache HBase - Server ............................. SKIPPED
[INFO] Apache HBase - Testing Util ....................... SKIPPED
[INFO] Apache HBase - Thrift ............................. SKIPPED
[INFO] Apache HBase - RSGroup ............................ SKIPPED
[INFO] Apache HBase - Shell .............................. SKIPPED
[INFO] Apache HBase - Integration Tests .................. SKIPPED
[INFO] Apache HBase - Examples ........................... SKIPPED
[INFO] Apache HBase - Rest ............................... SKIPPED
[INFO] Apache HBase - External Block Cache ............... SKIPPED
[INFO] Apache HBase - Spark .............................. SKIPPED
[INFO] Apache HBase - Assembly ........................... SKIPPED
[INFO] Apache HBase - Shaded ............................. SKIPPED
[INFO] Apache HBase - Shaded - Client .................... SKIPPED
[INFO] Apache HBase - Shaded - Server .................... SKIPPED
[INFO] Apache HBase - Archetypes ......................... SKIPPED
[INFO] Apache HBase - Exemplar for hbase-client archetype  SKIPPED
[INFO] Apache HBase - Exemplar for hbase-shaded-client archetype  SKIPPED
[INFO] Apache HBase - Archetype builder .................. SKIPPED
[INFO] ------------------------------------------------------------------------
[INFO] BUILD FAILURE
[INFO] ------------------------------------------------------------------------
[INFO] Total time: 1:56.270s
[INFO] Finished at: Sat Sep 03 01:26:45 UTC 2016
[INFO] Final Memory: 100M/2682M
[INFO] ------------------------------------------------------------------------
[ERROR] Failed to execute goal org.apache.maven.plugins:maven-compiler-plugin:3.2:compile
(default-compile) on project hbase-common: Compilation failure: Compilation failure:
[ERROR] <https://builds.apache.org/job/HBase-Trunk_matrix/jdk=JDK%201.8%20(latest),label=yahoo-not-h2/ws/hbase-common/src/main/java/org/apache/hadoop/hbase/util/VersionInfo.java>:[26,31]
cannot find symbol
[ERROR] symbol:   class Version
[ERROR] location: package org.apache.hadoop.hbase
[ERROR] <https://builds.apache.org/job/HBase-Trunk_matrix/jdk=JDK%201.8%20(latest),label=yahoo-not-h2/ws/hbase-common/src/main/java/org/apache/hadoop/hbase/util/VersionInfo.java>:[43,12]
cannot find symbol
[ERROR] symbol:   variable Version
[ERROR] location: class org.apache.hadoop.hbase.util.VersionInfo
[ERROR] <https://builds.apache.org/job/HBase-Trunk_matrix/jdk=JDK%201.8%20(latest),label=yahoo-not-h2/ws/hbase-common/src/main/java/org/apache/hadoop/hbase/util/VersionInfo.java>:[51,12]
cannot find symbol
[ERROR] symbol:   variable Version
[ERROR] location: class org.apache.hadoop.hbase.util.VersionInfo
[ERROR] <https://builds.apache.org/job/HBase-Trunk_matrix/jdk=JDK%201.8%20(latest),label=yahoo-not-h2/ws/hbase-common/src/main/java/org/apache/hadoop/hbase/util/VersionInfo.java>:[59,12]
cannot find symbol
[ERROR] symbol:   variable Version
[ERROR] location: class org.apache.hadoop.hbase.util.VersionInfo
[ERROR] <https://builds.apache.org/job/HBase-Trunk_matrix/jdk=JDK%201.8%20(latest),label=yahoo-not-h2/ws/hbase-common/src/main/java/org/apache/hadoop/hbase/util/VersionInfo.java>:[67,12]
cannot find symbol
[ERROR] symbol:   variable Version
[ERROR] location: class org.apache.hadoop.hbase.util.VersionInfo
[ERROR] <https://builds.apache.org/job/HBase-Trunk_matrix/jdk=JDK%201.8%20(latest),label=yahoo-not-h2/ws/hbase-common/src/main/java/org/apache/hadoop/hbase/util/VersionInfo.java>:[75,12]
cannot find symbol
[ERROR] symbol:   variable Version
[ERROR] location: class org.apache.hadoop.hbase.util.VersionInfo
[ERROR] <https://builds.apache.org/job/HBase-Trunk_matrix/jdk=JDK%201.8%20(latest),label=yahoo-not-h2/ws/hbase-common/src/main/java/org/apache/hadoop/hbase/util/VersionInfo.java>:[92,12]
cannot find symbol
[ERROR] symbol:   variable Version
[ERROR] location: class org.apache.hadoop.hbase.util.VersionInfo
[ERROR] -> [Help 1]
[ERROR] 
[ERROR] To see the full stack trace of the errors, re-run Maven with the -e switch.
[ERROR] Re-run Maven using the -X switch to enable full debug logging.
[ERROR] 
[ERROR] For more information about the errors and possible solutions, please read the following
articles:
[ERROR] [Help 1] http://cwiki.apache.org/confluence/display/MAVEN/MojoFailureException
[ERROR] 
[ERROR] After correcting the problems, you can resume the build with the command
[ERROR]   mvn <goals> -rf :hbase-common
Build step 'Invoke top-level Maven targets' marked build as failure
Performing Post build task...
Match found for :.* : True
Logical operation result is TRUE
Running script  : # Run zombie detector script
./dev-support/zombie-detector.sh --jenkins ${BUILD_ID}
[yahoo-not-h2] $ /bin/bash -xe /tmp/hudson3067337894622861181.sh
+ ./dev-support/zombie-detector.sh --jenkins 1530
Sat Sep  3 01:26:47 UTC 2016 We're ok: there is no zombie test


    {color:green}+1 zombies{color}. No zombie tests found running at the end of the build.
POST BUILD TASK : SUCCESS
END OF POST BUILD TASK : 0
Archiving artifacts
No prior successful build to compare, so performing full copy of artifacts
Recording test results
ERROR: Step ?Publish JUnit test result report? failed: No test report files were found. Configuration
error?
[FINDBUGS] Skipping publisher since build result is FAILURE
[CHECKSTYLE] Skipping publisher since build result is FAILURE

Mime
View raw message