hbase-builds mailing list archives

Site index · List index
Message view « Date » · « Thread »
Top « Date » · « Thread »
From Apache Jenkins Server <jenk...@builds.apache.org>
Subject Build failed in Jenkins: HBase-1.4 » JDK_1_7,yahoo-not-h2 #426
Date Fri, 23 Sep 2016 01:52:36 GMT
See <https://builds.apache.org/job/HBase-1.4/jdk=JDK_1_7,label=yahoo-not-h2/426/changes>

Changes:

[apurtell] HBASE-16662 Fix open POODLE vulnerabilities

------------------------------------------
[...truncated 46008 lines...]
Running org.apache.hadoop.hbase.procedure.TestZKProcedure
Tests run: 4, Failures: 0, Errors: 0, Skipped: 0, Time elapsed: 2.225 sec - in org.apache.hadoop.hbase.procedure.TestZKProcedure
Running org.apache.hadoop.hbase.TestHColumnDescriptorDefaultVersions
Running org.apache.hadoop.hbase.procedure.TestZKProcedureControllers
Tests run: 4, Failures: 0, Errors: 0, Skipped: 0, Time elapsed: 1.962 sec - in org.apache.hadoop.hbase.procedure.TestZKProcedureControllers
Running org.apache.hadoop.hbase.TestNamespace
Tests run: 4, Failures: 0, Errors: 0, Skipped: 0, Time elapsed: 26.733 sec - in org.apache.hadoop.hbase.TestHColumnDescriptorDefaultVersions
Running org.apache.hadoop.hbase.constraint.TestConstraint
Tests run: 8, Failures: 0, Errors: 0, Skipped: 0, Time elapsed: 36.687 sec - in org.apache.hadoop.hbase.TestNamespace
Running org.apache.hadoop.hbase.TestZooKeeper
Tests run: 5, Failures: 0, Errors: 0, Skipped: 0, Time elapsed: 23.022 sec - in org.apache.hadoop.hbase.constraint.TestConstraint
Tests run: 12, Failures: 0, Errors: 0, Skipped: 0, Time elapsed: 165.559 sec - in org.apache.hadoop.hbase.client.TestMetaWithReplicas
Tests run: 5, Failures: 0, Errors: 0, Skipped: 0, Time elapsed: 123.863 sec - in org.apache.hadoop.hbase.client.TestRestoreSnapshotFromClient
Running org.apache.hadoop.hbase.snapshot.TestFlushSnapshotFromClient
Tests run: 14, Failures: 0, Errors: 0, Skipped: 0, Time elapsed: 243.834 sec - in org.apache.hadoop.hbase.client.TestReplicasClient
Running org.apache.hadoop.hbase.snapshot.TestExportSnapshot
Running org.apache.hadoop.hbase.snapshot.TestRestoreFlushSnapshotFromClient
Running org.apache.hadoop.hbase.snapshot.TestSecureExportSnapshot
Tests run: 5, Failures: 0, Errors: 0, Skipped: 0, Time elapsed: 60.724 sec - in org.apache.hadoop.hbase.snapshot.TestRestoreFlushSnapshotFromClient
Running org.apache.hadoop.hbase.snapshot.TestSnapshotClientRetries
Tests run: 9, Failures: 0, Errors: 0, Skipped: 0, Time elapsed: 81.542 sec - in org.apache.hadoop.hbase.snapshot.TestFlushSnapshotFromClient
Running org.apache.hadoop.hbase.snapshot.TestSnapshotDescriptionUtils
Tests run: 2, Failures: 0, Errors: 0, Skipped: 0, Time elapsed: 0.321 sec - in org.apache.hadoop.hbase.snapshot.TestSnapshotDescriptionUtils
Running org.apache.hadoop.hbase.TestIOFencing
Tests run: 2, Failures: 0, Errors: 0, Skipped: 0, Time elapsed: 21.529 sec - in org.apache.hadoop.hbase.snapshot.TestSnapshotClientRetries
Running org.apache.hadoop.hbase.coprocessor.TestRegionObserverScannerOpenHook
Tests run: 3, Failures: 0, Errors: 0, Skipped: 0, Time elapsed: 13.792 sec - in org.apache.hadoop.hbase.coprocessor.TestRegionObserverScannerOpenHook
Running org.apache.hadoop.hbase.coprocessor.TestOpenTableInCoprocessor
Tests run: 10, Failures: 0, Errors: 0, Skipped: 0, Time elapsed: 169.147 sec - in org.apache.hadoop.hbase.TestZooKeeper
Tests run: 2, Failures: 0, Errors: 0, Skipped: 0, Time elapsed: 17.833 sec - in org.apache.hadoop.hbase.coprocessor.TestOpenTableInCoprocessor
Running org.apache.hadoop.hbase.coprocessor.TestMasterCoprocessorExceptionWithAbort
Running org.apache.hadoop.hbase.coprocessor.TestCoprocessorTableEndpoint
Tests run: 1, Failures: 0, Errors: 0, Skipped: 0, Time elapsed: 3.208 sec - in org.apache.hadoop.hbase.coprocessor.TestMasterCoprocessorExceptionWithAbort
Tests run: 2, Failures: 0, Errors: 0, Skipped: 0, Time elapsed: 74.981 sec - in org.apache.hadoop.hbase.TestIOFencing
Tests run: 2, Failures: 0, Errors: 0, Skipped: 0, Time elapsed: 8.562 sec - in org.apache.hadoop.hbase.coprocessor.TestCoprocessorTableEndpoint
Running org.apache.hadoop.hbase.coprocessor.TestRegionServerCoprocessorEndpoint
Running org.apache.hadoop.hbase.coprocessor.TestIncrementTimeRange
Tests run: 2, Failures: 0, Errors: 0, Skipped: 0, Time elapsed: 1.369 sec - in org.apache.hadoop.hbase.coprocessor.TestRegionServerCoprocessorEndpoint
Running org.apache.hadoop.hbase.coprocessor.TestRegionObserverInterface
Tests run: 1, Failures: 0, Errors: 0, Skipped: 0, Time elapsed: 5.23 sec - in org.apache.hadoop.hbase.coprocessor.TestIncrementTimeRange
Running org.apache.hadoop.hbase.coprocessor.TestMasterCoprocessorExceptionWithRemove
Tests run: 1, Failures: 0, Errors: 0, Skipped: 0, Time elapsed: 6.715 sec - in org.apache.hadoop.hbase.coprocessor.TestMasterCoprocessorExceptionWithRemove
Running org.apache.hadoop.hbase.coprocessor.TestAggregateProtocol
Tests run: 44, Failures: 0, Errors: 0, Skipped: 0, Time elapsed: 5.221 sec - in org.apache.hadoop.hbase.coprocessor.TestAggregateProtocol
Running org.apache.hadoop.hbase.coprocessor.TestBatchCoprocessorEndpoint
Tests run: 4, Failures: 0, Errors: 0, Skipped: 0, Time elapsed: 1.886 sec - in org.apache.hadoop.hbase.coprocessor.TestBatchCoprocessorEndpoint
Running org.apache.hadoop.hbase.coprocessor.TestRegionServerObserver
Running org.apache.hadoop.hbase.coprocessor.TestHTableWrapper
Tests run: 1, Failures: 0, Errors: 0, Skipped: 0, Time elapsed: 6.529 sec - in org.apache.hadoop.hbase.coprocessor.TestHTableWrapper
Tests run: 1, Failures: 0, Errors: 0, Skipped: 0, Time elapsed: 20.191 sec - in org.apache.hadoop.hbase.coprocessor.TestRegionServerObserver
Running org.apache.hadoop.hbase.coprocessor.TestClassLoading
Running org.apache.hadoop.hbase.coprocessor.TestRegionServerCoprocessorExceptionWithAbort
Tests run: 14, Failures: 0, Errors: 0, Skipped: 2, Time elapsed: 71.493 sec - in org.apache.hadoop.hbase.coprocessor.TestRegionObserverInterface
Tests run: 2, Failures: 0, Errors: 0, Skipped: 0, Time elapsed: 21.364 sec - in org.apache.hadoop.hbase.coprocessor.TestRegionServerCoprocessorExceptionWithAbort
Tests run: 9, Failures: 0, Errors: 0, Skipped: 0, Time elapsed: 29.794 sec - in org.apache.hadoop.hbase.coprocessor.TestClassLoading
Running org.apache.hadoop.hbase.coprocessor.TestRegionObserverForAddingMutationsFromCoprocessors
Running org.apache.hadoop.hbase.coprocessor.TestDoubleColumnInterpreter
Tests run: 5, Failures: 0, Errors: 0, Skipped: 0, Time elapsed: 8.407 sec - in org.apache.hadoop.hbase.coprocessor.TestRegionObserverForAddingMutationsFromCoprocessors
Tests run: 38, Failures: 0, Errors: 0, Skipped: 0, Time elapsed: 4.268 sec - in org.apache.hadoop.hbase.coprocessor.TestDoubleColumnInterpreter
Running org.apache.hadoop.hbase.coprocessor.TestRegionObserverBypass
Tests run: 2, Failures: 0, Errors: 0, Skipped: 0, Time elapsed: 7.994 sec - in org.apache.hadoop.hbase.coprocessor.TestRegionObserverBypass
Running org.apache.hadoop.hbase.coprocessor.TestRowProcessorEndpoint
Running org.apache.hadoop.hbase.coprocessor.TestCoprocessorStop
Tests run: 1, Failures: 0, Errors: 0, Skipped: 0, Time elapsed: 1.298 sec - in org.apache.hadoop.hbase.coprocessor.TestCoprocessorStop
Running org.apache.hadoop.hbase.coprocessor.TestRegionServerCoprocessorExceptionWithRemove
Running org.apache.hadoop.hbase.coprocessor.TestBigDecimalColumnInterpreter
Tests run: 4, Failures: 0, Errors: 0, Skipped: 0, Time elapsed: 19.06 sec - in org.apache.hadoop.hbase.coprocessor.TestRowProcessorEndpoint
Tests run: 38, Failures: 0, Errors: 0, Skipped: 0, Time elapsed: 4.459 sec - in org.apache.hadoop.hbase.coprocessor.TestBigDecimalColumnInterpreter
Tests run: 1, Failures: 0, Errors: 0, Skipped: 0, Time elapsed: 15.73 sec - in org.apache.hadoop.hbase.coprocessor.TestRegionServerCoprocessorExceptionWithRemove
Running org.apache.hadoop.hbase.coprocessor.TestMasterObserver
Running org.apache.hadoop.hbase.coprocessor.TestCoprocessorEndpoint
Tests run: 6, Failures: 0, Errors: 0, Skipped: 0, Time elapsed: 2.185 sec - in org.apache.hadoop.hbase.coprocessor.TestCoprocessorEndpoint
Running org.apache.hadoop.hbase.TestGlobalMemStoreSize
Running org.apache.hadoop.hbase.coprocessor.TestWALObserver
Tests run: 7, Failures: 0, Errors: 0, Skipped: 0, Time elapsed: 8.16 sec - in org.apache.hadoop.hbase.coprocessor.TestWALObserver
Tests run: 9, Failures: 0, Errors: 0, Skipped: 0, Time elapsed: 327.907 sec - in org.apache.hadoop.hbase.snapshot.TestExportSnapshot
Tests run: 1, Failures: 0, Errors: 0, Skipped: 0, Time elapsed: 15.5 sec - in org.apache.hadoop.hbase.TestGlobalMemStoreSize
Running org.apache.hadoop.hbase.TestStochasticBalancerJmxMetrics
Tests run: 1, Failures: 0, Errors: 0, Skipped: 1, Time elapsed: 0.001 sec - in org.apache.hadoop.hbase.TestStochasticBalancerJmxMetrics
Running org.apache.hadoop.hbase.TestMetaTableLocator
Running org.apache.hadoop.hbase.TestJMXListener
Tests run: 2, Failures: 0, Errors: 0, Skipped: 0, Time elapsed: 1.476 sec - in org.apache.hadoop.hbase.TestJMXListener
Tests run: 7, Failures: 0, Errors: 0, Skipped: 0, Time elapsed: 3.875 sec - in org.apache.hadoop.hbase.TestMetaTableLocator
Running org.apache.hadoop.hbase.zookeeper.TestZKTableStateManager
Running org.apache.hadoop.hbase.zookeeper.TestZKMulti
Tests run: 1, Failures: 0, Errors: 0, Skipped: 0, Time elapsed: 0.88 sec - in org.apache.hadoop.hbase.zookeeper.TestZKTableStateManager
Tests run: 12, Failures: 0, Errors: 0, Skipped: 0, Time elapsed: 1.701 sec - in org.apache.hadoop.hbase.zookeeper.TestZKMulti
Running org.apache.hadoop.hbase.zookeeper.lock.TestZKInterProcessReadWriteLock
Running org.apache.hadoop.hbase.zookeeper.TestZKLeaderManager
Tests run: 1, Failures: 0, Errors: 0, Skipped: 0, Time elapsed: 0.137 sec - in org.apache.hadoop.hbase.zookeeper.TestZKLeaderManager
Running org.apache.hadoop.hbase.zookeeper.TestZooKeeperACL
Tests run: 7, Failures: 0, Errors: 0, Skipped: 0, Time elapsed: 0.329 sec - in org.apache.hadoop.hbase.zookeeper.TestZooKeeperACL
Running org.apache.hadoop.hbase.zookeeper.TestRecoverableZooKeeper
Tests run: 1, Failures: 0, Errors: 0, Skipped: 0, Time elapsed: 1.251 sec - in org.apache.hadoop.hbase.zookeeper.TestRecoverableZooKeeper
Running org.apache.hadoop.hbase.zookeeper.TestZooKeeperNodeTracker
Running org.apache.hadoop.hbase.zookeeper.TestHQuorumPeer
Tests run: 3, Failures: 0, Errors: 0, Skipped: 0, Time elapsed: 1.012 sec - in org.apache.hadoop.hbase.zookeeper.TestZooKeeperNodeTracker
Tests run: 4, Failures: 0, Errors: 0, Skipped: 0, Time elapsed: 1.336 sec - in org.apache.hadoop.hbase.zookeeper.TestHQuorumPeer
Running org.apache.hadoop.hbase.TestClusterBootOrder
Tests run: 9, Failures: 0, Errors: 0, Skipped: 0, Time elapsed: 41.335 sec - in org.apache.hadoop.hbase.coprocessor.TestMasterObserver
Tests run: 9, Failures: 0, Errors: 0, Skipped: 0, Time elapsed: 335.718 sec - in org.apache.hadoop.hbase.snapshot.TestSecureExportSnapshot
Running org.apache.hadoop.hbase.TestPartialResultsFromClientSide
Running org.apache.hadoop.hbase.TestServerSideScanMetricsFromClientSide
Tests run: 6, Failures: 0, Errors: 0, Skipped: 0, Time elapsed: 24.544 sec - in org.apache.hadoop.hbase.zookeeper.lock.TestZKInterProcessReadWriteLock
Tests run: 2, Failures: 0, Errors: 0, Skipped: 0, Time elapsed: 3.064 sec - in org.apache.hadoop.hbase.TestServerSideScanMetricsFromClientSide
Tests run: 2, Failures: 0, Errors: 0, Skipped: 0, Time elapsed: 30.236 sec - in org.apache.hadoop.hbase.TestClusterBootOrder
Tests run: 19, Failures: 0, Errors: 0, Skipped: 0, Time elapsed: 90.588 sec - in org.apache.hadoop.hbase.TestPartialResultsFromClientSide

Results :

Tests in error: 
  TestClusterId.testClusterId:85 » IO Shutting down
Flaked tests: 
org.apache.hadoop.hbase.replication.regionserver.TestReplicationSourceManager.testLogRoll(org.apache.hadoop.hbase.replication.regionserver.TestReplicationSourceManager)
  Run 1: TestReplicationSourceManager.testLogRoll:277 expected:<1> but was:<2>
  Run 2: PASS


Tests run: 2596, Failures: 0, Errors: 1, Skipped: 57, Flakes: 1

[INFO] ------------------------------------------------------------------------
[INFO] Reactor Summary:
[INFO] 
[INFO] Apache HBase ...................................... SUCCESS [1:42.791s]
[INFO] Apache HBase - Checkstyle ......................... SUCCESS [9.178s]
[INFO] Apache HBase - Resource Bundle .................... SUCCESS [0.216s]
[INFO] Apache HBase - Annotations ........................ SUCCESS [0.994s]
[INFO] Apache HBase - Protocol ........................... SUCCESS [17.972s]
[INFO] Apache HBase - Common ............................. SUCCESS [2:46.073s]
[INFO] Apache HBase - Procedure .......................... SUCCESS [3:28.533s]
[INFO] Apache HBase - Client ............................. SUCCESS [1:43.019s]
[INFO] Apache HBase - Hadoop Compatibility ............... SUCCESS [9.654s]
[INFO] Apache HBase - Hadoop Two Compatibility ........... SUCCESS [11.098s]
[INFO] Apache HBase - Prefix Tree ........................ SUCCESS [9.496s]
[INFO] Apache HBase - Server ............................. FAILURE [1:24:47.523s]
[INFO] Apache HBase - Testing Util ....................... SKIPPED
[INFO] Apache HBase - Thrift ............................. SKIPPED
[INFO] Apache HBase - Rest ............................... SKIPPED
[INFO] Apache HBase - Shell .............................. SKIPPED
[INFO] Apache HBase - Integration Tests .................. SKIPPED
[INFO] Apache HBase - Examples ........................... SKIPPED
[INFO] Apache HBase - External Block Cache ............... SKIPPED
[INFO] Apache HBase - Assembly ........................... SKIPPED
[INFO] Apache HBase - Shaded ............................. SKIPPED
[INFO] Apache HBase - Shaded - Client .................... SKIPPED
[INFO] Apache HBase - Shaded - Server .................... SKIPPED
[INFO] Apache HBase - Archetypes ......................... SKIPPED
[INFO] Apache HBase - Exemplar for hbase-client archetype  SKIPPED
[INFO] Apache HBase - Exemplar for hbase-shaded-client archetype  SKIPPED
[INFO] Apache HBase - Archetype builder .................. SKIPPED
[INFO] ------------------------------------------------------------------------
[INFO] BUILD FAILURE
[INFO] ------------------------------------------------------------------------
[INFO] Total time: 1:35:58.106s
[INFO] Finished at: Fri Sep 23 01:48:11 UTC 2016
[INFO] Final Memory: 96M/755M
[INFO] ------------------------------------------------------------------------
[ERROR] Failed to execute goal org.apache.maven.plugins:maven-surefire-plugin:2.18.1:test
(secondPartTestsExecution) on project hbase-server: ExecutionException: java.lang.RuntimeException:
java.lang.RuntimeException: org.apache.maven.surefire.report.ReporterException: When writing
xml report stdout/stderr: /tmp/stderr7031851358824127862deferred (No such file or directory)
-> [Help 1]
[ERROR] 
[ERROR] To see the full stack trace of the errors, re-run Maven with the -e switch.
[ERROR] Re-run Maven using the -X switch to enable full debug logging.
[ERROR] 
[ERROR] For more information about the errors and possible solutions, please read the following
articles:
[ERROR] [Help 1] http://cwiki.apache.org/confluence/display/MAVEN/MojoFailureException
[ERROR] 
[ERROR] After correcting the problems, you can resume the build with the command
[ERROR]   mvn <goals> -rf :hbase-server
Build step 'Invoke top-level Maven targets' marked build as failure
Performing Post build task...
Match found for :.* : True
Logical operation result is TRUE
Running script  : # Post-build task script. TODO: Check this in and have all builds reference
check-in.
pwd && ls
# NOTE!!!! The below code has been copied and pasted from ./dev-tools/run-test.sh
# Do not change here without syncing there and vice-versa.
ZOMBIE_TESTS_COUNT=`jps -v | grep surefirebooter | grep -e '-Dhbase.test' | wc -l`
if [[ $ZOMBIE_TESTS_COUNT != 0 ]] ; then
 echo "Suspicious java process found - waiting 30s to see if there are just slow to stop"
 sleep 30
 ZOMBIE_TESTS_COUNT=`jps -v | grep surefirebooter | grep -e '-Dhbase.test' | wc -l`
 if [[ $ZOMBIE_TESTS_COUNT != 0 ]] ; then
   echo " {color:red}There appear to be $ZOMBIE_TESTS_COUNT zombie tests{color}, they should
have been killed by surefire but survived"
   jps -v | grep surefirebooter | grep -e '-Dhbase.test'
   jps -v | grep surefirebooter | grep -e '-Dhbase.test' | cut -d ' ' -f 1 | xargs -n 1 jstack
   # Exit with error
   exit 1
 else
   echo "We're ok: there is no zombie test, but some tests took some time to stop"
 fi
else
  echo "We're ok: there is no zombie test"
fi
Setting JDK_1_7_LATEST__HOME=/home/jenkins/tools/java/latest1.7
Setting JDK_1_8_LATEST__HOME=/home/jenkins/tools/java/latest1.8
[yahoo-not-h2] $ /bin/bash -xe /tmp/hudson1781993287192194548.sh
+ pwd
<https://builds.apache.org/job/HBase-1.4/jdk=JDK_1_7,label=yahoo-not-h2/ws/>
+ ls
bin
CHANGES.txt
conf
dev-support
extra_env_var
hbase-annotations
hbase-archetypes
hbase-assembly
hbase-checkstyle
hbase-client
hbase-common
hbase-examples
hbase-external-blockcache
hbase-hadoop2-compat
hbase-hadoop-compat
hbase-it
hbase-native-client
hbase-prefix-tree
hbase-procedure
hbase-protocol
hbase-resource-bundle
hbase-rest
hbase-server
hbase-shaded
hbase-shell
hbase-testing-util
hbase-thrift
LICENSE.txt
NOTICE.txt
pom.xml
README.txt
src
target
++ jps -v
++ grep surefirebooter
++ grep -e -Dhbase.test
++ wc -l
+ ZOMBIE_TESTS_COUNT=0
+ [[ 0 != 0 ]]
+ echo 'We'\''re ok: there is no zombie test'
We're ok: there is no zombie test
POST BUILD TASK : SUCCESS
END OF POST BUILD TASK : 0
Archiving artifacts
Setting JDK_1_7_LATEST__HOME=/home/jenkins/tools/java/latest1.7
Setting JDK_1_8_LATEST__HOME=/home/jenkins/tools/java/latest1.8
Recording test results
Setting JDK_1_7_LATEST__HOME=/home/jenkins/tools/java/latest1.7
Setting JDK_1_8_LATEST__HOME=/home/jenkins/tools/java/latest1.8
Setting JDK_1_7_LATEST__HOME=/home/jenkins/tools/java/latest1.7
Setting JDK_1_8_LATEST__HOME=/home/jenkins/tools/java/latest1.8

Mime
View raw message