hbase-builds mailing list archives

Site index · List index
Message view « Date » · « Thread »
Top « Date » · « Thread »
From Apache Jenkins Server <jenk...@builds.apache.org>
Subject Build failed in Jenkins: HBase-Trunk_matrix » JDK_1_8,yahoo-not-h2 #1568
Date Fri, 09 Sep 2016 08:01:04 GMT
See <https://builds.apache.org/job/HBase-Trunk_matrix/jdk=JDK_1_8,label=yahoo-not-h2/1568/>

------------------------------------------
[...truncated 7900 lines...]
Running org.apache.hadoop.hbase.util.TestFSVisitor
Tests run: 1, Failures: 0, Errors: 0, Skipped: 0, Time elapsed: 1.993 sec - in org.apache.hadoop.hbase.util.TestFSVisitor
Java HotSpot(TM) 64-Bit Server VM warning: ignoring option MaxPermSize=256m; support was removed
in 8.0
Running org.apache.hadoop.hbase.util.TestTableName
Tests run: 6, Failures: 0, Errors: 0, Skipped: 0, Time elapsed: 0.539 sec - in org.apache.hadoop.hbase.util.TestTableName
Java HotSpot(TM) 64-Bit Server VM warning: ignoring option MaxPermSize=256m; support was removed
in 8.0
Running org.apache.hadoop.hbase.util.TestHBaseFsckEncryption
Tests run: 1, Failures: 0, Errors: 0, Skipped: 0, Time elapsed: 19.944 sec - in org.apache.hadoop.hbase.util.TestHBaseFsckEncryption
Java HotSpot(TM) 64-Bit Server VM warning: ignoring option MaxPermSize=256m; support was removed
in 8.0
Tests run: 4, Failures: 0, Errors: 0, Skipped: 0, Time elapsed: 75.526 sec - in org.apache.hadoop.hbase.util.TestMiniClusterLoadSequential
Java HotSpot(TM) 64-Bit Server VM warning: ignoring option MaxPermSize=256m; support was removed
in 8.0
Running org.apache.hadoop.hbase.util.TestFSHDFSUtils
Running org.apache.hadoop.hbase.util.TestMiniClusterLoadEncoded
Tests run: 9, Failures: 0, Errors: 0, Skipped: 0, Time elapsed: 90.559 sec - in org.apache.hadoop.hbase.util.TestHBaseFsckTwoRS
Java HotSpot(TM) 64-Bit Server VM warning: ignoring option MaxPermSize=256m; support was removed
in 8.0
Running org.apache.hadoop.hbase.util.TestIdReadWriteLock
Tests run: 4, Failures: 0, Errors: 0, Skipped: 0, Time elapsed: 44.886 sec - in org.apache.hadoop.hbase.util.TestHBaseFsckReplicas
Java HotSpot(TM) 64-Bit Server VM warning: ignoring option MaxPermSize=256m; support was removed
in 8.0
Java HotSpot(TM) 64-Bit Server VM warning: ignoring option MaxPermSize=256m; support was removed
in 8.0
Tests run: 3, Failures: 0, Errors: 0, Skipped: 0, Time elapsed: 7.642 sec - in org.apache.hadoop.hbase.util.TestFSHDFSUtils
Java HotSpot(TM) 64-Bit Server VM warning: ignoring option MaxPermSize=256m; support was removed
in 8.0
Tests run: 1, Failures: 0, Errors: 0, Skipped: 0, Time elapsed: 15.487 sec - in org.apache.hadoop.hbase.util.TestIdReadWriteLock
Java HotSpot(TM) 64-Bit Server VM warning: ignoring option MaxPermSize=256m; support was removed
in 8.0
Java HotSpot(TM) 64-Bit Server VM warning: ignoring option MaxPermSize=256m; support was removed
in 8.0
Java HotSpot(TM) 64-Bit Server VM warning: ignoring option MaxPermSize=256m; support was removed
in 8.0
Running org.apache.hadoop.hbase.util.TestHBaseFsckMOB
Running org.apache.hadoop.hbase.util.TestHBaseFsckOneRS
Tests run: 9, Failures: 0, Errors: 0, Skipped: 0, Time elapsed: 341.392 sec - in org.apache.hadoop.hbase.snapshot.TestMobSecureExportSnapshot
Java HotSpot(TM) 64-Bit Server VM warning: ignoring option MaxPermSize=256m; support was removed
in 8.0
Running org.apache.hadoop.hbase.util.hbck.TestOfflineMetaRebuildOverlap
Running org.apache.hadoop.hbase.util.TestRegionMover
Tests run: 1, Failures: 0, Errors: 0, Skipped: 0, Time elapsed: 16.419 sec - in org.apache.hadoop.hbase.util.TestHBaseFsckMOB
Java HotSpot(TM) 64-Bit Server VM warning: ignoring option MaxPermSize=256m; support was removed
in 8.0
Running org.apache.hadoop.hbase.util.hbck.TestOfflineMetaRebuildBase
Tests run: 1, Failures: 0, Errors: 0, Skipped: 0, Time elapsed: 31.665 sec - in org.apache.hadoop.hbase.util.hbck.TestOfflineMetaRebuildOverlap
Java HotSpot(TM) 64-Bit Server VM warning: ignoring option MaxPermSize=256m; support was removed
in 8.0
Running org.apache.hadoop.hbase.util.hbck.TestOfflineMetaRebuildHole
Tests run: 1, Failures: 0, Errors: 0, Skipped: 0, Time elapsed: 30.555 sec - in org.apache.hadoop.hbase.util.hbck.TestOfflineMetaRebuildBase
Java HotSpot(TM) 64-Bit Server VM warning: ignoring option MaxPermSize=256m; support was removed
in 8.0
Java HotSpot(TM) 64-Bit Server VM warning: ignoring option MaxPermSize=256m; support was removed
in 8.0
Running org.apache.hadoop.hbase.util.TestMergeTool
Tests run: 5, Failures: 0, Errors: 0, Skipped: 0, Time elapsed: 40.506 sec - in org.apache.hadoop.hbase.util.TestRegionMover
Java HotSpot(TM) 64-Bit Server VM warning: ignoring option MaxPermSize=256m; support was removed
in 8.0
Running org.apache.hadoop.hbase.util.TestFSUtils
Tests run: 1, Failures: 0, Errors: 0, Skipped: 0, Time elapsed: 32.123 sec - in org.apache.hadoop.hbase.util.hbck.TestOfflineMetaRebuildHole
Java HotSpot(TM) 64-Bit Server VM warning: ignoring option MaxPermSize=256m; support was removed
in 8.0
Tests run: 6, Failures: 0, Errors: 0, Skipped: 0, Time elapsed: 93.223 sec - in org.apache.hadoop.hbase.util.TestMiniClusterLoadEncoded
Java HotSpot(TM) 64-Bit Server VM warning: ignoring option MaxPermSize=256m; support was removed
in 8.0
Tests run: 1, Failures: 0, Errors: 0, Skipped: 0, Time elapsed: 26.086 sec - in org.apache.hadoop.hbase.util.TestMergeTool
Java HotSpot(TM) 64-Bit Server VM warning: ignoring option MaxPermSize=256m; support was removed
in 8.0
Java HotSpot(TM) 64-Bit Server VM warning: ignoring option MaxPermSize=256m; support was removed
in 8.0
Java HotSpot(TM) 64-Bit Server VM warning: ignoring option MaxPermSize=256m; support was removed
in 8.0
Tests run: 11, Failures: 0, Errors: 0, Skipped: 0, Time elapsed: 28.403 sec - in org.apache.hadoop.hbase.util.TestFSUtils
Java HotSpot(TM) 64-Bit Server VM warning: ignoring option MaxPermSize=256m; support was removed
in 8.0
Running org.apache.hadoop.hbase.tool.TestCanaryTool
Running org.apache.hadoop.hbase.util.TestCoprocessorScanPolicy
Running org.apache.hadoop.hbase.util.TestRegionSplitter
Running org.apache.hadoop.hbase.TestFullLogReconstruction
Tests run: 6, Failures: 0, Errors: 0, Skipped: 0, Time elapsed: 11.152 sec - in org.apache.hadoop.hbase.util.TestRegionSplitter
Java HotSpot(TM) 64-Bit Server VM warning: ignoring option MaxPermSize=256m; support was removed
in 8.0
Tests run: 1, Failures: 0, Errors: 0, Skipped: 0, Time elapsed: 9.093 sec - in org.apache.hadoop.hbase.TestFullLogReconstruction
Java HotSpot(TM) 64-Bit Server VM warning: ignoring option MaxPermSize=256m; support was removed
in 8.0
Java HotSpot(TM) 64-Bit Server VM warning: ignoring option MaxPermSize=256m; support was removed
in 8.0
Running org.apache.hadoop.hbase.wal.TestBoundedRegionGroupingStrategy
Tests run: 4, Failures: 0, Errors: 0, Skipped: 0, Time elapsed: 22.55 sec - in org.apache.hadoop.hbase.util.TestCoprocessorScanPolicy
Java HotSpot(TM) 64-Bit Server VM warning: ignoring option MaxPermSize=256m; support was removed
in 8.0
Running org.apache.hadoop.hbase.wal.TestFSHLogProvider
Running org.apache.hadoop.hbase.wal.TestWALSplit
Tests run: 5, Failures: 0, Errors: 0, Skipped: 0, Time elapsed: 8.384 sec - in org.apache.hadoop.hbase.wal.TestFSHLogProvider
Java HotSpot(TM) 64-Bit Server VM warning: ignoring option MaxPermSize=256m; support was removed
in 8.0
Running org.apache.hadoop.hbase.wal.TestWALFactory
Tests run: 9, Failures: 0, Errors: 0, Skipped: 0, Time elapsed: 12.139 sec - in org.apache.hadoop.hbase.wal.TestWALFactory
Java HotSpot(TM) 64-Bit Server VM warning: ignoring option MaxPermSize=256m; support was removed
in 8.0
Running org.apache.hadoop.hbase.wal.TestSecureWAL
Tests run: 2, Failures: 0, Errors: 0, Skipped: 0, Time elapsed: 2.216 sec - in org.apache.hadoop.hbase.wal.TestSecureWAL
Java HotSpot(TM) 64-Bit Server VM warning: ignoring option MaxPermSize=256m; support was removed
in 8.0
Tests run: 10, Failures: 0, Errors: 0, Skipped: 0, Time elapsed: 51.185 sec - in org.apache.hadoop.hbase.wal.TestBoundedRegionGroupingStrategy
Java HotSpot(TM) 64-Bit Server VM warning: ignoring option MaxPermSize=256m; support was removed
in 8.0
Running org.apache.hadoop.hbase.wal.TestWALSplitCompressed
Running org.apache.hadoop.hbase.wal.TestWALFiltering
Tests run: 5, Failures: 0, Errors: 0, Skipped: 0, Time elapsed: 82.459 sec - in org.apache.hadoop.hbase.tool.TestCanaryTool
Java HotSpot(TM) 64-Bit Server VM warning: ignoring option MaxPermSize=256m; support was removed
in 8.0
Running org.apache.hadoop.hbase.wal.TestWALReaderOnSecureWAL
Tests run: 2, Failures: 0, Errors: 0, Skipped: 0, Time elapsed: 1.463 sec - in org.apache.hadoop.hbase.wal.TestWALReaderOnSecureWAL
Java HotSpot(TM) 64-Bit Server VM warning: ignoring option MaxPermSize=256m; support was removed
in 8.0
Running org.apache.hadoop.hbase.wal.TestDefaultWALProviderWithHLogKey
Tests run: 5, Failures: 0, Errors: 0, Skipped: 0, Time elapsed: 6.513 sec - in org.apache.hadoop.hbase.wal.TestDefaultWALProviderWithHLogKey
Java HotSpot(TM) 64-Bit Server VM warning: ignoring option MaxPermSize=256m; support was removed
in 8.0
Running org.apache.hadoop.hbase.TestHBaseOnOtherDfsCluster
Tests run: 1, Failures: 0, Errors: 0, Skipped: 0, Time elapsed: 30.835 sec - in org.apache.hadoop.hbase.wal.TestWALFiltering
Java HotSpot(TM) 64-Bit Server VM warning: ignoring option MaxPermSize=256m; support was removed
in 8.0
Java HotSpot(TM) 64-Bit Server VM warning: ignoring option MaxPermSize=256m; support was removed
in 8.0
Tests run: 32, Failures: 0, Errors: 0, Skipped: 0, Time elapsed: 77.123 sec - in org.apache.hadoop.hbase.wal.TestWALSplit
Java HotSpot(TM) 64-Bit Server VM warning: ignoring option MaxPermSize=256m; support was removed
in 8.0
Java HotSpot(TM) 64-Bit Server VM warning: ignoring option MaxPermSize=256m; support was removed
in 8.0
Java HotSpot(TM) 64-Bit Server VM warning: ignoring option MaxPermSize=256m; support was removed
in 8.0
Java HotSpot(TM) 64-Bit Server VM warning: ignoring option MaxPermSize=256m; support was removed
in 8.0
Java HotSpot(TM) 64-Bit Server VM warning: ignoring option MaxPermSize=256m; support was removed
in 8.0
Java HotSpot(TM) 64-Bit Server VM warning: ignoring option MaxPermSize=256m; support was removed
in 8.0
Java HotSpot(TM) 64-Bit Server VM warning: ignoring option MaxPermSize=256m; support was removed
in 8.0
Java HotSpot(TM) 64-Bit Server VM warning: ignoring option MaxPermSize=256m; support was removed
in 8.0
Java HotSpot(TM) 64-Bit Server VM warning: ignoring option MaxPermSize=256m; support was removed
in 8.0
Java HotSpot(TM) 64-Bit Server VM warning: ignoring option MaxPermSize=256m; support was removed
in 8.0
Java HotSpot(TM) 64-Bit Server VM warning: ignoring option MaxPermSize=256m; support was removed
in 8.0
Java HotSpot(TM) 64-Bit Server VM warning: ignoring option MaxPermSize=256m; support was removed
in 8.0
Java HotSpot(TM) 64-Bit Server VM warning: ignoring option MaxPermSize=256m; support was removed
in 8.0
Java HotSpot(TM) 64-Bit Server VM warning: ignoring option MaxPermSize=256m; support was removed
in 8.0
Java HotSpot(TM) 64-Bit Server VM warning: ignoring option MaxPermSize=256m; support was removed
in 8.0
Tests run: 1, Failures: 0, Errors: 0, Skipped: 0, Time elapsed: 16.47 sec - in org.apache.hadoop.hbase.TestHBaseOnOtherDfsCluster
Java HotSpot(TM) 64-Bit Server VM warning: ignoring option MaxPermSize=256m; support was removed
in 8.0
Java HotSpot(TM) 64-Bit Server VM warning: ignoring option MaxPermSize=256m; support was removed
in 8.0
Java HotSpot(TM) 64-Bit Server VM warning: ignoring option MaxPermSize=256m; support was removed
in 8.0
Java HotSpot(TM) 64-Bit Server VM warning: ignoring option MaxPermSize=256m; support was removed
in 8.0
Java HotSpot(TM) 64-Bit Server VM warning: ignoring option MaxPermSize=256m; support was removed
in 8.0
Java HotSpot(TM) 64-Bit Server VM warning: ignoring option MaxPermSize=256m; support was removed
in 8.0
Running org.apache.hadoop.hbase.TestZooKeeper
Running org.apache.hadoop.hbase.TestServerSideScanMetricsFromClientSide
Tests run: 2, Failures: 0, Errors: 0, Skipped: 0, Time elapsed: 3.062 sec - in org.apache.hadoop.hbase.TestServerSideScanMetricsFromClientSide
Java HotSpot(TM) 64-Bit Server VM warning: ignoring option MaxPermSize=256m; support was removed
in 8.0
Java HotSpot(TM) 64-Bit Server VM warning: ignoring option MaxPermSize=256m; support was removed
in 8.0
Running org.apache.hadoop.hbase.filter.TestFuzzyRowFilterEndToEnd
Running org.apache.hadoop.hbase.filter.TestFilterWithScanLimits
Tests run: 32, Failures: 0, Errors: 0, Skipped: 0, Time elapsed: 81.336 sec - in org.apache.hadoop.hbase.wal.TestWALSplitCompressed
Java HotSpot(TM) 64-Bit Server VM warning: ignoring option MaxPermSize=256m; support was removed
in 8.0
Java HotSpot(TM) 64-Bit Server VM warning: ignoring option MaxPermSize=256m; support was removed
in 8.0
Java HotSpot(TM) 64-Bit Server VM warning: ignoring option MaxPermSize=256m; support was removed
in 8.0
Java HotSpot(TM) 64-Bit Server VM warning: ignoring option MaxPermSize=256m; support was removed
in 8.0
Java HotSpot(TM) 64-Bit Server VM warning: ignoring option MaxPermSize=256m; support was removed
in 8.0
Running org.apache.hadoop.hbase.filter.TestColumnRangeFilter
Tests run: 1, Failures: 0, Errors: 0, Skipped: 0, Time elapsed: 8.007 sec - in org.apache.hadoop.hbase.filter.TestColumnRangeFilter
Java HotSpot(TM) 64-Bit Server VM warning: ignoring option MaxPermSize=256m; support was removed
in 8.0
Running org.apache.hadoop.hbase.filter.TestMultiRowRangeFilter
Tests run: 1, Failures: 0, Errors: 0, Skipped: 0, Time elapsed: 53.616 sec - in org.apache.hadoop.hbase.filter.TestFilterWithScanLimits
Java HotSpot(TM) 64-Bit Server VM warning: ignoring option MaxPermSize=256m; support was removed
in 8.0
Running org.apache.hadoop.hbase.filter.TestFilterWrapper
Tests run: 1, Failures: 0, Errors: 0, Skipped: 0, Time elapsed: 4.781 sec - in org.apache.hadoop.hbase.filter.TestFilterWrapper
Java HotSpot(TM) 64-Bit Server VM warning: ignoring option MaxPermSize=256m; support was removed
in 8.0
Java HotSpot(TM) 64-Bit Server VM warning: ignoring option MaxPermSize=256m; support was removed
in 8.0
Tests run: 20, Failures: 0, Errors: 0, Skipped: 0, Time elapsed: 28.885 sec - in org.apache.hadoop.hbase.filter.TestMultiRowRangeFilter
Java HotSpot(TM) 64-Bit Server VM warning: ignoring option MaxPermSize=256m; support was removed
in 8.0
Running org.apache.hadoop.hbase.filter.TestFilterListOrOperatorWithBlkCnt
Running org.apache.hadoop.hbase.filter.TestFuzzyRowAndColumnRangeFilter
Tests run: 1, Failures: 0, Errors: 0, Skipped: 0, Time elapsed: 4.369 sec - in org.apache.hadoop.hbase.filter.TestFuzzyRowAndColumnRangeFilter
Java HotSpot(TM) 64-Bit Server VM warning: ignoring option MaxPermSize=256m; support was removed
in 8.0
Java HotSpot(TM) 64-Bit Server VM warning: ignoring option MaxPermSize=256m; support was removed
in 8.0
Java HotSpot(TM) 64-Bit Server VM warning: ignoring option MaxPermSize=256m; support was removed
in 8.0
Java HotSpot(TM) 64-Bit Server VM warning: ignoring option MaxPermSize=256m; support was removed
in 8.0
Java HotSpot(TM) 64-Bit Server VM warning: ignoring option MaxPermSize=256m; support was removed
in 8.0
Java HotSpot(TM) 64-Bit Server VM warning: ignoring option MaxPermSize=256m; support was removed
in 8.0
Tests run: 1, Failures: 0, Errors: 0, Skipped: 0, Time elapsed: 12.246 sec - in org.apache.hadoop.hbase.filter.TestFilterListOrOperatorWithBlkCnt
Java HotSpot(TM) 64-Bit Server VM warning: ignoring option MaxPermSize=256m; support was removed
in 8.0
Java HotSpot(TM) 64-Bit Server VM warning: ignoring option MaxPermSize=256m; support was removed
in 8.0
Java HotSpot(TM) 64-Bit Server VM warning: ignoring option MaxPermSize=256m; support was removed
in 8.0
Java HotSpot(TM) 64-Bit Server VM warning: ignoring option MaxPermSize=256m; support was removed
in 8.0
Java HotSpot(TM) 64-Bit Server VM warning: ignoring option MaxPermSize=256m; support was removed
in 8.0
Java HotSpot(TM) 64-Bit Server VM warning: ignoring option MaxPermSize=256m; support was removed
in 8.0
Java HotSpot(TM) 64-Bit Server VM warning: ignoring option MaxPermSize=256m; support was removed
in 8.0
Running org.apache.hadoop.hbase.filter.TestScanRowPrefix
Tests run: 1, Failures: 0, Errors: 0, Skipped: 0, Time elapsed: 8.607 sec - in org.apache.hadoop.hbase.filter.TestScanRowPrefix
Tests run: 41, Failures: 0, Errors: 0, Skipped: 1, Time elapsed: 362.444 sec - in org.apache.hadoop.hbase.util.TestHBaseFsckOneRS
Tests run: 10, Failures: 0, Errors: 0, Skipped: 0, Time elapsed: 179.571 sec - in org.apache.hadoop.hbase.TestZooKeeper
Tests run: 4, Failures: 0, Errors: 0, Skipped: 0, Time elapsed: 316.828 sec - in org.apache.hadoop.hbase.filter.TestFuzzyRowFilterEndToEnd

Results :

Failed tests: 
  TestMultiSlaveReplication.testMultiSlaveReplication:176->putAndWait:357 Waited too much
time for put replication

Tests run: 2976, Failures: 1, Errors: 0, Skipped: 50

[INFO] ------------------------------------------------------------------------
[INFO] Reactor Summary:
[INFO] 
[INFO] Apache HBase ...................................... SUCCESS [2.058s]
[INFO] Apache HBase - Checkstyle ......................... SUCCESS [0.857s]
[INFO] Apache HBase - Resource Bundle .................... SUCCESS [0.249s]
[INFO] Apache HBase - Annotations ........................ SUCCESS [0.204s]
[INFO] Apache HBase - Protocol ........................... SUCCESS [2.823s]
[INFO] Apache HBase - Common ............................. SUCCESS [1:37.930s]
[INFO] Apache HBase - Procedure .......................... SUCCESS [1:48.395s]
[INFO] Apache HBase - Client ............................. SUCCESS [39.867s]
[INFO] Apache HBase - Hadoop Compatibility ............... SUCCESS [7.864s]
[INFO] Apache HBase - Hadoop Two Compatibility ........... SUCCESS [9.674s]
[INFO] Apache HBase - Prefix Tree ........................ SUCCESS [8.859s]
[INFO] Apache HBase - Server ............................. FAILURE [1:48:30.286s]
[INFO] Apache HBase - Testing Util ....................... SKIPPED
[INFO] Apache HBase - Thrift ............................. SKIPPED
[INFO] Apache HBase - RSGroup ............................ SKIPPED
[INFO] Apache HBase - Shell .............................. SKIPPED
[INFO] Apache HBase - Integration Tests .................. SKIPPED
[INFO] Apache HBase - Examples ........................... SKIPPED
[INFO] Apache HBase - Rest ............................... SKIPPED
[INFO] Apache HBase - External Block Cache ............... SKIPPED
[INFO] Apache HBase - Spark .............................. SKIPPED
[INFO] Apache HBase - Assembly ........................... SKIPPED
[INFO] Apache HBase - Shaded ............................. SKIPPED
[INFO] Apache HBase - Shaded - Client .................... SKIPPED
[INFO] Apache HBase - Shaded - Server .................... SKIPPED
[INFO] Apache HBase - Archetypes ......................... SKIPPED
[INFO] Apache HBase - Exemplar for hbase-client archetype  SKIPPED
[INFO] Apache HBase - Exemplar for hbase-shaded-client archetype  SKIPPED
[INFO] Apache HBase - Archetype builder .................. SKIPPED
[INFO] ------------------------------------------------------------------------
[INFO] BUILD FAILURE
[INFO] ------------------------------------------------------------------------
[INFO] Total time: 1:53:10.282s
[INFO] Finished at: Fri Sep 09 07:59:44 UTC 2016
[INFO] Final Memory: 63M/1981M
[INFO] ------------------------------------------------------------------------
[ERROR] Failed to execute goal org.apache.maven.plugins:maven-surefire-plugin:2.18.1:test
(secondPartTestsExecution) on project hbase-server: There are test failures.
[ERROR] 
[ERROR] Please refer to <https://builds.apache.org/job/HBase-Trunk_matrix/jdk=JDK_1_8,label=yahoo-not-h2/ws/hbase-server/target/surefire-reports>
for the individual test results.
[ERROR] -> [Help 1]
[ERROR] 
[ERROR] To see the full stack trace of the errors, re-run Maven with the -e switch.
[ERROR] Re-run Maven using the -X switch to enable full debug logging.
[ERROR] 
[ERROR] For more information about the errors and possible solutions, please read the following
articles:
[ERROR] [Help 1] http://cwiki.apache.org/confluence/display/MAVEN/MojoFailureException
[ERROR] 
[ERROR] After correcting the problems, you can resume the build with the command
[ERROR]   mvn <goals> -rf :hbase-server
Build step 'Invoke top-level Maven targets' marked build as failure
Performing Post build task...
Match found for :.* : True
Logical operation result is TRUE
Running script  : # Run zombie detector script
./dev-support/zombie-detector.sh --jenkins ${BUILD_ID}
Setting JDK_1_8_LATEST__HOME=/home/jenkins/tools/java/latest1.8
Setting JDK_1_7_LATEST__HOME=/home/jenkins/tools/java/latest1.7
[yahoo-not-h2] $ /bin/bash -xe /tmp/hudson1184898937472779762.sh
+ ./dev-support/zombie-detector.sh --jenkins 1568
Fri Sep  9 07:59:45 UTC 2016 We're ok: there is no zombie test


    {color:green}+1 zombies{color}. No zombie tests found running at the end of the build.
POST BUILD TASK : SUCCESS
END OF POST BUILD TASK : 0
Archiving artifacts
Setting JDK_1_8_LATEST__HOME=/home/jenkins/tools/java/latest1.8
Setting JDK_1_7_LATEST__HOME=/home/jenkins/tools/java/latest1.7
No prior successful build to compare, so performing full copy of artifacts
Recording test results
Setting JDK_1_8_LATEST__HOME=/home/jenkins/tools/java/latest1.8
Setting JDK_1_7_LATEST__HOME=/home/jenkins/tools/java/latest1.7
[FINDBUGS] Skipping publisher since build result is FAILURE
[CHECKSTYLE] Skipping publisher since build result is FAILURE
Setting JDK_1_8_LATEST__HOME=/home/jenkins/tools/java/latest1.8
Setting JDK_1_7_LATEST__HOME=/home/jenkins/tools/java/latest1.7

Mime
View raw message