hbase-builds mailing list archives

Site index · List index
Message view « Date » · « Thread »
Top « Date » · « Thread »
From Apache Jenkins Server <jenk...@builds.apache.org>
Subject Build failed in Jenkins: HBase-0.98-matrix » JDK 1.7 (latest),yahoo-not-h2 #398
Date Wed, 07 Sep 2016 12:47:44 GMT
See <https://builds.apache.org/job/HBase-0.98-matrix/jdk=JDK%201.7%20(latest),label=yahoo-not-h2/398/changes>

Changes:

[chenheng] HBASE-16562 ITBLL should fail to start if misconfigured

------------------------------------------
[...truncated 163 lines...]
[INFO] 
[INFO] --- maven-jar-plugin:2.4:test-jar (default) @ hbase-resource-bundle ---
[INFO] Skipping packaging of the test-jar
[INFO] 
[INFO] --- maven-jar-plugin:2.4:jar (default-jar) @ hbase-resource-bundle ---
[INFO] Building jar: <https://builds.apache.org/job/HBase-0.98-matrix/jdk=JDK%201.7%20(latest),label=yahoo-not-h2/ws/hbase-resource-bundle/target/hbase-resource-bundle-0.98.22.jar>
[INFO] 
[INFO] --- maven-install-plugin:2.3.1:install (default-install) @ hbase-resource-bundle ---
[INFO] Installing <https://builds.apache.org/job/HBase-0.98-matrix/jdk=JDK%201.7%20(latest),label=yahoo-not-h2/ws/hbase-resource-bundle/target/hbase-resource-bundle-0.98.22.jar>
to <https://builds.apache.org/job/HBase-0.98-matrix/jdk=JDK%201.7%20(latest),label=yahoo-not-h2/ws/.repository/org/apache/hbase/hbase-resource-bundle/0.98.22/hbase-resource-bundle-0.98.22.jar>
[INFO] Installing <https://builds.apache.org/job/HBase-0.98-matrix/jdk=JDK%201.7%20(latest),label=yahoo-not-h2/ws/hbase-resource-bundle/pom.xml>
to <https://builds.apache.org/job/HBase-0.98-matrix/jdk=JDK%201.7%20(latest),label=yahoo-not-h2/ws/.repository/org/apache/hbase/hbase-resource-bundle/0.98.22/hbase-resource-bundle-0.98.22.pom>
[INFO]                                                                         
[INFO] ------------------------------------------------------------------------
[INFO] Building Apache HBase - Annotations 0.98.22
[INFO] ------------------------------------------------------------------------
[INFO] 
[INFO] --- maven-enforcer-plugin:1.0.1:enforce (min-maven-min-java-banned-xerces) @ hbase-annotations
---
[INFO] 
[INFO] --- maven-enforcer-plugin:1.0.1:enforce (banned-jsr305) @ hbase-annotations ---
[INFO] 
[INFO] --- buildnumber-maven-plugin:1.3:create-timestamp (default) @ hbase-annotations ---
[INFO] 
[INFO] --- maven-remote-resources-plugin:1.5:process (default) @ hbase-annotations ---
[INFO] 
[INFO] --- maven-resources-plugin:2.6:resources (default-resources) @ hbase-annotations ---
[INFO] Using 'UTF-8' encoding to copy filtered resources.
[INFO] skip non existing resourceDirectory <https://builds.apache.org/job/HBase-0.98-matrix/jdk=JDK%201.7%20(latest),label=yahoo-not-h2/ws/hbase-annotations/src/main/resources>
[INFO] Copying 3 resources
[INFO] 
[INFO] --- maven-compiler-plugin:2.5.1:compile (default-compile) @ hbase-annotations ---
[INFO] Nothing to compile - all classes are up to date
[INFO] 
[INFO] --- maven-resources-plugin:2.6:testResources (default-testResources) @ hbase-annotations
---
[INFO] Using 'UTF-8' encoding to copy filtered resources.
[INFO] skip non existing resourceDirectory <https://builds.apache.org/job/HBase-0.98-matrix/jdk=JDK%201.7%20(latest),label=yahoo-not-h2/ws/hbase-annotations/src/test/resources>
[INFO] Copying 3 resources
[INFO] 
[INFO] --- maven-compiler-plugin:2.5.1:testCompile (default-testCompile) @ hbase-annotations
---
[INFO] Nothing to compile - all classes are up to date
[INFO] 
[INFO] --- maven-surefire-plugin:2.18.1:test (default-test) @ hbase-annotations ---
[INFO] 
[INFO] --- maven-surefire-plugin:2.18.1:test (secondPartTestsExecution) @ hbase-annotations
---
[INFO] 
[INFO] --- maven-jar-plugin:2.4:test-jar (default) @ hbase-annotations ---
[INFO] Building jar: <https://builds.apache.org/job/HBase-0.98-matrix/jdk=JDK%201.7%20(latest),label=yahoo-not-h2/ws/hbase-annotations/target/hbase-annotations-0.98.22-tests.jar>
[INFO] 
[INFO] --- maven-jar-plugin:2.4:jar (default-jar) @ hbase-annotations ---
[INFO] Building jar: <https://builds.apache.org/job/HBase-0.98-matrix/jdk=JDK%201.7%20(latest),label=yahoo-not-h2/ws/hbase-annotations/target/hbase-annotations-0.98.22.jar>
[INFO] 
[INFO] --- maven-install-plugin:2.3.1:install (default-install) @ hbase-annotations ---
[INFO] Installing <https://builds.apache.org/job/HBase-0.98-matrix/jdk=JDK%201.7%20(latest),label=yahoo-not-h2/ws/hbase-annotations/target/hbase-annotations-0.98.22.jar>
to <https://builds.apache.org/job/HBase-0.98-matrix/jdk=JDK%201.7%20(latest),label=yahoo-not-h2/ws/.repository/org/apache/hbase/hbase-annotations/0.98.22/hbase-annotations-0.98.22.jar>
[INFO] Installing <https://builds.apache.org/job/HBase-0.98-matrix/jdk=JDK%201.7%20(latest),label=yahoo-not-h2/ws/hbase-annotations/pom.xml>
to <https://builds.apache.org/job/HBase-0.98-matrix/jdk=JDK%201.7%20(latest),label=yahoo-not-h2/ws/.repository/org/apache/hbase/hbase-annotations/0.98.22/hbase-annotations-0.98.22.pom>
[INFO] Installing <https://builds.apache.org/job/HBase-0.98-matrix/jdk=JDK%201.7%20(latest),label=yahoo-not-h2/ws/hbase-annotations/target/hbase-annotations-0.98.22-tests.jar>
to <https://builds.apache.org/job/HBase-0.98-matrix/jdk=JDK%201.7%20(latest),label=yahoo-not-h2/ws/.repository/org/apache/hbase/hbase-annotations/0.98.22/hbase-annotations-0.98.22-tests.jar>
[INFO]                                                                         
[INFO] ------------------------------------------------------------------------
[INFO] Building Apache HBase - Common 0.98.22
[INFO] ------------------------------------------------------------------------
[INFO] 
[INFO] --- maven-enforcer-plugin:1.0.1:enforce (min-maven-min-java-banned-xerces) @ hbase-common
---
[INFO] 
[INFO] --- maven-enforcer-plugin:1.0.1:enforce (banned-jsr305) @ hbase-common ---
[INFO] 
[INFO] --- buildnumber-maven-plugin:1.3:create-timestamp (default) @ hbase-common ---
[INFO] 
[INFO] --- maven-antrun-plugin:1.6:run (generate) @ hbase-common ---
[INFO] Executing tasks

main:
     [exec] bash: /home/jenkins/jenkins-slave/workspace/HBase-0.98-matrix/jdk/JDK: No such
file or directory
     [exec] Result: 127
[INFO] Executed tasks
[INFO] 
[INFO] --- build-helper-maven-plugin:1.5:add-source (versionInfo-source) @ hbase-common ---
[INFO] Source directory: <https://builds.apache.org/job/HBase-0.98-matrix/jdk=JDK%201.7%20(latest),label=yahoo-not-h2/ws/hbase-common/target/generated-sources/java>
added.
[INFO] 
[INFO] --- maven-remote-resources-plugin:1.5:process (default) @ hbase-common ---
[INFO] 
[INFO] --- maven-resources-plugin:2.6:resources (default-resources) @ hbase-common ---
[INFO] Using 'UTF-8' encoding to copy filtered resources.
[INFO] Copying 1 resource
[INFO] Copying 3 resources
[INFO] 
[INFO] --- maven-antrun-plugin:1.6:run (default) @ hbase-common ---
[INFO] Executing tasks

main:
     [exec] tar: hadoop-snappy-nativelibs.tar: Cannot open: No such file or directory
     [exec] tar: Error is not recoverable: exiting now
     [exec] Result: 2
[INFO] Executed tasks
[INFO] 
[INFO] --- maven-compiler-plugin:2.5.1:compile (default-compile) @ hbase-common ---
[INFO] Compiling 2 source files to <https://builds.apache.org/job/HBase-0.98-matrix/jdk=JDK%201.7%20(latest),label=yahoo-not-h2/ws/hbase-common/target/classes>
[INFO] -------------------------------------------------------------
[ERROR] COMPILATION ERROR : 
[INFO] -------------------------------------------------------------
[ERROR] <https://builds.apache.org/job/HBase-0.98-matrix/jdk=JDK%201.7%20(latest),label=yahoo-not-h2/ws/hbase-common/src/main/java/org/apache/hadoop/hbase/util/VersionInfo.java>:[26,30]
error: cannot find symbol
[ERROR]   symbol:   class Version
  location: package org.apache.hadoop.hbase
<https://builds.apache.org/job/HBase-0.98-matrix/jdk=JDK%201.7%20(latest),label=yahoo-not-h2/ws/hbase-common/src/main/java/org/apache/hadoop/hbase/util/VersionInfo.java>:[43,11]
error: cannot find symbol
[ERROR]   symbol:   variable Version
  location: class VersionInfo
<https://builds.apache.org/job/HBase-0.98-matrix/jdk=JDK%201.7%20(latest),label=yahoo-not-h2/ws/hbase-common/src/main/java/org/apache/hadoop/hbase/util/VersionInfo.java>:[51,11]
error: cannot find symbol
[ERROR]   symbol:   variable Version
  location: class VersionInfo
<https://builds.apache.org/job/HBase-0.98-matrix/jdk=JDK%201.7%20(latest),label=yahoo-not-h2/ws/hbase-common/src/main/java/org/apache/hadoop/hbase/util/VersionInfo.java>:[59,11]
error: cannot find symbol
[ERROR]   symbol:   variable Version
  location: class VersionInfo
<https://builds.apache.org/job/HBase-0.98-matrix/jdk=JDK%201.7%20(latest),label=yahoo-not-h2/ws/hbase-common/src/main/java/org/apache/hadoop/hbase/util/VersionInfo.java>:[67,11]
error: cannot find symbol
[ERROR]   symbol:   variable Version
  location: class VersionInfo
<https://builds.apache.org/job/HBase-0.98-matrix/jdk=JDK%201.7%20(latest),label=yahoo-not-h2/ws/hbase-common/src/main/java/org/apache/hadoop/hbase/util/VersionInfo.java>:[75,11]
error: cannot find symbol
[ERROR]   symbol:   variable Version
  location: class VersionInfo
<https://builds.apache.org/job/HBase-0.98-matrix/jdk=JDK%201.7%20(latest),label=yahoo-not-h2/ws/hbase-common/src/main/java/org/apache/hadoop/hbase/util/VersionInfo.java>:[92,11]
error: cannot find symbol
[INFO] 7 errors 
[INFO] -------------------------------------------------------------
[INFO] ------------------------------------------------------------------------
[INFO] Reactor Summary:
[INFO] 
[INFO] Apache HBase ...................................... SUCCESS [4.918s]
[INFO] Apache HBase - Checkstyle ......................... SUCCESS [1.056s]
[INFO] Apache HBase - Resource Bundle .................... SUCCESS [0.315s]
[INFO] Apache HBase - Annotations ........................ SUCCESS [0.454s]
[INFO] Apache HBase - Common ............................. FAILURE [4.501s]
[INFO] Apache HBase - Protocol ........................... SKIPPED
[INFO] Apache HBase - Client ............................. SKIPPED
[INFO] Apache HBase - Hadoop Compatibility ............... SKIPPED
[INFO] Apache HBase - Hadoop Two Compatibility ........... SKIPPED
[INFO] Apache HBase - Prefix Tree ........................ SKIPPED
[INFO] Apache HBase - Server ............................. SKIPPED
[INFO] Apache HBase - Testing Util ....................... SKIPPED
[INFO] Apache HBase - Thrift ............................. SKIPPED
[INFO] Apache HBase - Rest ............................... SKIPPED
[INFO] Apache HBase - Shell .............................. SKIPPED
[INFO] Apache HBase - Integration Tests .................. SKIPPED
[INFO] Apache HBase - Examples ........................... SKIPPED
[INFO] Apache HBase - Assembly ........................... SKIPPED
[INFO] ------------------------------------------------------------------------
[INFO] BUILD FAILURE
[INFO] ------------------------------------------------------------------------
[INFO] Total time: 13.457s
[INFO] Finished at: Wed Sep 07 12:47:48 UTC 2016
[INFO] Final Memory: 39M/723M
[INFO] ------------------------------------------------------------------------
[ERROR] Failed to execute goal org.apache.maven.plugins:maven-compiler-plugin:2.5.1:compile
(default-compile) on project hbase-common: Compilation failure: Compilation failure:
[ERROR] <https://builds.apache.org/job/HBase-0.98-matrix/jdk=JDK%201.7%20(latest),label=yahoo-not-h2/ws/hbase-common/src/main/java/org/apache/hadoop/hbase/util/VersionInfo.java>:[26,30]
error: cannot find symbol
[ERROR] symbol:   class Version
[ERROR] location: package org.apache.hadoop.hbase
[ERROR] <https://builds.apache.org/job/HBase-0.98-matrix/jdk=JDK%201.7%20(latest),label=yahoo-not-h2/ws/hbase-common/src/main/java/org/apache/hadoop/hbase/util/VersionInfo.java>:[43,11]
error: cannot find symbol
[ERROR] symbol:   variable Version
[ERROR] location: class VersionInfo
[ERROR] <https://builds.apache.org/job/HBase-0.98-matrix/jdk=JDK%201.7%20(latest),label=yahoo-not-h2/ws/hbase-common/src/main/java/org/apache/hadoop/hbase/util/VersionInfo.java>:[51,11]
error: cannot find symbol
[ERROR] symbol:   variable Version
[ERROR] location: class VersionInfo
[ERROR] <https://builds.apache.org/job/HBase-0.98-matrix/jdk=JDK%201.7%20(latest),label=yahoo-not-h2/ws/hbase-common/src/main/java/org/apache/hadoop/hbase/util/VersionInfo.java>:[59,11]
error: cannot find symbol
[ERROR] symbol:   variable Version
[ERROR] location: class VersionInfo
[ERROR] <https://builds.apache.org/job/HBase-0.98-matrix/jdk=JDK%201.7%20(latest),label=yahoo-not-h2/ws/hbase-common/src/main/java/org/apache/hadoop/hbase/util/VersionInfo.java>:[67,11]
error: cannot find symbol
[ERROR] symbol:   variable Version
[ERROR] location: class VersionInfo
[ERROR] <https://builds.apache.org/job/HBase-0.98-matrix/jdk=JDK%201.7%20(latest),label=yahoo-not-h2/ws/hbase-common/src/main/java/org/apache/hadoop/hbase/util/VersionInfo.java>:[75,11]
error: cannot find symbol
[ERROR] symbol:   variable Version
[ERROR] location: class VersionInfo
[ERROR] <https://builds.apache.org/job/HBase-0.98-matrix/jdk=JDK%201.7%20(latest),label=yahoo-not-h2/ws/hbase-common/src/main/java/org/apache/hadoop/hbase/util/VersionInfo.java>:[92,11]
error: cannot find symbol
[ERROR] -> [Help 1]
[ERROR] 
[ERROR] To see the full stack trace of the errors, re-run Maven with the -e switch.
[ERROR] Re-run Maven using the -X switch to enable full debug logging.
[ERROR] 
[ERROR] For more information about the errors and possible solutions, please read the following
articles:
[ERROR] [Help 1] http://cwiki.apache.org/confluence/display/MAVEN/MojoFailureException
[ERROR] 
[ERROR] After correcting the problems, you can resume the build with the command
[ERROR]   mvn <goals> -rf :hbase-common
Build step 'Invoke top-level Maven targets' marked build as failure
Performing Post build task...
Match found for :.* : True
Logical operation result is TRUE
Running script  : # Post-build task script. TODO: Check this in and have all builds reference
check-in.
pwd && ls
# NOTE!!!! The below code has been copied and pasted from ./dev-tools/run-test.sh
# Do not change here without syncing there and vice-versa.
ZOMBIE_TESTS_COUNT=`jps -v | grep surefirebooter | grep -e '-Dhbase.test' | wc -l`
if [[ $ZOMBIE_TESTS_COUNT != 0 ]] ; then
 echo "Suspicious java process found - waiting 30s to see if there are just slow to stop"
 sleep 30
 ZOMBIE_TESTS_COUNT=`jps -v | grep surefirebooter | grep -e '-Dhbase.test' | wc -l`
 if [[ $ZOMBIE_TESTS_COUNT != 0 ]] ; then
   echo " {color:red}There appear to be $ZOMBIE_TESTS_COUNT zombie tests{color}, they should
have been killed by surefire but survived"
   jps -v | grep surefirebooter | grep -e '-Dhbase.test'
   jps -v | grep surefirebooter | grep -e '-Dhbase.test' | cut -d ' ' -f 1 | xargs -n 1 jstack
   # Exit with error
   exit 1
 else
   echo "We're ok: there is no zombie test, but some tests took some time to stop"
 fi
else
  echo "We're ok: there is no zombie test"
fi
[yahoo-not-h2] $ /bin/bash -xe /tmp/hudson1621332208530560894.sh
+ pwd
<https://builds.apache.org/job/HBase-0.98-matrix/jdk=JDK%201.7%20(latest),label=yahoo-not-h2/ws/>
+ ls
bin
CHANGES.txt
conf
dev-support
hbase-annotations
hbase-assembly
hbase-checkstyle
hbase-client
hbase-common
hbase-examples
hbase-hadoop1-compat
hbase-hadoop2-compat
hbase-hadoop-compat
hbase-it
hbase-prefix-tree
hbase-protocol
hbase-resource-bundle
hbase-rest
hbase-server
hbase-shell
hbase-testing-util
hbase-thrift
LICENSE.txt
NOTICE.txt
pom.xml
README.txt
src
target
++ jps -v
++ grep surefirebooter
++ grep -e -Dhbase.test
++ wc -l
+ ZOMBIE_TESTS_COUNT=0
+ [[ 0 != 0 ]]
+ echo 'We'\''re ok: there is no zombie test'
We're ok: there is no zombie test
POST BUILD TASK : SUCCESS
END OF POST BUILD TASK : 0
Archiving artifacts
No prior successful build to compare, so performing full copy of artifacts
Recording test results
ERROR: Step ?Publish JUnit test result report? failed: Test reports were found but none of
them are new. Did tests run? 
For example, <https://builds.apache.org/job/HBase-0.98-matrix/jdk=JDK%201.7%20(latest),label=yahoo-not-h2/398/artifact/hbase-common/target/surefire-reports/TEST-org.apache.hadoop.hbase.TestCellUtil.xml>
is 5 days 23 hr old



Mime
View raw message