hbase-builds mailing list archives

Site index · List index
Message view « Date » · « Thread »
Top « Date » · « Thread »
From Apache Jenkins Server <jenk...@builds.apache.org>
Subject Build failed in Jenkins: HBase-Trunk_matrix » JDK_1_8,yahoo-not-h2 #1598
Date Wed, 14 Sep 2016 07:52:43 GMT
See <https://builds.apache.org/job/HBase-Trunk_matrix/jdk=JDK_1_8,label=yahoo-not-h2/1598/>

------------------------------------------
[...truncated 8726 lines...]
Tests run: 5, Failures: 0, Errors: 0, Skipped: 0, Time elapsed: 22.755 sec - in org.apache.hadoop.hbase.rest.TestNamespacesInstanceResource
Tests run: 4, Failures: 0, Errors: 0, Skipped: 0, Time elapsed: 28.528 sec - in org.apache.hadoop.hbase.rest.TestSchemaResource
Tests run: 21, Failures: 0, Errors: 0, Skipped: 0, Time elapsed: 150.149 sec - in org.apache.hadoop.hbase.rest.TestGetAndPutResource

Results :

Tests run: 99, Failures: 0, Errors: 0, Skipped: 0

[INFO] 
[INFO] --- maven-source-plugin:2.2.1:jar-no-fork (attach-sources) @ hbase-rest ---
[INFO] Building jar: <https://builds.apache.org/job/HBase-Trunk_matrix/jdk=JDK_1_8,label=yahoo-not-h2/ws/hbase-rest/target/hbase-rest-2.0.0-SNAPSHOT-sources.jar>
[INFO] 
[INFO] --- maven-jar-plugin:2.4:test-jar (default) @ hbase-rest ---
[INFO] Building jar: <https://builds.apache.org/job/HBase-Trunk_matrix/jdk=JDK_1_8,label=yahoo-not-h2/ws/hbase-rest/target/hbase-rest-2.0.0-SNAPSHOT-tests.jar>
[INFO] 
[INFO] --- maven-jar-plugin:2.4:jar (default-jar) @ hbase-rest ---
[INFO] Building jar: <https://builds.apache.org/job/HBase-Trunk_matrix/jdk=JDK_1_8,label=yahoo-not-h2/ws/hbase-rest/target/hbase-rest-2.0.0-SNAPSHOT.jar>
[INFO] 
[INFO] --- maven-install-plugin:2.3.1:install (default-install) @ hbase-rest ---
[INFO] Installing <https://builds.apache.org/job/HBase-Trunk_matrix/jdk=JDK_1_8,label=yahoo-not-h2/ws/hbase-rest/target/hbase-rest-2.0.0-SNAPSHOT.jar>
to /home/jenkins/.m2/repository/org/apache/hbase/hbase-rest/2.0.0-SNAPSHOT/hbase-rest-2.0.0-SNAPSHOT.jar
[INFO] Installing <https://builds.apache.org/job/HBase-Trunk_matrix/jdk=JDK_1_8,label=yahoo-not-h2/1598/artifact/hbase-rest/pom.xml>
to /home/jenkins/.m2/repository/org/apache/hbase/hbase-rest/2.0.0-SNAPSHOT/hbase-rest-2.0.0-SNAPSHOT.pom
[INFO] Installing <https://builds.apache.org/job/HBase-Trunk_matrix/jdk=JDK_1_8,label=yahoo-not-h2/ws/hbase-rest/target/hbase-rest-2.0.0-SNAPSHOT-sources.jar>
to /home/jenkins/.m2/repository/org/apache/hbase/hbase-rest/2.0.0-SNAPSHOT/hbase-rest-2.0.0-SNAPSHOT-sources.jar
[INFO] Installing <https://builds.apache.org/job/HBase-Trunk_matrix/jdk=JDK_1_8,label=yahoo-not-h2/ws/hbase-rest/target/hbase-rest-2.0.0-SNAPSHOT-tests.jar>
to /home/jenkins/.m2/repository/org/apache/hbase/hbase-rest/2.0.0-SNAPSHOT/hbase-rest-2.0.0-SNAPSHOT-tests.jar
[INFO]                                                                         
[INFO] ------------------------------------------------------------------------
[INFO] Building Apache HBase - External Block Cache 2.0.0-SNAPSHOT
[INFO] ------------------------------------------------------------------------
[INFO] 
[INFO] --- maven-enforcer-plugin:1.0.1:enforce (min-maven-min-java-banned-xerces) @ hbase-external-blockcache
---
[INFO] 
[INFO] --- maven-enforcer-plugin:1.0.1:enforce (banned-jsr305) @ hbase-external-blockcache
---
[INFO] 
[INFO] --- buildnumber-maven-plugin:1.3:create-timestamp (default) @ hbase-external-blockcache
---
[INFO] 
[INFO] --- build-helper-maven-plugin:1.9.1:add-source (versionInfo-source) @ hbase-external-blockcache
---
[INFO] Source directory: <https://builds.apache.org/job/HBase-Trunk_matrix/jdk=JDK_1_8,label=yahoo-not-h2/ws/hbase-external-blockcache/target/generated-sources/java>
added.
[INFO] 
[INFO] --- maven-remote-resources-plugin:1.5:process (default) @ hbase-external-blockcache
---
[INFO] 
[INFO] --- maven-resources-plugin:2.6:resources (default-resources) @ hbase-external-blockcache
---
[INFO] Using 'UTF-8' encoding to copy filtered resources.
[INFO] skip non existing resourceDirectory <https://builds.apache.org/job/HBase-Trunk_matrix/jdk=JDK_1_8,label=yahoo-not-h2/ws/hbase-external-blockcache/src/main/resources>
[INFO] Copying 3 resources
[INFO] 
[INFO] --- maven-compiler-plugin:3.2:compile (default-compile) @ hbase-external-blockcache
---
[INFO] Nothing to compile - all classes are up to date
[INFO] 
[INFO] --- maven-dependency-plugin:2.1:build-classpath (create-mrapp-generated-classpath)
@ hbase-external-blockcache ---
[INFO] Skipped writing classpath file '<https://builds.apache.org/job/HBase-Trunk_matrix/jdk=JDK_1_8,label=yahoo-not-h2/ws/hbase-external-blockcache/target/test-classes/mrapp-generated-classpath'.>
 No changes found.
[INFO] 
[INFO] --- maven-resources-plugin:2.6:testResources (default-testResources) @ hbase-external-blockcache
---
[INFO] Using 'UTF-8' encoding to copy filtered resources.
[INFO] skip non existing resourceDirectory <https://builds.apache.org/job/HBase-Trunk_matrix/jdk=JDK_1_8,label=yahoo-not-h2/ws/hbase-external-blockcache/src/test/resources>
[INFO] Copying 3 resources
[INFO] 
[INFO] --- maven-compiler-plugin:3.2:testCompile (default-testCompile) @ hbase-external-blockcache
---
[INFO] No sources to compile
[INFO] 
[INFO] --- maven-surefire-plugin:2.18.1:test (default-test) @ hbase-external-blockcache ---
[INFO] 
[INFO] --- maven-surefire-plugin:2.18.1:test (secondPartTestsExecution) @ hbase-external-blockcache
---
[INFO] Tests are skipped.
[INFO] 
[INFO] --- maven-source-plugin:2.2.1:jar-no-fork (attach-sources) @ hbase-external-blockcache
---
[INFO] Building jar: <https://builds.apache.org/job/HBase-Trunk_matrix/jdk=JDK_1_8,label=yahoo-not-h2/ws/hbase-external-blockcache/target/hbase-external-blockcache-2.0.0-SNAPSHOT-sources.jar>
[INFO] 
[INFO] --- maven-jar-plugin:2.4:test-jar (default) @ hbase-external-blockcache ---
[INFO] Building jar: <https://builds.apache.org/job/HBase-Trunk_matrix/jdk=JDK_1_8,label=yahoo-not-h2/ws/hbase-external-blockcache/target/hbase-external-blockcache-2.0.0-SNAPSHOT-tests.jar>
[INFO] 
[INFO] --- maven-jar-plugin:2.4:jar (default-jar) @ hbase-external-blockcache ---
[INFO] Building jar: <https://builds.apache.org/job/HBase-Trunk_matrix/jdk=JDK_1_8,label=yahoo-not-h2/ws/hbase-external-blockcache/target/hbase-external-blockcache-2.0.0-SNAPSHOT.jar>
[INFO] 
[INFO] --- maven-install-plugin:2.3.1:install (default-install) @ hbase-external-blockcache
---
[INFO] Installing <https://builds.apache.org/job/HBase-Trunk_matrix/jdk=JDK_1_8,label=yahoo-not-h2/ws/hbase-external-blockcache/target/hbase-external-blockcache-2.0.0-SNAPSHOT.jar>
to /home/jenkins/.m2/repository/org/apache/hbase/hbase-external-blockcache/2.0.0-SNAPSHOT/hbase-external-blockcache-2.0.0-SNAPSHOT.jar
[INFO] Installing <https://builds.apache.org/job/HBase-Trunk_matrix/jdk=JDK_1_8,label=yahoo-not-h2/1598/artifact/hbase-external-blockcache/pom.xml>
to /home/jenkins/.m2/repository/org/apache/hbase/hbase-external-blockcache/2.0.0-SNAPSHOT/hbase-external-blockcache-2.0.0-SNAPSHOT.pom
[INFO] Installing <https://builds.apache.org/job/HBase-Trunk_matrix/jdk=JDK_1_8,label=yahoo-not-h2/ws/hbase-external-blockcache/target/hbase-external-blockcache-2.0.0-SNAPSHOT-sources.jar>
to /home/jenkins/.m2/repository/org/apache/hbase/hbase-external-blockcache/2.0.0-SNAPSHOT/hbase-external-blockcache-2.0.0-SNAPSHOT-sources.jar
[INFO] Installing <https://builds.apache.org/job/HBase-Trunk_matrix/jdk=JDK_1_8,label=yahoo-not-h2/ws/hbase-external-blockcache/target/hbase-external-blockcache-2.0.0-SNAPSHOT-tests.jar>
to /home/jenkins/.m2/repository/org/apache/hbase/hbase-external-blockcache/2.0.0-SNAPSHOT/hbase-external-blockcache-2.0.0-SNAPSHOT-tests.jar
[INFO]                                                                         
[INFO] ------------------------------------------------------------------------
[INFO] Building Apache HBase - Spark 2.0.0-SNAPSHOT
[INFO] ------------------------------------------------------------------------
[INFO] 
[INFO] --- build-helper-maven-plugin:1.9.1:add-source (add-source) @ hbase-spark ---
[INFO] Source directory: <https://builds.apache.org/job/HBase-Trunk_matrix/jdk=JDK_1_8,label=yahoo-not-h2/ws/hbase-spark/src/main/scala>
added.
[INFO] 
[INFO] --- build-helper-maven-plugin:1.9.1:add-test-source (add-test-source) @ hbase-spark
---
[INFO] Test Source directory: <https://builds.apache.org/job/HBase-Trunk_matrix/jdk=JDK_1_8,label=yahoo-not-h2/ws/hbase-spark/src/test/scala>
added.
[INFO] 
[INFO] --- maven-enforcer-plugin:1.0.1:enforce (min-maven-min-java-banned-xerces) @ hbase-spark
---
[INFO] 
[INFO] --- maven-enforcer-plugin:1.0.1:enforce (banned-jsr305) @ hbase-spark ---
[WARNING] Rule 0: org.apache.maven.plugins.enforcer.BannedDependencies failed with message:
We don't allow the JSR305 jar from the Findbugs project, see HBASE-16321.
Found Banned Dependency: com.google.code.findbugs:jsr305:jar:1.3.9
Use 'mvn dependency:tree' to locate the source of the banned dependencies.
[INFO] 
[INFO] --- buildnumber-maven-plugin:1.3:create-timestamp (default) @ hbase-spark ---
[INFO] 
[INFO] --- maven-remote-resources-plugin:1.5:process (default) @ hbase-spark ---
[INFO] 
[INFO] --- maven-resources-plugin:2.6:resources (default-resources) @ hbase-spark ---
[INFO] Using 'UTF-8' encoding to copy filtered resources.
[INFO] skip non existing resourceDirectory <https://builds.apache.org/job/HBase-Trunk_matrix/jdk=JDK_1_8,label=yahoo-not-h2/ws/hbase-spark/src/main/resources>
[INFO] Copying 3 resources
[INFO] 
[INFO] --- scala-maven-plugin:3.2.0:add-source (scala-compile-first) @ hbase-spark ---
[INFO] 
[INFO] --- scala-maven-plugin:3.2.0:compile (scala-compile-first) @ hbase-spark ---
[WARNING]  Expected all dependencies to require Scala version: 2.10.4
[WARNING]  org.apache.hbase:hbase-spark:2.0.0-SNAPSHOT requires scala version: 2.10.4
[WARNING]  org.apache.spark:spark-streaming_2.10:1.6.0 requires scala version: 2.10.5
[WARNING] Multiple versions of scala libraries detected!
[INFO] Nothing to compile - all classes are up to date
[INFO] 
[INFO] --- maven-compiler-plugin:3.2:compile (default-compile) @ hbase-spark ---
[INFO] Nothing to compile - all classes are up to date
[INFO] 
[INFO] --- maven-resources-plugin:2.6:testResources (default-testResources) @ hbase-spark
---
[INFO] Using 'UTF-8' encoding to copy filtered resources.
[INFO] Copying 2 resources
[INFO] Copying 3 resources
[INFO] 
[INFO] --- scala-maven-plugin:3.2.0:testCompile (scala-test-compile) @ hbase-spark ---
[WARNING]  Expected all dependencies to require Scala version: 2.10.4
[WARNING]  org.apache.hbase:hbase-spark:2.0.0-SNAPSHOT requires scala version: 2.10.4
[WARNING]  org.apache.spark:spark-streaming_2.10:1.6.0 requires scala version: 2.10.5
[WARNING] Multiple versions of scala libraries detected!
[INFO] Nothing to compile - all classes are up to date
[INFO] 
[INFO] --- maven-compiler-plugin:3.2:testCompile (default-testCompile) @ hbase-spark ---
[INFO] Nothing to compile - all classes are up to date
[INFO] 
[INFO] --- maven-surefire-plugin:2.18.1:test (default-test) @ hbase-spark ---
[INFO] Surefire report directory: <https://builds.apache.org/job/HBase-Trunk_matrix/jdk=JDK_1_8,label=yahoo-not-h2/ws/hbase-spark/target/surefire-reports>
[INFO] Using configured provider org.apache.maven.surefire.junitcore.JUnitCoreProvider
[INFO] parallel='none', perCoreThreadCount=true, threadCount=0, useUnlimitedThreads=false,
threadCountSuites=0, threadCountClasses=0, threadCountMethods=0, parallelOptimized=true

-------------------------------------------------------
 T E S T S
-------------------------------------------------------
Java HotSpot(TM) 64-Bit Server VM warning: ignoring option MaxPermSize=256m; support was removed
in 8.0

Results :

Tests run: 0, Failures: 0, Errors: 0, Skipped: 0

[INFO] 
[INFO] --- scalatest-maven-plugin:1.0:test (test) @ hbase-spark ---
[INFO] Tests are skipped.
[INFO] 
[INFO] --- maven-surefire-plugin:2.18.1:test (secondPartTestsExecution) @ hbase-spark ---
[INFO] Tests are skipped.
[INFO] 
[INFO] --- maven-jar-plugin:2.4:test-jar (default) @ hbase-spark ---
[INFO] Building jar: <https://builds.apache.org/job/HBase-Trunk_matrix/jdk=JDK_1_8,label=yahoo-not-h2/ws/hbase-spark/target/hbase-spark-2.0.0-SNAPSHOT-tests.jar>
[INFO] 
[INFO] --- maven-jar-plugin:2.4:jar (default-jar) @ hbase-spark ---
[INFO] Building jar: <https://builds.apache.org/job/HBase-Trunk_matrix/jdk=JDK_1_8,label=yahoo-not-h2/ws/hbase-spark/target/hbase-spark-2.0.0-SNAPSHOT.jar>
[INFO] 
[INFO] --- scalatest-maven-plugin:1.0:test (integration-test) @ hbase-spark ---
Discovery starting.
*** RUN ABORTED ***
  java.lang.UnsupportedClassVersionError: org/apache/hadoop/hbase/spark/example/hbasecontext/JavaHBaseDistributedScan
: Unsupported major.minor version 52.0
  at java.lang.ClassLoader.defineClass1(Native Method)
  at java.lang.ClassLoader.defineClass(ClassLoader.java:803)
  at java.security.SecureClassLoader.defineClass(SecureClassLoader.java:142)
  at java.net.URLClassLoader.defineClass(URLClassLoader.java:449)
  at java.net.URLClassLoader.access$100(URLClassLoader.java:71)
  at java.net.URLClassLoader$1.run(URLClassLoader.java:361)
  at java.net.URLClassLoader$1.run(URLClassLoader.java:355)
  at java.security.AccessController.doPrivileged(Native Method)
  at java.net.URLClassLoader.findClass(URLClassLoader.java:354)
  at java.lang.ClassLoader.loadClass(ClassLoader.java:425)
  ...
[INFO] ------------------------------------------------------------------------
[INFO] Reactor Summary:
[INFO] 
[INFO] Apache HBase ...................................... SUCCESS [1.995s]
[INFO] Apache HBase - Checkstyle ......................... SUCCESS [0.692s]
[INFO] Apache HBase - Resource Bundle .................... SUCCESS [0.141s]
[INFO] Apache HBase - Annotations ........................ SUCCESS [0.154s]
[INFO] Apache HBase - Protocol ........................... SUCCESS [2.774s]
[INFO] Apache HBase - Common ............................. SUCCESS [1:36.209s]
[INFO] Apache HBase - Procedure .......................... SUCCESS [1:45.850s]
[INFO] Apache HBase - Client ............................. SUCCESS [38.481s]
[INFO] Apache HBase - Hadoop Compatibility ............... SUCCESS [7.787s]
[INFO] Apache HBase - Hadoop Two Compatibility ........... SUCCESS [9.041s]
[INFO] Apache HBase - Prefix Tree ........................ SUCCESS [8.452s]
[INFO] Apache HBase - Server ............................. SUCCESS [1:51:23.648s]
[INFO] Apache HBase - Testing Util ....................... SUCCESS [1.609s]
[INFO] Apache HBase - Thrift ............................. SUCCESS [7.691s]
[INFO] Apache HBase - RSGroup ............................ SUCCESS [4.910s]
[INFO] Apache HBase - Shell .............................. SUCCESS [8:54.475s]
[INFO] Apache HBase - Integration Tests .................. SUCCESS [2.375s]
[INFO] Apache HBase - Examples ........................... SUCCESS [5.166s]
[INFO] Apache HBase - Rest ............................... SUCCESS [4:04.695s]
[INFO] Apache HBase - External Block Cache ............... SUCCESS [1.639s]
[INFO] Apache HBase - Spark .............................. FAILURE [4.709s]
[INFO] Apache HBase - Assembly ........................... SKIPPED
[INFO] Apache HBase - Shaded ............................. SKIPPED
[INFO] Apache HBase - Shaded - Client .................... SKIPPED
[INFO] Apache HBase - Shaded - Server .................... SKIPPED
[INFO] Apache HBase - Archetypes ......................... SKIPPED
[INFO] Apache HBase - Exemplar for hbase-client archetype  SKIPPED
[INFO] Apache HBase - Exemplar for hbase-shaded-client archetype  SKIPPED
[INFO] Apache HBase - Archetype builder .................. SKIPPED
[INFO] ------------------------------------------------------------------------
[INFO] BUILD FAILURE
[INFO] ------------------------------------------------------------------------
[INFO] Total time: 2:09:23.684s
[INFO] Finished at: Wed Sep 14 07:47:22 UTC 2016
[INFO] Final Memory: 119M/1635M
[INFO] ------------------------------------------------------------------------
[ERROR] Failed to execute goal org.scalatest:scalatest-maven-plugin:1.0:test (integration-test)
on project hbase-spark: There are test failures -> [Help 1]
[ERROR] 
[ERROR] To see the full stack trace of the errors, re-run Maven with the -e switch.
[ERROR] Re-run Maven using the -X switch to enable full debug logging.
[ERROR] 
[ERROR] For more information about the errors and possible solutions, please read the following
articles:
[ERROR] [Help 1] http://cwiki.apache.org/confluence/display/MAVEN/MojoFailureException
[ERROR] 
[ERROR] After correcting the problems, you can resume the build with the command
[ERROR]   mvn <goals> -rf :hbase-spark
Build step 'Invoke top-level Maven targets' marked build as failure
Performing Post build task...
Match found for :.* : True
Logical operation result is TRUE
Running script  : # Run zombie detector script
./dev-support/zombie-detector.sh --jenkins ${BUILD_ID}
Setting JDK_1_8_LATEST__HOME=/home/jenkins/tools/java/latest1.8
Setting JDK_1_7_LATEST__HOME=/home/jenkins/tools/java/latest1.7
[yahoo-not-h2] $ /bin/bash -xe /tmp/hudson3306858086266286055.sh
+ ./dev-support/zombie-detector.sh --jenkins 1598
Wed Sep 14 07:47:24 UTC 2016 We're ok: there is no zombie test


    {color:green}+1 zombies{color}. No zombie tests found running at the end of the build.
POST BUILD TASK : SUCCESS
END OF POST BUILD TASK : 0
Archiving artifacts
Setting JDK_1_8_LATEST__HOME=/home/jenkins/tools/java/latest1.8
Setting JDK_1_7_LATEST__HOME=/home/jenkins/tools/java/latest1.7
Recording test results
Setting JDK_1_8_LATEST__HOME=/home/jenkins/tools/java/latest1.8
Setting JDK_1_7_LATEST__HOME=/home/jenkins/tools/java/latest1.7
[FINDBUGS] Skipping publisher since build result is FAILURE
[CHECKSTYLE] Skipping publisher since build result is FAILURE
Setting JDK_1_8_LATEST__HOME=/home/jenkins/tools/java/latest1.8
Setting JDK_1_7_LATEST__HOME=/home/jenkins/tools/java/latest1.7

Mime
View raw message