hbase-builds mailing list archives

Site index · List index
Message view « Date » · « Thread »
Top « Date » · « Thread »
From Apache Jenkins Server <jenk...@builds.apache.org>
Subject Build failed in Jenkins: HBase-Trunk_matrix » JDK 1.8 (latest),yahoo-not-h2 #1527
Date Fri, 02 Sep 2016 13:45:03 GMT
See <https://builds.apache.org/job/HBase-Trunk_matrix/jdk=JDK%201.8%20(latest),label=yahoo-not-h2/1527/>

------------------------------------------
[...truncated 4550 lines...]
Running org.apache.hadoop.hbase.util.TestBytes
Tests run: 31, Failures: 0, Errors: 0, Skipped: 0, Time elapsed: 1.299 sec - in org.apache.hadoop.hbase.util.TestBytes
Java HotSpot(TM) 64-Bit Server VM warning: ignoring option MaxPermSize=256m; support was removed
in 8.0
Running org.apache.hadoop.hbase.util.TestBase64
Tests run: 1, Failures: 0, Errors: 0, Skipped: 0, Time elapsed: 0.166 sec - in org.apache.hadoop.hbase.util.TestBase64
Java HotSpot(TM) 64-Bit Server VM warning: ignoring option MaxPermSize=256m; support was removed
in 8.0
Running org.apache.hadoop.hbase.util.TestSimpleMutableByteRange
Tests run: 3, Failures: 0, Errors: 0, Skipped: 0, Time elapsed: 0.255 sec - in org.apache.hadoop.hbase.util.TestSimpleMutableByteRange
Java HotSpot(TM) 64-Bit Server VM warning: ignoring option MaxPermSize=256m; support was removed
in 8.0
Running org.apache.hadoop.hbase.util.TestByteRangeWithKVSerialization
Tests run: 1, Failures: 0, Errors: 0, Skipped: 0, Time elapsed: 0.963 sec - in org.apache.hadoop.hbase.util.TestByteRangeWithKVSerialization
Java HotSpot(TM) 64-Bit Server VM warning: ignoring option MaxPermSize=256m; support was removed
in 8.0
Running org.apache.hadoop.hbase.util.TestOrderedBytes
Tests run: 20, Failures: 0, Errors: 0, Skipped: 0, Time elapsed: 0.903 sec - in org.apache.hadoop.hbase.util.TestOrderedBytes
Java HotSpot(TM) 64-Bit Server VM warning: ignoring option MaxPermSize=256m; support was removed
in 8.0
Running org.apache.hadoop.hbase.util.TestThreads
Tests run: 1, Failures: 0, Errors: 0, Skipped: 0, Time elapsed: 3.134 sec - in org.apache.hadoop.hbase.util.TestThreads
Java HotSpot(TM) 64-Bit Server VM warning: ignoring option MaxPermSize=256m; support was removed
in 8.0
Running org.apache.hadoop.hbase.util.TestByteBufferArray
Tests run: 1, Failures: 0, Errors: 0, Skipped: 0, Time elapsed: 0.241 sec - in org.apache.hadoop.hbase.util.TestByteBufferArray
Java HotSpot(TM) 64-Bit Server VM warning: ignoring option MaxPermSize=256m; support was removed
in 8.0
Running org.apache.hadoop.hbase.util.TestBoundedArrayQueue
Tests run: 1, Failures: 0, Errors: 0, Skipped: 0, Time elapsed: 0.156 sec - in org.apache.hadoop.hbase.util.TestBoundedArrayQueue
Java HotSpot(TM) 64-Bit Server VM warning: ignoring option MaxPermSize=256m; support was removed
in 8.0
Java HotSpot(TM) 64-Bit Server VM warning: ignoring option MaxPermSize=256m; support was removed
in 8.0
Running org.apache.hadoop.hbase.util.TestWeakObjectPool
Tests run: 3, Failures: 0, Errors: 0, Skipped: 0, Time elapsed: 0.405 sec - in org.apache.hadoop.hbase.util.TestWeakObjectPool
Java HotSpot(TM) 64-Bit Server VM warning: ignoring option MaxPermSize=256m; support was removed
in 8.0
Running org.apache.hadoop.hbase.util.TestShowProperties
Tests run: 1, Failures: 0, Errors: 0, Skipped: 0, Time elapsed: 0.124 sec - in org.apache.hadoop.hbase.util.TestShowProperties
Java HotSpot(TM) 64-Bit Server VM warning: ignoring option MaxPermSize=256m; support was removed
in 8.0
Running org.apache.hadoop.hbase.util.TestDrainBarrier
Tests run: 6, Failures: 0, Errors: 0, Skipped: 0, Time elapsed: 1.312 sec - in org.apache.hadoop.hbase.util.TestDrainBarrier
Java HotSpot(TM) 64-Bit Server VM warning: ignoring option MaxPermSize=256m; support was removed
in 8.0
Java HotSpot(TM) 64-Bit Server VM warning: ignoring option MaxPermSize=256m; support was removed
in 8.0
Running org.apache.hadoop.hbase.util.TestOrder
Tests run: 2, Failures: 0, Errors: 0, Skipped: 0, Time elapsed: 0.159 sec - in org.apache.hadoop.hbase.util.TestOrder
Java HotSpot(TM) 64-Bit Server VM warning: ignoring option MaxPermSize=256m; support was removed
in 8.0
Running org.apache.hadoop.hbase.util.TestKeyLocker
Tests run: 1, Failures: 0, Errors: 0, Skipped: 0, Time elapsed: 0.213 sec - in org.apache.hadoop.hbase.util.TestKeyLocker
Java HotSpot(TM) 64-Bit Server VM warning: ignoring option MaxPermSize=256m; support was removed
in 8.0
Running org.apache.hadoop.hbase.TestCompoundConfiguration
Tests run: 6, Failures: 0, Errors: 0, Skipped: 0, Time elapsed: 0.581 sec - in org.apache.hadoop.hbase.TestCompoundConfiguration
Java HotSpot(TM) 64-Bit Server VM warning: ignoring option MaxPermSize=256m; support was removed
in 8.0
Java HotSpot(TM) 64-Bit Server VM warning: ignoring option MaxPermSize=256m; support was removed
in 8.0
Running org.apache.hadoop.hbase.TestCellComparator
Tests run: 3, Failures: 0, Errors: 0, Skipped: 0, Time elapsed: 0.229 sec - in org.apache.hadoop.hbase.TestCellComparator
Java HotSpot(TM) 64-Bit Server VM warning: ignoring option MaxPermSize=256m; support was removed
in 8.0
Running org.apache.hadoop.hbase.types.TestFixedLengthWrapper
Tests run: 4, Failures: 0, Errors: 0, Skipped: 0, Time elapsed: 0.289 sec - in org.apache.hadoop.hbase.types.TestFixedLengthWrapper
Java HotSpot(TM) 64-Bit Server VM warning: ignoring option MaxPermSize=256m; support was removed
in 8.0
Running org.apache.hadoop.hbase.types.TestUnion2
Tests run: 2, Failures: 0, Errors: 0, Skipped: 0, Time elapsed: 0.229 sec - in org.apache.hadoop.hbase.types.TestUnion2
Java HotSpot(TM) 64-Bit Server VM warning: ignoring option MaxPermSize=256m; support was removed
in 8.0
Running org.apache.hadoop.hbase.types.TestStructNullExtension
Tests run: 2, Failures: 0, Errors: 0, Skipped: 0, Time elapsed: 0.246 sec - in org.apache.hadoop.hbase.types.TestStructNullExtension
Java HotSpot(TM) 64-Bit Server VM warning: ignoring option MaxPermSize=256m; support was removed
in 8.0
Running org.apache.hadoop.hbase.types.TestOrderedBlobVar
Tests run: 1, Failures: 0, Errors: 0, Skipped: 0, Time elapsed: 0.153 sec - in org.apache.hadoop.hbase.types.TestOrderedBlobVar
Java HotSpot(TM) 64-Bit Server VM warning: ignoring option MaxPermSize=256m; support was removed
in 8.0
Running org.apache.hadoop.hbase.types.TestRawString
Tests run: 1, Failures: 0, Errors: 0, Skipped: 0, Time elapsed: 0.194 sec - in org.apache.hadoop.hbase.types.TestRawString
Java HotSpot(TM) 64-Bit Server VM warning: ignoring option MaxPermSize=256m; support was removed
in 8.0
Running org.apache.hadoop.hbase.types.TestStruct
Tests run: 2, Failures: 0, Errors: 0, Skipped: 0, Time elapsed: 0.159 sec - in org.apache.hadoop.hbase.types.TestStruct
Java HotSpot(TM) 64-Bit Server VM warning: ignoring option MaxPermSize=256m; support was removed
in 8.0
Running org.apache.hadoop.hbase.types.TestCopyOnWriteMaps
Tests run: 22, Failures: 0, Errors: 0, Skipped: 0, Time elapsed: 13.064 sec - in org.apache.hadoop.hbase.types.TestCopyOnWriteMaps
Java HotSpot(TM) 64-Bit Server VM warning: ignoring option MaxPermSize=256m; support was removed
in 8.0
Running org.apache.hadoop.hbase.types.TestTerminatedWrapper
Tests run: 8, Failures: 0, Errors: 0, Skipped: 0, Time elapsed: 0.377 sec - in org.apache.hadoop.hbase.types.TestTerminatedWrapper
Java HotSpot(TM) 64-Bit Server VM warning: ignoring option MaxPermSize=256m; support was removed
in 8.0
Running org.apache.hadoop.hbase.types.TestOrderedString
Tests run: 1, Failures: 0, Errors: 0, Skipped: 0, Time elapsed: 0.159 sec - in org.apache.hadoop.hbase.types.TestOrderedString
Java HotSpot(TM) 64-Bit Server VM warning: ignoring option MaxPermSize=256m; support was removed
in 8.0
Running org.apache.hadoop.hbase.types.TestOrderedBlob
Tests run: 1, Failures: 0, Errors: 0, Skipped: 0, Time elapsed: 0.161 sec - in org.apache.hadoop.hbase.types.TestOrderedBlob
Java HotSpot(TM) 64-Bit Server VM warning: ignoring option MaxPermSize=256m; support was removed
in 8.0
Running org.apache.hadoop.hbase.TestOffheapKeyValue
Tests run: 3, Failures: 0, Errors: 0, Skipped: 0, Time elapsed: 0.248 sec - in org.apache.hadoop.hbase.TestOffheapKeyValue
Java HotSpot(TM) 64-Bit Server VM warning: ignoring option MaxPermSize=256m; support was removed
in 8.0
Running org.apache.hadoop.hbase.TestTimeout
Tests run: 2, Failures: 0, Errors: 0, Skipped: 1, Time elapsed: 0.267 sec - in org.apache.hadoop.hbase.TestTimeout

Results :

Tests run: 215, Failures: 0, Errors: 0, Skipped: 1

[INFO] 
[INFO] --- maven-surefire-plugin:2.18.1:test (secondPartTestsExecution) @ hbase-common ---
[INFO] Tests are skipped.
[INFO] 
[INFO] --- maven-source-plugin:2.2.1:jar-no-fork (attach-sources) @ hbase-common ---
[INFO] Building jar: <https://builds.apache.org/job/HBase-Trunk_matrix/jdk=JDK%201.8%20(latest),label=yahoo-not-h2/ws/hbase-common/target/hbase-common-2.0.0-SNAPSHOT-sources.jar>
[INFO] 
[INFO] --- maven-jar-plugin:2.4:test-jar (default) @ hbase-common ---
[INFO] Building jar: <https://builds.apache.org/job/HBase-Trunk_matrix/jdk=JDK%201.8%20(latest),label=yahoo-not-h2/ws/hbase-common/target/hbase-common-2.0.0-SNAPSHOT-tests.jar>
[INFO] 
[INFO] --- maven-jar-plugin:2.4:jar (default-jar) @ hbase-common ---
[INFO] Building jar: <https://builds.apache.org/job/HBase-Trunk_matrix/jdk=JDK%201.8%20(latest),label=yahoo-not-h2/ws/hbase-common/target/hbase-common-2.0.0-SNAPSHOT.jar>
[INFO] 
[INFO] --- maven-install-plugin:2.3.1:install (default-install) @ hbase-common ---
[INFO] Installing <https://builds.apache.org/job/HBase-Trunk_matrix/jdk=JDK%201.8%20(latest),label=yahoo-not-h2/ws/hbase-common/target/hbase-common-2.0.0-SNAPSHOT.jar>
to /home/jenkins/.m2/repository/org/apache/hbase/hbase-common/2.0.0-SNAPSHOT/hbase-common-2.0.0-SNAPSHOT.jar
[INFO] Installing <https://builds.apache.org/job/HBase-Trunk_matrix/jdk=JDK%201.8%20(latest),label=yahoo-not-h2/1527/artifact/hbase-common/pom.xml>
to /home/jenkins/.m2/repository/org/apache/hbase/hbase-common/2.0.0-SNAPSHOT/hbase-common-2.0.0-SNAPSHOT.pom
[INFO] Installing <https://builds.apache.org/job/HBase-Trunk_matrix/jdk=JDK%201.8%20(latest),label=yahoo-not-h2/ws/hbase-common/target/hbase-common-2.0.0-SNAPSHOT-sources.jar>
to /home/jenkins/.m2/repository/org/apache/hbase/hbase-common/2.0.0-SNAPSHOT/hbase-common-2.0.0-SNAPSHOT-sources.jar
[INFO] Installing <https://builds.apache.org/job/HBase-Trunk_matrix/jdk=JDK%201.8%20(latest),label=yahoo-not-h2/ws/hbase-common/target/hbase-common-2.0.0-SNAPSHOT-tests.jar>
to /home/jenkins/.m2/repository/org/apache/hbase/hbase-common/2.0.0-SNAPSHOT/hbase-common-2.0.0-SNAPSHOT-tests.jar
[INFO]                                                                         
[INFO] ------------------------------------------------------------------------
[INFO] Building Apache HBase - Procedure 2.0.0-SNAPSHOT
[INFO] ------------------------------------------------------------------------
[INFO] 
[INFO] --- maven-enforcer-plugin:1.0.1:enforce (min-maven-min-java-banned-xerces) @ hbase-procedure
---
[INFO] 
[INFO] --- maven-enforcer-plugin:1.0.1:enforce (banned-jsr305) @ hbase-procedure ---
[INFO] 
[INFO] --- buildnumber-maven-plugin:1.3:create-timestamp (default) @ hbase-procedure ---
[INFO] 
[INFO] --- maven-remote-resources-plugin:1.5:process (default) @ hbase-procedure ---
[INFO] 
[INFO] --- maven-resources-plugin:2.6:resources (default-resources) @ hbase-procedure ---
[INFO] Using 'UTF-8' encoding to copy filtered resources.
[INFO] skip non existing resourceDirectory <https://builds.apache.org/job/HBase-Trunk_matrix/jdk=JDK%201.8%20(latest),label=yahoo-not-h2/ws/hbase-procedure/src/main/resources>
[INFO] Copying 3 resources
[INFO] 
[INFO] --- maven-compiler-plugin:3.2:compile (default-compile) @ hbase-procedure ---
[INFO] Nothing to compile - all classes are up to date
[INFO] 
[INFO] --- maven-resources-plugin:2.6:testResources (default-testResources) @ hbase-procedure
---
[INFO] Using 'UTF-8' encoding to copy filtered resources.
[INFO] Copying 2 resources
[INFO] Copying 3 resources
[INFO] 
[INFO] --- maven-compiler-plugin:3.2:testCompile (default-testCompile) @ hbase-procedure ---
[INFO] Nothing to compile - all classes are up to date
[INFO] 
[INFO] --- maven-surefire-plugin:2.18.1:test (default-test) @ hbase-procedure ---
[INFO] Surefire report directory: <https://builds.apache.org/job/HBase-Trunk_matrix/jdk=JDK%201.8%20(latest),label=yahoo-not-h2/ws/hbase-procedure/target/surefire-reports>
[INFO] Using configured provider org.apache.maven.surefire.junitcore.JUnitCoreProvider
[INFO] parallel='none', perCoreThreadCount=true, threadCount=0, useUnlimitedThreads=false,
threadCountSuites=0, threadCountClasses=0, threadCountMethods=0, parallelOptimized=true

-------------------------------------------------------
 T E S T S
-------------------------------------------------------
Java HotSpot(TM) 64-Bit Server VM warning: ignoring option MaxPermSize=256m; support was removed
in 8.0
Running org.apache.hadoop.hbase.procedure2.TestProcedureToString
Tests run: 2, Failures: 0, Errors: 0, Skipped: 0, Time elapsed: 0.122 sec - in org.apache.hadoop.hbase.procedure2.TestProcedureToString
Java HotSpot(TM) 64-Bit Server VM warning: ignoring option MaxPermSize=256m; support was removed
in 8.0
Java HotSpot(TM) 64-Bit Server VM warning: ignoring option MaxPermSize=256m; support was removed
in 8.0
Running org.apache.hadoop.hbase.procedure2.store.TestProcedureStoreTracker
Tests run: 9, Failures: 0, Errors: 0, Skipped: 0, Time elapsed: 71.776 sec - in org.apache.hadoop.hbase.procedure2.store.TestProcedureStoreTracker
Java HotSpot(TM) 64-Bit Server VM warning: ignoring option MaxPermSize=256m; support was removed
in 8.0
Java HotSpot(TM) 64-Bit Server VM warning: ignoring option MaxPermSize=256m; support was removed
in 8.0
Java HotSpot(TM) 64-Bit Server VM warning: ignoring option MaxPermSize=256m; support was removed
in 8.0
Running org.apache.hadoop.hbase.procedure2.TestProcedureInMemoryChore
Tests run: 2, Failures: 0, Errors: 2, Skipped: 0, Time elapsed: 0.285 sec <<< FAILURE!
- in org.apache.hadoop.hbase.procedure2.TestProcedureInMemoryChore
testChoreAddAndRemove(org.apache.hadoop.hbase.procedure2.TestProcedureInMemoryChore)  Time
elapsed: 0.285 sec  <<< ERROR!
java.lang.RuntimeException: hbase-default.xml file seems to be for an older version of HBase
(2.0.0-SNAPSHOT), this version is Unknown
	at org.apache.hadoop.hbase.HBaseConfiguration.checkDefaultsVersion(HBaseConfiguration.java:73)
	at org.apache.hadoop.hbase.HBaseConfiguration.addHbaseResources(HBaseConfiguration.java:83)
	at org.apache.hadoop.hbase.HBaseConfiguration.create(HBaseConfiguration.java:98)
	at org.apache.hadoop.hbase.HBaseCommonTestingUtility.<init>(HBaseCommonTestingUtility.java:46)
	at org.apache.hadoop.hbase.procedure2.TestProcedureInMemoryChore.setUp(TestProcedureInMemoryChore.java:54)

testChoreAddAndRemove(org.apache.hadoop.hbase.procedure2.TestProcedureInMemoryChore)  Time
elapsed: 0.285 sec  <<< ERROR!
java.lang.NullPointerException: null
	at org.apache.hadoop.hbase.procedure2.TestProcedureInMemoryChore.tearDown(TestProcedureInMemoryChore.java:66)


Results :

Tests in error: 
org.apache.hadoop.hbase.procedure2.TestProcedureInMemoryChore.testChoreAddAndRemove(org.apache.hadoop.hbase.procedure2.TestProcedureInMemoryChore)
  Run 1: TestProcedureInMemoryChore.setUp:54 » Runtime hbase-default.xml file seems to ...
  Run 2: TestProcedureInMemoryChore.tearDown:66 NullPointer


Tests run: 12, Failures: 0, Errors: 1, Skipped: 0

[INFO] ------------------------------------------------------------------------
[INFO] Reactor Summary:
[INFO] 
[INFO] Apache HBase ...................................... SUCCESS [2.288s]
[INFO] Apache HBase - Checkstyle ......................... SUCCESS [0.995s]
[INFO] Apache HBase - Resource Bundle .................... SUCCESS [0.187s]
[INFO] Apache HBase - Annotations ........................ SUCCESS [0.188s]
[INFO] Apache HBase - Protocol ........................... SUCCESS [2.888s]
[INFO] Apache HBase - Common ............................. SUCCESS [1:26.047s]
[INFO] Apache HBase - Procedure .......................... FAILURE [1:15.861s]
[INFO] Apache HBase - Client ............................. SKIPPED
[INFO] Apache HBase - Hadoop Compatibility ............... SKIPPED
[INFO] Apache HBase - Hadoop Two Compatibility ........... SKIPPED
[INFO] Apache HBase - Prefix Tree ........................ SKIPPED
[INFO] Apache HBase - Server ............................. SKIPPED
[INFO] Apache HBase - Testing Util ....................... SKIPPED
[INFO] Apache HBase - Thrift ............................. SKIPPED
[INFO] Apache HBase - RSGroup ............................ SKIPPED
[INFO] Apache HBase - Shell .............................. SKIPPED
[INFO] Apache HBase - Integration Tests .................. SKIPPED
[INFO] Apache HBase - Examples ........................... SKIPPED
[INFO] Apache HBase - Rest ............................... SKIPPED
[INFO] Apache HBase - External Block Cache ............... SKIPPED
[INFO] Apache HBase - Spark .............................. SKIPPED
[INFO] Apache HBase - Assembly ........................... SKIPPED
[INFO] Apache HBase - Shaded ............................. SKIPPED
[INFO] Apache HBase - Shaded - Client .................... SKIPPED
[INFO] Apache HBase - Shaded - Server .................... SKIPPED
[INFO] Apache HBase - Archetypes ......................... SKIPPED
[INFO] Apache HBase - Exemplar for hbase-client archetype  SKIPPED
[INFO] Apache HBase - Exemplar for hbase-shaded-client archetype  SKIPPED
[INFO] Apache HBase - Archetype builder .................. SKIPPED
[INFO] ------------------------------------------------------------------------
[INFO] BUILD FAILURE
[INFO] ------------------------------------------------------------------------
[INFO] Total time: 2:49.786s
[INFO] Finished at: Fri Sep 02 13:43:41 UTC 2016
[INFO] Final Memory: 52M/1173M
[INFO] ------------------------------------------------------------------------
[ERROR] Failed to execute goal org.apache.maven.plugins:maven-surefire-plugin:2.18.1:test
(default-test) on project hbase-procedure: There are test failures.
[ERROR] 
[ERROR] Please refer to <https://builds.apache.org/job/HBase-Trunk_matrix/jdk=JDK%201.8%20(latest),label=yahoo-not-h2/ws/hbase-procedure/target/surefire-reports>
for the individual test results.
[ERROR] -> [Help 1]
[ERROR] 
[ERROR] To see the full stack trace of the errors, re-run Maven with the -e switch.
[ERROR] Re-run Maven using the -X switch to enable full debug logging.
[ERROR] 
[ERROR] For more information about the errors and possible solutions, please read the following
articles:
[ERROR] [Help 1] http://cwiki.apache.org/confluence/display/MAVEN/MojoFailureException
[ERROR] 
[ERROR] After correcting the problems, you can resume the build with the command
[ERROR]   mvn <goals> -rf :hbase-procedure
Build step 'Invoke top-level Maven targets' marked build as failure
Performing Post build task...
Match found for :.* : True
Logical operation result is TRUE
Running script  : # Run zombie detector script
./dev-support/zombie-detector.sh --jenkins ${BUILD_ID}
[yahoo-not-h2] $ /bin/bash -xe /tmp/hudson727622249070594388.sh
+ ./dev-support/zombie-detector.sh --jenkins 1527
Fri Sep  2 13:43:42 UTC 2016 We're ok: there is no zombie test


    {color:green}+1 zombies{color}. No zombie tests found running at the end of the build.
POST BUILD TASK : SUCCESS
END OF POST BUILD TASK : 0
Archiving artifacts
No prior successful build to compare, so performing full copy of artifacts
Recording test results
[FINDBUGS] Skipping publisher since build result is FAILURE
[CHECKSTYLE] Skipping publisher since build result is FAILURE

Mime
View raw message