hbase-builds mailing list archives

Site index · List index
Message view « Date » · « Thread »
Top « Date » · « Thread »
From Apache Jenkins Server <jenk...@builds.apache.org>
Subject Build failed in Jenkins: HBase-1.2-IT » IntegrationTestBigLinkedList,latest1.7,yahoo-not-h2 #568
Date Tue, 02 Aug 2016 19:28:15 GMT
See <https://builds.apache.org/job/HBase-1.2-IT/it.test=IntegrationTestBigLinkedList,jdk=latest1.7,label=yahoo-not-h2/568/changes>

Changes:

[jerryjch] HBASE-16284 Unauthorized client can shutdown the cluster (Deokwoo Han)

------------------------------------------
Started by upstream project "HBase-1.2-IT" build number 568
originally caused by:
 Started by an SCM change
[EnvInject] - Loading node environment variables.
Building remotely on H0 (Hadoop Tez yahoo-not-h2) in workspace <https://builds.apache.org/job/HBase-1.2-IT/it.test=IntegrationTestBigLinkedList,jdk=latest1.7,label=yahoo-not-h2/ws/>
Cloning the remote Git repository
Cloning repository https://git-wip-us.apache.org/repos/asf/hbase.git
 > git init <https://builds.apache.org/job/HBase-1.2-IT/it.test=IntegrationTestBigLinkedList,jdk=latest1.7,label=yahoo-not-h2/ws/>
# timeout=10
Fetching upstream changes from https://git-wip-us.apache.org/repos/asf/hbase.git
 > git --version # timeout=10
 > git -c core.askpass=true fetch --tags --progress https://git-wip-us.apache.org/repos/asf/hbase.git
+refs/heads/*:refs/remotes/origin/*
 > git config remote.origin.url https://git-wip-us.apache.org/repos/asf/hbase.git # timeout=10
 > git config --add remote.origin.fetch +refs/heads/*:refs/remotes/origin/* # timeout=10
 > git config remote.origin.url https://git-wip-us.apache.org/repos/asf/hbase.git # timeout=10
Fetching upstream changes from https://git-wip-us.apache.org/repos/asf/hbase.git
 > git -c core.askpass=true fetch --tags --progress https://git-wip-us.apache.org/repos/asf/hbase.git
+refs/heads/*:refs/remotes/origin/*
Checking out Revision db3b27f6b5b79fe147754d8c51c0303f1967f549 (refs/remotes/origin/branch-1.2)
 > git config core.sparsecheckout # timeout=10
 > git checkout -f db3b27f6b5b79fe147754d8c51c0303f1967f549
 > git rev-list ead083f3b6f75b31bfead11bf24cfd2c896dcd32 # timeout=10
[yahoo-not-h2] $ /bin/bash -xe /tmp/hudson2830349843374817953.sh
+ which java
/home/jenkins/jenkins-slave/tools/hudson.model.JDK/latest1.7/bin/java
+ java -version
java version "1.7.0_80"
Java(TM) SE Runtime Environment (build 1.7.0_80-b15)
Java HotSpot(TM) 64-Bit Server VM (build 24.80-b11, mixed mode)
+ ulimit -a
core file size          (blocks, -c) 0
data seg size           (kbytes, -d) unlimited
scheduling priority             (-e) 0
file size               (blocks, -f) unlimited
pending signals                 (-i) 386178
max locked memory       (kbytes, -l) 64
max memory size         (kbytes, -m) unlimited
open files                      (-n) 60000
pipe size            (512 bytes, -p) 8
POSIX message queues     (bytes, -q) 819200
real-time priority              (-r) 0
stack size              (kbytes, -s) 8192
cpu time               (seconds, -t) unlimited
max user processes              (-u) 10240
virtual memory          (kbytes, -v) unlimited
file locks                      (-x) unlimited
+ rm -rf /tmp/hbase-jenkins/hbase
[yahoo-not-h2] $ /home/jenkins/jenkins-slave/tools/hudson.tasks.Maven_MavenInstallation/Maven_3.0.5/bin/mvn
-Dit.test=IntegrationTestBigLinkedList -Dlabel=yahoo-not-h2 -Djdk=latest1.7 -Dmaven.repo.local=<https://builds.apache.org/job/HBase-1.2-IT/it.test=IntegrationTestBigLinkedList,jdk=latest1.7,label=yahoo-not-h2/ws/.repository>
-Dtest=NoUnitTests clean package verify
[WARNING] 
[WARNING] Some problems were encountered while building the effective settings
[WARNING] Failed to use environment variables for interpolation: Cannot run program "env":
error=11, Resource temporarily unavailable @ 
[WARNING] 
[INFO] Scanning for projects...
[ERROR] unable to create new native thread -> [Help 1]
[ERROR] 
[ERROR] To see the full stack trace of the errors, re-run Maven with the -e switch.
[ERROR] Re-run Maven using the -X switch to enable full debug logging.
[ERROR] 
[ERROR] For more information about the errors and possible solutions, please read the following
articles:
[ERROR] [Help 1] http://cwiki.apache.org/confluence/display/MAVEN/OutOfMemoryError
Build step 'Invoke top-level Maven targets' marked build as failure
Performing Post build task...
Match found for :.* : True
Logical operation result is TRUE
Running script  : # Post-build task script. TODO: Check this in and have all builds reference
check-in.
pwd && ls
# NOTE!!!! The below code has been copied and pasted from ./dev-tools/run-test.sh
# Do not change here without syncing there and vice-versa.
ZOMBIE_TESTS_COUNT=`jps -v | grep surefirebooter | grep -e '-Dhbase.test' | wc -l`
if [[ $ZOMBIE_TESTS_COUNT != 0 ]] ; then
 echo "Suspicious java process found - waiting 30s to see if there are just slow to stop"
 sleep 30
 ZOMBIE_TESTS_COUNT=`jps -v | grep surefirebooter | grep -e '-Dhbase.test' | wc -l`
 if [[ $ZOMBIE_TESTS_COUNT != 0 ]] ; then
   echo " {color:red}There appear to be $ZOMBIE_TESTS_COUNT zombie tests{color}, they should
have been killed by surefire but survived"
   jps -v | grep surefirebooter | grep -e '-Dhbase.test'
   jps -v | grep surefirebooter | grep -e '-Dhbase.test' | cut -d ' ' -f 1 | xargs -n 1 jstack
   # Exit with error
   exit 1
 else
   echo "We're ok: there is no zombie test, but some tests took some time to stop"
 fi
else
  echo "We're ok: there is no zombie test"
fi
[yahoo-not-h2] $ /bin/bash -xe /tmp/hudson94889080741772091.sh
+ pwd
<https://builds.apache.org/job/HBase-1.2-IT/it.test=IntegrationTestBigLinkedList,jdk=latest1.7,label=yahoo-not-h2/ws/>
+ ls
bin
CHANGES.txt
conf
dev-support
hbase-annotations
hbase-assembly
hbase-checkstyle
hbase-client
hbase-common
hbase-examples
hbase-external-blockcache
hbase-hadoop2-compat
hbase-hadoop-compat
hbase-it
hbase-native-client
hbase-prefix-tree
hbase-procedure
hbase-protocol
hbase-resource-bundle
hbase-rest
hbase-server
hbase-shaded
hbase-shell
hbase-testing-util
hbase-thrift
LICENSE.txt
NOTICE.txt
pom.xml
README.txt
src
++ jps -v
++ grep surefirebooter
++ grep -e -Dhbase.test
++ wc -l
+ ZOMBIE_TESTS_COUNT=0
+ [[ 0 != 0 ]]
+ echo 'We'\''re ok: there is no zombie test'
We're ok: there is no zombie test
POST BUILD TASK : SUCCESS
END OF POST BUILD TASK : 0
Archiving artifacts

Mime
View raw message