hbase-builds mailing list archives

Site index · List index
Message view « Date » · « Thread »
Top « Date » · « Thread »
From Apache Jenkins Server <jenk...@builds.apache.org>
Subject Build failed in Jenkins: HBase-Trunk_matrix » JDK 1.8 (latest),yahoo-not-h2 #1445
Date Fri, 19 Aug 2016 21:41:28 GMT
See <https://builds.apache.org/job/HBase-Trunk_matrix/jdk=JDK%201.8%20(latest),label=yahoo-not-h2/1445/changes>

Changes:

[apurtell] HBASE-7621 REST client (RemoteHTable) doesn't support binary row keys

------------------------------------------
[...truncated 5170 lines...]
java.lang.NullPointerException: null
	at org.apache.hadoop.hbase.procedure2.TestProcedureExecution.tearDown(TestProcedureExecution.java:75)

testAbortTimeoutWithChildren(org.apache.hadoop.hbase.procedure2.TestProcedureExecution)  Time
elapsed: 0.013 sec  <<< ERROR!
java.lang.RuntimeException: hbase-default.xml file seems to be for an older version of HBase
(2.0.0-SNAPSHOT), this version is Unknown
	at org.apache.hadoop.hbase.HBaseConfiguration.checkDefaultsVersion(HBaseConfiguration.java:73)
	at org.apache.hadoop.hbase.HBaseConfiguration.addHbaseResources(HBaseConfiguration.java:83)
	at org.apache.hadoop.hbase.HBaseConfiguration.create(HBaseConfiguration.java:98)
	at org.apache.hadoop.hbase.HBaseCommonTestingUtility.<init>(HBaseCommonTestingUtility.java:46)
	at org.apache.hadoop.hbase.procedure2.TestProcedureExecution.setUp(TestProcedureExecution.java:61)

testAbortTimeoutWithChildren(org.apache.hadoop.hbase.procedure2.TestProcedureExecution)  Time
elapsed: 0.013 sec  <<< ERROR!
java.lang.NullPointerException: null
	at org.apache.hadoop.hbase.procedure2.TestProcedureExecution.tearDown(TestProcedureExecution.java:75)


Results :

Tests in error: 
org.apache.hadoop.hbase.procedure2.TestChildProcedures.testChildLoad(org.apache.hadoop.hbase.procedure2.TestChildProcedures)
  Run 1: TestChildProcedures.setUp:58 » Runtime hbase-default.xml file seems to be for ...
  Run 2: TestChildProcedures.tearDown:74 NullPointer

org.apache.hadoop.hbase.procedure2.TestChildProcedures.testChildLoadWithSteppedRestart(org.apache.hadoop.hbase.procedure2.TestChildProcedures)
  Run 1: TestChildProcedures.setUp:58 » Runtime hbase-default.xml file seems to be for ...
  Run 2: TestChildProcedures.tearDown:74 NullPointer

org.apache.hadoop.hbase.procedure2.TestChildProcedures.testChildRollbackLoad(org.apache.hadoop.hbase.procedure2.TestChildProcedures)
  Run 1: TestChildProcedures.setUp:58 » Runtime hbase-default.xml file seems to be for ...
  Run 2: TestChildProcedures.tearDown:74 NullPointer

org.apache.hadoop.hbase.procedure2.TestChildProcedures.testChildRollbackLoadWithSteppedRestart(org.apache.hadoop.hbase.procedure2.TestChildProcedures)
  Run 1: TestChildProcedures.setUp:58 » Runtime hbase-default.xml file seems to be for ...
  Run 2: TestChildProcedures.tearDown:74 NullPointer

org.apache.hadoop.hbase.procedure2.TestProcedureExecution.testAbortTimeout(org.apache.hadoop.hbase.procedure2.TestProcedureExecution)
  Run 1: TestProcedureExecution.setUp:61 » Runtime hbase-default.xml file seems to be f...
  Run 2: TestProcedureExecution.tearDown:75 NullPointer

org.apache.hadoop.hbase.procedure2.TestProcedureExecution.testAbortTimeoutWithChildren(org.apache.hadoop.hbase.procedure2.TestProcedureExecution)
  Run 1: TestProcedureExecution.setUp:61 » Runtime hbase-default.xml file seems to be f...
  Run 2: TestProcedureExecution.tearDown:75 NullPointer

org.apache.hadoop.hbase.procedure2.TestProcedureExecution.testBadSubprocList(org.apache.hadoop.hbase.procedure2.TestProcedureExecution)
  Run 1: TestProcedureExecution.setUp:61 » Runtime hbase-default.xml file seems to be f...
  Run 2: TestProcedureExecution.tearDown:75 NullPointer

org.apache.hadoop.hbase.procedure2.TestProcedureExecution.testRollbackRetriableFailure(org.apache.hadoop.hbase.procedure2.TestProcedureExecution)
  Run 1: TestProcedureExecution.setUp:61 » Runtime hbase-default.xml file seems to be f...
  Run 2: TestProcedureExecution.tearDown:75 NullPointer

org.apache.hadoop.hbase.procedure2.TestProcedureExecution.testSingleSequentialProc(org.apache.hadoop.hbase.procedure2.TestProcedureExecution)
  Run 1: TestProcedureExecution.setUp:61 » Runtime hbase-default.xml file seems to be f...
  Run 2: TestProcedureExecution.tearDown:75 NullPointer

org.apache.hadoop.hbase.procedure2.TestProcedureExecution.testSingleSequentialProcRollback(org.apache.hadoop.hbase.procedure2.TestProcedureExecution)
  Run 1: TestProcedureExecution.setUp:61 » Runtime hbase-default.xml file seems to be f...
  Run 2: TestProcedureExecution.tearDown:75 NullPointer

org.apache.hadoop.hbase.procedure2.TestProcedureRecovery.testCompletedProcWithSameNonce(org.apache.hadoop.hbase.procedure2.TestProcedureRecovery)
  Run 1: TestProcedureRecovery.setUp:67 » Runtime hbase-default.xml file seems to be fo...
  Run 2: TestProcedureRecovery.tearDown:84 NullPointer

org.apache.hadoop.hbase.procedure2.TestProcedureRecovery.testMultiStepProcRecovery(org.apache.hadoop.hbase.procedure2.TestProcedureRecovery)
  Run 1: TestProcedureRecovery.setUp:67 » Runtime hbase-default.xml file seems to be fo...
  Run 2: TestProcedureRecovery.tearDown:84 NullPointer

org.apache.hadoop.hbase.procedure2.TestProcedureRecovery.testMultiStepRollbackRecovery(org.apache.hadoop.hbase.procedure2.TestProcedureRecovery)
  Run 1: TestProcedureRecovery.setUp:67 » Runtime hbase-default.xml file seems to be fo...
  Run 2: TestProcedureRecovery.tearDown:84 NullPointer

org.apache.hadoop.hbase.procedure2.TestProcedureRecovery.testNoopLoad(org.apache.hadoop.hbase.procedure2.TestProcedureRecovery)
  Run 1: TestProcedureRecovery.setUp:67 » Runtime hbase-default.xml file seems to be fo...
  Run 2: TestProcedureRecovery.tearDown:84 NullPointer

org.apache.hadoop.hbase.procedure2.TestProcedureRecovery.testRunningProcWithSameNonce(org.apache.hadoop.hbase.procedure2.TestProcedureRecovery)
  Run 1: TestProcedureRecovery.setUp:67 » Runtime hbase-default.xml file seems to be fo...
  Run 2: TestProcedureRecovery.tearDown:84 NullPointer

org.apache.hadoop.hbase.procedure2.TestProcedureRecovery.testSingleStepProcRecovery(org.apache.hadoop.hbase.procedure2.TestProcedureRecovery)
  Run 1: TestProcedureRecovery.setUp:67 » Runtime hbase-default.xml file seems to be fo...
  Run 2: TestProcedureRecovery.tearDown:84 NullPointer

org.apache.hadoop.hbase.procedure2.TestProcedureRecovery.testStateMachineMultipleLevel(org.apache.hadoop.hbase.procedure2.TestProcedureRecovery)
  Run 1: TestProcedureRecovery.setUp:67 » Runtime hbase-default.xml file seems to be fo...
  Run 2: TestProcedureRecovery.tearDown:84 NullPointer

org.apache.hadoop.hbase.procedure2.TestProcedureRecovery.testStateMachineRecovery(org.apache.hadoop.hbase.procedure2.TestProcedureRecovery)
  Run 1: TestProcedureRecovery.setUp:67 » Runtime hbase-default.xml file seems to be fo...
  Run 2: TestProcedureRecovery.tearDown:84 NullPointer

org.apache.hadoop.hbase.procedure2.TestProcedureRecovery.testStateMachineRollbackRecovery(org.apache.hadoop.hbase.procedure2.TestProcedureRecovery)
  Run 1: TestProcedureRecovery.setUp:67 » Runtime hbase-default.xml file seems to be fo...
  Run 2: TestProcedureRecovery.tearDown:84 NullPointer

org.apache.hadoop.hbase.procedure2.TestYieldProcedures.testYieldEachExecutionStep(org.apache.hadoop.hbase.procedure2.TestYieldProcedures)
  Run 1: TestYieldProcedures.setUp:63 » Runtime hbase-default.xml file seems to be for ...
  Run 2: TestYieldProcedures.tearDown:79 NullPointer

org.apache.hadoop.hbase.procedure2.TestYieldProcedures.testYieldException(org.apache.hadoop.hbase.procedure2.TestYieldProcedures)
  Run 1: TestYieldProcedures.setUp:63 » Runtime hbase-default.xml file seems to be for ...
  Run 2: TestYieldProcedures.tearDown:79 NullPointer

org.apache.hadoop.hbase.procedure2.TestYieldProcedures.testYieldOnInterrupt(org.apache.hadoop.hbase.procedure2.TestYieldProcedures)
  Run 1: TestYieldProcedures.setUp:63 » Runtime hbase-default.xml file seems to be for ...
  Run 2: TestYieldProcedures.tearDown:79 NullPointer

org.apache.hadoop.hbase.procedure2.store.wal.TestWALProcedureStore.testCorruptedEntries(org.apache.hadoop.hbase.procedure2.store.wal.TestWALProcedureStore)
  Run 1: TestWALProcedureStore.setUp:77 » Runtime hbase-default.xml file seems to be fo...
  Run 2: TestWALProcedureStore.tearDown:91 NullPointer

org.apache.hadoop.hbase.procedure2.store.wal.TestWALProcedureStore.testCorruptedProcedures(org.apache.hadoop.hbase.procedure2.store.wal.TestWALProcedureStore)
  Run 1: TestWALProcedureStore.setUp:77 » Runtime hbase-default.xml file seems to be fo...
  Run 2: TestWALProcedureStore.tearDown:91 NullPointer

org.apache.hadoop.hbase.procedure2.store.wal.TestWALProcedureStore.testCorruptedTrailer(org.apache.hadoop.hbase.procedure2.store.wal.TestWALProcedureStore)
  Run 1: TestWALProcedureStore.setUp:77 » Runtime hbase-default.xml file seems to be fo...
  Run 2: TestWALProcedureStore.tearDown:91 NullPointer

org.apache.hadoop.hbase.procedure2.store.wal.TestWALProcedureStore.testEmptyLogLoad(org.apache.hadoop.hbase.procedure2.store.wal.TestWALProcedureStore)
  Run 1: TestWALProcedureStore.setUp:77 » Runtime hbase-default.xml file seems to be fo...
  Run 2: TestWALProcedureStore.tearDown:91 NullPointer

org.apache.hadoop.hbase.procedure2.store.wal.TestWALProcedureStore.testEmptyRoll(org.apache.hadoop.hbase.procedure2.store.wal.TestWALProcedureStore)
  Run 1: TestWALProcedureStore.setUp:77 » Runtime hbase-default.xml file seems to be fo...
  Run 2: TestWALProcedureStore.tearDown:91 NullPointer

org.apache.hadoop.hbase.procedure2.store.wal.TestWALProcedureStore.testFileNotFoundDuringLeaseRecovery(org.apache.hadoop.hbase.procedure2.store.wal.TestWALProcedureStore)
  Run 1: TestWALProcedureStore.setUp:77 » Runtime hbase-default.xml file seems to be fo...
  Run 2: TestWALProcedureStore.tearDown:91 NullPointer

org.apache.hadoop.hbase.procedure2.store.wal.TestWALProcedureStore.testLoad(org.apache.hadoop.hbase.procedure2.store.wal.TestWALProcedureStore)
  Run 1: TestWALProcedureStore.setUp:77 » Runtime hbase-default.xml file seems to be fo...
  Run 2: TestWALProcedureStore.tearDown:91 NullPointer

org.apache.hadoop.hbase.procedure2.store.wal.TestWALProcedureStore.testNoTrailerDoubleRestart(org.apache.hadoop.hbase.procedure2.store.wal.TestWALProcedureStore)
  Run 1: TestWALProcedureStore.setUp:77 » Runtime hbase-default.xml file seems to be fo...
  Run 2: TestWALProcedureStore.tearDown:91 NullPointer

org.apache.hadoop.hbase.procedure2.store.wal.TestWALProcedureStore.testProcIdHoles(org.apache.hadoop.hbase.procedure2.store.wal.TestWALProcedureStore)
  Run 1: TestWALProcedureStore.setUp:77 » Runtime hbase-default.xml file seems to be fo...
  Run 2: TestWALProcedureStore.tearDown:91 NullPointer

org.apache.hadoop.hbase.procedure2.store.wal.TestWALProcedureStore.testRollAndRemove(org.apache.hadoop.hbase.procedure2.store.wal.TestWALProcedureStore)
  Run 1: TestWALProcedureStore.setUp:77 » Runtime hbase-default.xml file seems to be fo...
  Run 2: TestWALProcedureStore.tearDown:91 NullPointer

org.apache.hadoop.hbase.procedure2.store.wal.TestWALProcedureStore.testWalCleanerNoHoles(org.apache.hadoop.hbase.procedure2.store.wal.TestWALProcedureStore)
  Run 1: TestWALProcedureStore.setUp:77 » Runtime hbase-default.xml file seems to be fo...
  Run 2: TestWALProcedureStore.tearDown:91 NullPointer

org.apache.hadoop.hbase.procedure2.store.wal.TestWALProcedureStore.testWalCleanerSequentialClean(org.apache.hadoop.hbase.procedure2.store.wal.TestWALProcedureStore)
  Run 1: TestWALProcedureStore.setUp:77 » Runtime hbase-default.xml file seems to be fo...
  Run 2: TestWALProcedureStore.tearDown:91 NullPointer

org.apache.hadoop.hbase.procedure2.store.wal.TestWALProcedureStore.testWalCleanerUpdates(org.apache.hadoop.hbase.procedure2.store.wal.TestWALProcedureStore)
  Run 1: TestWALProcedureStore.setUp:77 » Runtime hbase-default.xml file seems to be fo...
  Run 2: TestWALProcedureStore.tearDown:91 NullPointer

org.apache.hadoop.hbase.procedure2.store.wal.TestWALProcedureStore.testWalCleanerUpdatesDontLeaveHoles(org.apache.hadoop.hbase.procedure2.store.wal.TestWALProcedureStore)
  Run 1: TestWALProcedureStore.setUp:77 » Runtime hbase-default.xml file seems to be fo...
  Run 2: TestWALProcedureStore.tearDown:91 NullPointer

org.apache.hadoop.hbase.procedure2.store.wal.TestWALProcedureStore.testWalReplayOrder_ABC_BAD(org.apache.hadoop.hbase.procedure2.store.wal.TestWALProcedureStore)
  Run 1: TestWALProcedureStore.setUp:77 » Runtime hbase-default.xml file seems to be fo...
  Run 2: TestWALProcedureStore.tearDown:91 NullPointer

org.apache.hadoop.hbase.procedure2.store.wal.TestWALProcedureStore.testWalReplayOrder_AB_A(org.apache.hadoop.hbase.procedure2.store.wal.TestWALProcedureStore)
  Run 1: TestWALProcedureStore.setUp:77 » Runtime hbase-default.xml file seems to be fo...
  Run 2: TestWALProcedureStore.tearDown:91 NullPointer

org.apache.hadoop.hbase.procedure2.store.wal.TestWALProcedureStore.trackersLoadedForAllOldLogs(org.apache.hadoop.hbase.procedure2.store.wal.TestWALProcedureStore)
  Run 1: TestWALProcedureStore.setUp:77 » Runtime hbase-default.xml file seems to be fo...
  Run 2: TestWALProcedureStore.tearDown:91 NullPointer


Tests run: 50, Failures: 0, Errors: 39, Skipped: 0

[INFO] ------------------------------------------------------------------------
[INFO] Reactor Summary:
[INFO] 
[INFO] Apache HBase ...................................... SUCCESS [1.800s]
[INFO] Apache HBase - Checkstyle ......................... SUCCESS [0.781s]
[INFO] Apache HBase - Resource Bundle .................... SUCCESS [0.154s]
[INFO] Apache HBase - Annotations ........................ SUCCESS [0.159s]
[INFO] Apache HBase - Protocol ........................... SUCCESS [2.646s]
[INFO] Apache HBase - Common ............................. SUCCESS [1:12.900s]
[INFO] Apache HBase - Procedure .......................... FAILURE [1:15.327s]
[INFO] Apache HBase - Client ............................. SKIPPED
[INFO] Apache HBase - Hadoop Compatibility ............... SKIPPED
[INFO] Apache HBase - Hadoop Two Compatibility ........... SKIPPED
[INFO] Apache HBase - Prefix Tree ........................ SKIPPED
[INFO] Apache HBase - Server ............................. SKIPPED
[INFO] Apache HBase - Testing Util ....................... SKIPPED
[INFO] Apache HBase - Thrift ............................. SKIPPED
[INFO] Apache HBase - RSGroup ............................ SKIPPED
[INFO] Apache HBase - Shell .............................. SKIPPED
[INFO] Apache HBase - Integration Tests .................. SKIPPED
[INFO] Apache HBase - Examples ........................... SKIPPED
[INFO] Apache HBase - Rest ............................... SKIPPED
[INFO] Apache HBase - External Block Cache ............... SKIPPED
[INFO] Apache HBase - Spark .............................. SKIPPED
[INFO] Apache HBase - Assembly ........................... SKIPPED
[INFO] Apache HBase - Shaded ............................. SKIPPED
[INFO] Apache HBase - Shaded - Client .................... SKIPPED
[INFO] Apache HBase - Shaded - Server .................... SKIPPED
[INFO] Apache HBase - Archetypes ......................... SKIPPED
[INFO] Apache HBase - Exemplar for hbase-client archetype  SKIPPED
[INFO] Apache HBase - Exemplar for hbase-shaded-client archetype  SKIPPED
[INFO] Apache HBase - Archetype builder .................. SKIPPED
[INFO] ------------------------------------------------------------------------
[INFO] BUILD FAILURE
[INFO] ------------------------------------------------------------------------
[INFO] Total time: 2:34.946s
[INFO] Finished at: Fri Aug 19 21:41:21 UTC 2016
[INFO] Final Memory: 52M/1129M
[INFO] ------------------------------------------------------------------------
[ERROR] Failed to execute goal org.apache.maven.plugins:maven-surefire-plugin:2.18.1:test
(default-test) on project hbase-procedure: There are test failures.
[ERROR] 
[ERROR] Please refer to <https://builds.apache.org/job/HBase-Trunk_matrix/jdk=JDK%201.8%20(latest),label=yahoo-not-h2/ws/hbase-procedure/target/surefire-reports>
for the individual test results.
[ERROR] -> [Help 1]
[ERROR] 
[ERROR] To see the full stack trace of the errors, re-run Maven with the -e switch.
[ERROR] Re-run Maven using the -X switch to enable full debug logging.
[ERROR] 
[ERROR] For more information about the errors and possible solutions, please read the following
articles:
[ERROR] [Help 1] http://cwiki.apache.org/confluence/display/MAVEN/MojoFailureException
[ERROR] 
[ERROR] After correcting the problems, you can resume the build with the command
[ERROR]   mvn <goals> -rf :hbase-procedure
Build step 'Invoke top-level Maven targets' marked build as failure
Performing Post build task...
Match found for :.* : True
Logical operation result is TRUE
Running script  : # Run zombie detector script
./dev-support/zombie-detector.sh --jenkins ${BUILD_ID}
[yahoo-not-h2] $ /bin/bash -xe /tmp/hudson1737898755035728748.sh
+ ./dev-support/zombie-detector.sh --jenkins 1445
Fri Aug 19 21:41:22 UTC 2016 We're ok: there is no zombie test


    {color:green}+1 zombies{color}. No zombie tests found running at the end of the build.
POST BUILD TASK : SUCCESS
END OF POST BUILD TASK : 0
Archiving artifacts
No prior successful build to compare, so performing full copy of artifacts
Recording test results
[FINDBUGS] Skipping publisher since build result is FAILURE
[CHECKSTYLE] Skipping publisher since build result is FAILURE

Mime
View raw message